ant-dev mailing list archives

Site index · List index
Message view « Date » · « Thread »
Top « Date » · « Thread »
From Diane Holt <hol...@apache.org>
Subject [GUMP] Test Failure - Ant
Date Tue, 21 Jan 2003 08:50:06 GMT
----------------------------------------------------
This email is autogenerated from the output from:
<http://cvs.apache.org/builds/gump/2003-01-21/test-ant.html>
----------------------------------------------------

Buildfile: build.xml

check_for_optional_packages:

xml-check:

dump-sys-properties:

run-which:
    [which] #---- BEGIN: Which report
    [which] Which.version=Which.java:($Revision: 1.4 $) WhichJar.java:($Revision: 1.3 $)
    [which] Which.special-note=No -projects provided, using DEFAULT_PROJECTS
    [which] java.version=1.4.1_01
    [which] file.encoding=ANSI_X3.4-1968
    [which] java.ext.dirs=/usr/java/j2sdk1.4.1_01/jre/lib/ext
    [which] java.class.path=/home/rubys/jakarta/xml-xerces2/java/build/xmlParserAPIs.jar:/home/rubys/jakarta/xml-xerces2/java/build/xercesImpl.jar:/home/rubys/jakarta/xml-xalan/java/build/xalan.jar:/home/rubys/jakarta/xml-commons/java/external/build/xml-apis.jar:.:/usr/java/j2sdk1.4.1_01/lib/tools.jar:/usr/java/j2sdk1.4.1_01/jre/lib/rt.jar:/usr/java/j2sdk1.4.1_01/lib/tools.jar:/home/rubys/jakarta/jakarta-ant/build/lib/ant-testutil.jar:/home/rubys/jakarta/xml-commons/java/build/which.jar:/home/rubys/jakarta/rhino/build/rhino_20030121/js.jar:/home/rubys/jakarta/beanshell/bsh-20030121.jar:/home/rubys/jakarta/beanshell/bsh-bsf-20030121.jar:/home/rubys/jakarta/beanshell/bsh-classpath-20030121.jar:/home/rubys/jakarta/beanshell/bsh-commands-20030121.jar:/home/rubys/jakarta/beanshell/bsh-core-20030121.jar:/home/rubys/jakarta/beanshell/bsh-reflect-20030121.jar:/home/rubys/jakarta/beanshell/bsh-util-20030121.jar:/home/rubys/jakarta/jakarta-commons/logging/dist/commons-logging.jar:/home/rubys/jakarta/jakarta-commons/logging/dist/com
    [which] mons-logging-api.jar:/home/rubys/jakarta/jakarta-ant/dist/lib/ant.jar:/home/rubys/jakarta/jakarta-ant/dist/lib/nodeps.jar:/home/rubys/jakarta/jakarta-ant/dist/lib/ant-junit.jar:/home/rubys/jakarta/jakarta-ant/dist/lib/ant-stylebook.jar:/home/rubys/jakarta/jakarta-ant/dist/lib/ant-swing.jar:/home/rubys/jakarta/jakarta-ant/dist/lib/ant-trax.jar:/home/rubys/jakarta/jakarta-ant/dist/lib/ant-xalan2.jar:/home/rubys/jakarta/jakarta-log4j/log4j-20030121.jar:/home/rubys/jakarta/xml-stylebook/bin/stylebook-1.0-b3_xalan-2.jar:/home/rubys/jakarta/jakarta-oro/jakarta-oro-20030121.jar:/home/rubys/jakarta/xml-commons/java/build/resolver.jar:/home/rubys/jakarta/jakarta-bcel/bin/bcel.jar:/opt/javamail-1.2/mail.jar:/opt/jaf-1.0.1/activation.jar:/home/rubys/jakarta/jakarta-bsf/src/bsf-2.3/build/lib/bsf.jar:/home/rubys/jakarta/jakarta-ant/build/lib/ant.jar:/home/rubys/jakarta/jakarta-ant/build/lib/nodeps.jar:/home/rubys/jakarta/jakarta-ant/build/lib/ant-antlr.jar:/home/rubys/jakarta/jakarta-ant/build/lib/ant-apache-resolver.jar:/
    [which] home/rubys/jakarta/jakarta-ant/build/lib/ant-bcel.jar:/home/rubys/jakarta/jakarta-ant/build/lib/ant-apache-bsf.jar:/home/rubys/jakarta/jakarta-ant/build/lib/ant-commons-logging.jar:/home/rubys/jakarta/jakarta-ant/build/lib/ant-jakarta-regexp.jar:/home/rubys/jakarta/jakarta-ant/build/lib/ant-javamail.jar:/home/rubys/jakarta/jakarta-ant/build/lib/ant-junit.jar:/home/rubys/jakarta/jakarta-ant/build/lib/ant-log4j.jar:/home/rubys/jakarta/jakarta-ant/build/lib/ant-oro.jar:/home/rubys/jakarta/jakarta-ant/build/lib/ant-stylebook.jar:/home/rubys/jakarta/jakarta-ant/build/lib/ant-swing.jar:/home/rubys/jakarta/jakarta-ant/build/lib/ant-trax.jar:/home/rubys/jakarta/jakarta-ant/build/lib/ant-xalan2.jar:/home/rubys/jakarta/jakarta-slide/lib/antlr-tools.jar:/home/rubys/jakarta/jakarta-slide/lib/antlr.jar:/home/rubys/jakarta/jakarta-ant/bootstrap/lib/ant.jar:/home/rubys/jakarta/jakarta-servletapi-4/lib/servlet.jar:/home/rubys/jakarta/dist/junit/junit.jar:/home/rubys/jakarta/jakarta-tomcat-4.0/dist/common/lib/jasper-compiler.j
    [which] ar:/home/rubys/jakarta/jakarta-tomcat-4.0/dist/common/lib/jasper-runtime.jar:/home/rubys/jakarta/jakarta-regexp/bin/jakarta-regexp-20030121.jar:/home/rubys/jakarta/jakarta-ant/build/testcases:/home/rubys/jakarta/jakarta-ant/src/testcases:/home/rubys/jakarta/jakarta-ant/src/etc/testcases
    [which] Which.status=.ok-present
    [which] os.name=Linux
    [which] java.vendor=Sun Microsystems Inc.
    [which] sun.boot.class.path=/home/rubys/jakarta/xml-commons/java/external/build/xml-apis.jar:/home/rubys/jakarta/xml-xalan/java/build/xalan.jar:/home/rubys/jakarta/xml-xerces2/java/build/xercesImpl.jar:/home/rubys/jakarta/xml-xerces2/java/build/xmlParserAPIs.jar:/usr/java/j2sdk1.4.1_01/jre/lib/rt.jar:/usr/java/j2sdk1.4.1_01/jre/lib/i18n.jar:/usr/java/j2sdk1.4.1_01/jre/lib/sunrsasign.jar:/usr/java/j2sdk1.4.1_01/jre/lib/jsse.jar:/usr/java/j2sdk1.4.1_01/jre/lib/jce.jar:/usr/java/j2sdk1.4.1_01/jre/lib/charsets.jar:/usr/java/j2sdk1.4.1_01/jre/classes
    [which] java.runtime.name=Java(TM) 2 Runtime Environment, Standard Edition
    [which] #---- BEGIN: Xalan.hashinfo
    [which] Xalan22+.version=Xalan Java 2.4.1
    [which] xml-apis.jar.path=/home/rubys/jakarta/xml-commons/java/external/build/xml-apis.jar
    [which] xml-apis.jar.unknown=/usr/java/j2sdk1.4.1_01/jre/lib/ext/xml-apis.jar does not
exist
    [which] Xalan1.version=.not-found
    [which] xml-apis.jar.ok-present=not from an official release, size:108866
    [which] xalan.jar.unknown=/usr/java/j2sdk1.4.1_01/jre/lib/ext/xalan.jar does not exist
    [which] xalan.jar.path=/home/rubys/jakarta/xml-xalan/java/build/xalan.jar
    [which] xalan.jar.ok-present=not from an official release, size:1278212
    [which] Xalan.status=.ok-present
    [which] Xalan2x.version=Xalan Java 2.4.1
    [which] #----   END: Xalan.hashinfo
    [which] #---- BEGIN: Crimson.hashinfo
    [which] crimson.jar.unknown=/usr/java/j2sdk1.4.1_01/jre/lib/ext/crimson.jar does not exist
    [which] Crimson.version=present-unknown-version
    [which] Crimson.status=.ok-present
    [which] #----   END: Crimson.hashinfo
    [which] #---- BEGIN: Xerces.hashinfo
    [which] xerces.jar.unknown=/usr/java/j2sdk1.4.1_01/jre/lib/ext/xerces.jar does not exist
    [which] xmlParserAPIs.jar.path=/home/rubys/jakarta/xml-xerces2/java/build/xmlParserAPIs.jar
    [which] xmlParserAPIs.jar.unknown=/usr/java/j2sdk1.4.1_01/jre/lib/ext/xmlParserAPIs.jar
does not exist
    [which] xmlParserAPIs.jar.ok-present=not from an official release, size:121291
    [which] xercesImpl.jar.path=/home/rubys/jakarta/xml-xerces2/java/build/xercesImpl.jar
    [which] Xerces.status=.ok-present
    [which] Xerces1.version=.not-found
    [which] xercesImpl.jar.unknown=/usr/java/j2sdk1.4.1_01/jre/lib/ext/xercesImpl.jar does
not exist
    [which] xercesImpl.jar.ok-present=not from an official release, size:888639
    [which] Xerces2.version=Xerces-J 2.2.1
    [which] #----   END: Xerces.hashinfo
    [which] #---- BEGIN: XmlCommons.hashinfo
    [which] dom.jar.unknown=/usr/java/j2sdk1.4.1_01/jre/lib/ext/dom.jar does not exist
    [which] XmlCommons.jaxp.version=1.1
    [which] sax.jar.unknown=/usr/java/j2sdk1.4.1_01/jre/lib/ext/sax.jar does not exist
    [which] XmlCommons.sax.version=2.0
    [which] xml-apis.jar.path=/home/rubys/jakarta/xml-commons/java/external/build/xml-apis.jar
    [which] xml-apis.jar.ok-present=not from an official release, size:108866
    [which] xml-apis.jar.unknown=/usr/java/j2sdk1.4.1_01/jre/lib/ext/xml-apis.jar does not
exist
    [which] XmlCommons.version=XmlCommons 1.0
    [which] XmlCommons.status=.ok-present
    [which] jaxp-api.jar.unknown=/usr/java/j2sdk1.4.1_01/jre/lib/ext/jaxp-api.jar does not
exist
    [which] XmlCommons.dom.version=2.0
    [which] jaxp.jar.unknown=/usr/java/j2sdk1.4.1_01/jre/lib/ext/jaxp.jar does not exist
    [which] #----   END: XmlCommons.hashinfo
    [which] #---- BEGIN: Ant.hashinfo
    [which] Ant.status=.ok-present
    [which] ant.jar.unknown=/usr/java/j2sdk1.4.1_01/jre/lib/ext/ant.jar does not exist
    [which] Ant.version=Apache Ant version 1.6alpha compiled on January 21 2003
    [which] ant.jar.path=/home/rubys/jakarta/jakarta-ant/dist/lib/ant.jar
    [which] ant.jar.ok-present=not from an official release, size:783662
    [which] #---- BEGIN: java.class.path.ant.jar.hashinfo
    [which] ant.jar.unknown=jar on classpath multiple times!
    [which] ant.jar.path=/home/rubys/jakarta/jakarta-ant/bootstrap/lib/ant.jar
    [which] ant.jar.ok-present=not from an official release, size:696207
    [which] #----   END: java.class.path.ant.jar.hashinfo
    [which] #----   END: Ant.hashinfo
    [which] #----   END: Which report

dump-info:

prepare:

build:
     [copy] Copying 2 files to /home/rubys/jakarta/jakarta-ant/build/classes

compile-tests:

probe-offline:

run-tests:
    [junit] Testsuite: org.apache.tools.ant.taskdefs.condition.ContainsTest
    [junit] Tests run: 1, Failures: 0, Errors: 0, Time elapsed: 0.002 sec

    [junit] Testsuite: org.apache.tools.ant.taskdefs.condition.EqualsTest
    [junit] Tests run: 2, Failures: 0, Errors: 0, Time elapsed: 0.001 sec

    [junit] Testsuite: org.apache.tools.ant.taskdefs.condition.IsReferenceTest
    [junit] Tests run: 3, Failures: 0, Errors: 0, Time elapsed: 0.246 sec

    [junit] Testsuite: org.apache.tools.ant.taskdefs.optional.depend.DependTest
    [junit] Tests run: 9, Failures: 0, Errors: 0, Time elapsed: 24.944 sec

    [junit] Testsuite: org.apache.tools.ant.taskdefs.optional.junit.JUnitTestRunnerTest
    [junit] Tests run: 5, Failures: 0, Errors: 0, Time elapsed: 0.028 sec

    [junit] Testsuite: org.apache.tools.ant.taskdefs.optional.junit.JUnitVersionHelperTest
    [junit] Tests run: 6, Failures: 0, Errors: 0, Time elapsed: 0.017 sec

    [junit] Testsuite: org.apache.tools.ant.taskdefs.optional.junit.JUnitReportTest
    [junit] Tests run: 1, Failures: 0, Errors: 0, Time elapsed: 1.469 sec

    [junit] Testsuite: org.apache.tools.ant.taskdefs.optional.metamata.MAuditParserTest
    [junit] Tests run: 3, Failures: 0, Errors: 0, Time elapsed: 0.022 sec

    [junit] Testsuite: org.apache.tools.ant.taskdefs.optional.perforce.P4ChangeTest
    [junit] Tests run: 2, Failures: 0, Errors: 0, Time elapsed: 0.06 sec

    [junit] Testsuite: org.apache.tools.ant.taskdefs.optional.sitraka.ClassPathLoaderTest
    [junit] Tests run: 1, Failures: 0, Errors: 0, Time elapsed: 3.249 sec

    [junit] ------------- Standard Output ---------------
    [junit] Processing /usr/java/j2sdk1.4.1_01/jre/lib/rt.jar
    [junit] 8253 classes loaded in 3220ms
    [junit] ------------- ---------------- ---------------
    [junit] Testsuite: org.apache.tools.ant.taskdefs.optional.sitraka.ClassFileTest
    [junit] Tests run: 1, Failures: 0, Errors: 0, Time elapsed: 0.051 sec

    [junit] Testsuite: org.apache.tools.ant.taskdefs.optional.sos.SOSTest
    [junit] Tests run: 11, Failures: 0, Errors: 0, Time elapsed: 0.569 sec

    [junit] Testsuite: org.apache.tools.ant.taskdefs.optional.EchoPropertiesTest
    [junit] Tests run: 12, Failures: 0, Errors: 0, Time elapsed: 0.315 sec

    [junit] ------------- Standard Output ---------------
    [junit] -- listing properties --
    [junit] java.runtime.name=Java(TM) 2 Runtime Environment, Stand...
    [junit] sun.boot.library.path=/usr/java/j2sdk1.4.1_01/jre/lib/i386
    [junit] java.vm.version=1.4.1_01-b01
    [junit] ant.java.version=1.4
    [junit] ant.file.test=/home/rubys/jakarta/jakarta-ant/src/e...
    [junit] java.vm.vendor=Sun Microsystems Inc.
    [junit] java.vendor.url=http://java.sun.com/
    [junit] path.separator=:
    [junit] java.vm.name=Java HotSpot(TM) Client VM
    [junit] file.encoding.pkg=sun.io
    [junit] user.country=US
    [junit] sun.os.patch.level=unknown
    [junit] java.vm.specification.name=Java Virtual Machine Specification
    [junit] user.dir=/home/rubys/jakarta/jakarta-ant
    [junit] java.runtime.version=1.4.1_01-b01
    [junit] java.awt.graphicsenv=sun.awt.X11GraphicsEnvironment
    [junit] basedir=/home/rubys/jakarta/jakarta-ant/src/e...
    [junit] java.endorsed.dirs=/usr/java/j2sdk1.4.1_01/jre/lib/endorsed
    [junit] os.arch=i386
    [junit] java.io.tmpdir=/tmp
    [junit] line.separator=

    [junit] java.vm.specification.vendor=Sun Microsystems Inc.
    [junit] os.name=Linux
    [junit] ant.home=${ant.home}
    [junit] sun.java2d.fontpath=
    [junit] ant.project.name=test
    [junit] java.library.path=/usr/java/j2sdk1.4.1_01/jre/lib/i386/...
    [junit] test.property=isSet
    [junit] java.specification.name=Java Platform API Specification
    [junit] java.class.version=48.0
    [junit] java.util.prefs.PreferencesFactory=java.util.prefs.FileSystemPreferences...
    [junit] os.version=2.4.18-3
    [junit] ant.file=/home/rubys/jakarta/jakarta-ant/src/e...
    [junit] user.home=/home/rubys
    [junit] b.set=false
    [junit] user.timezone=America/New_York
    [junit] java.awt.printerjob=sun.print.PSPrinterJob
    [junit] java.specification.version=1.4
    [junit] build.tests=build/testcases
    [junit] file.encoding=ANSI_X3.4-1968
    [junit] tests-classpath.value=/home/rubys/jakarta/jakarta-ant/build...
    [junit] user.name=rubys
    [junit] java.class.path=/home/rubys/jakarta/xml-xerces2/java/...
    [junit] java.vm.specification.version=1.0
    [junit] sun.arch.data.model=32
    [junit] java.home=/usr/java/j2sdk1.4.1_01/jre
    [junit] java.specification.vendor=Sun Microsystems Inc.
    [junit] user.language=en
    [junit] java.vm.info=mixed mode
    [junit] java.version=1.4.1_01
    [junit] java.ext.dirs=/usr/java/j2sdk1.4.1_01/jre/lib/ext
    [junit] sun.boot.class.path=/home/rubys/jakarta/xml-commons/java/...
    [junit] java.vendor=Sun Microsystems Inc.
    [junit] a.set=true
    [junit] file.separator=/
    [junit] java.vendor.url.bug=http://java.sun.com/cgi-bin/bugreport...
    [junit] sun.cpu.endian=little
    [junit] sun.io.unicode.encoding=UnicodeLittle
    [junit] sun.cpu.isalist=
    [junit] -- listing properties --
    [junit] java.runtime.name=Java(TM) 2 Runtime Environment, Stand...
    [junit] sun.boot.library.path=/usr/java/j2sdk1.4.1_01/jre/lib/i386
    [junit] java.vm.version=1.4.1_01-b01
    [junit] ant.java.version=1.4
    [junit] ant.file.test=/home/rubys/jakarta/jakarta-ant/src/e...
    [junit] java.vm.vendor=Sun Microsystems Inc.
    [junit] java.vendor.url=http://java.sun.com/
    [junit] path.separator=:
    [junit] java.vm.name=Java HotSpot(TM) Client VM
    [junit] file.encoding.pkg=sun.io
    [junit] user.country=US
    [junit] sun.os.patch.level=unknown
    [junit] java.vm.specification.name=Java Virtual Machine Specification
    [junit] user.dir=/home/rubys/jakarta/jakarta-ant
    [junit] java.runtime.version=1.4.1_01-b01
    [junit] java.awt.graphicsenv=sun.awt.X11GraphicsEnvironment
    [junit] basedir=/home/rubys/jakarta/jakarta-ant/src/e...
    [junit] java.endorsed.dirs=/usr/java/j2sdk1.4.1_01/jre/lib/endorsed
    [junit] os.arch=i386
    [junit] java.io.tmpdir=/tmp
    [junit] line.separator=

    [junit] java.vm.specification.vendor=Sun Microsystems Inc.
    [junit] os.name=Linux
    [junit] ant.home=${ant.home}
    [junit] sun.java2d.fontpath=
    [junit] ant.project.name=test
    [junit] java.library.path=/usr/java/j2sdk1.4.1_01/jre/lib/i386/...
    [junit] test.property=isSet
    [junit] java.specification.name=Java Platform API Specification
    [junit] java.class.version=48.0
    [junit] java.util.prefs.PreferencesFactory=java.util.prefs.FileSystemPreferences...
    [junit] os.version=2.4.18-3
    [junit] ant.file=/home/rubys/jakarta/jakarta-ant/src/e...
    [junit] user.home=/home/rubys
    [junit] b.set=false
    [junit] user.timezone=America/New_York
    [junit] java.awt.printerjob=sun.print.PSPrinterJob
    [junit] java.specification.version=1.4
    [junit] build.tests=build/testcases
    [junit] file.encoding=ANSI_X3.4-1968
    [junit] tests-classpath.value=/home/rubys/jakarta/jakarta-ant/build...
    [junit] user.name=rubys
    [junit] java.class.path=/home/rubys/jakarta/xml-xerces2/java/...
    [junit] java.vm.specification.version=1.0
    [junit] sun.arch.data.model=32
    [junit] java.home=/usr/java/j2sdk1.4.1_01/jre
    [junit] java.specification.vendor=Sun Microsystems Inc.
    [junit] user.language=en
    [junit] java.vm.info=mixed mode
    [junit] java.version=1.4.1_01
    [junit] java.ext.dirs=/usr/java/j2sdk1.4.1_01/jre/lib/ext
    [junit] sun.boot.class.path=/home/rubys/jakarta/xml-commons/java/...
    [junit] java.vendor=Sun Microsystems Inc.
    [junit] a.set=true
    [junit] file.separator=/
    [junit] java.vendor.url.bug=http://java.sun.com/cgi-bin/bugreport...
    [junit] sun.cpu.endian=little
    [junit] sun.io.unicode.encoding=UnicodeLittle
    [junit] sun.cpu.isalist=
    [junit] -- listing properties --
    [junit] java.runtime.name=Java(TM) 2 Runtime Environment, Stand...
    [junit] sun.boot.library.path=/usr/java/j2sdk1.4.1_01/jre/lib/i386
    [junit] java.vm.version=1.4.1_01-b01
    [junit] ant.java.version=1.4
    [junit] ant.file.test=/home/rubys/jakarta/jakarta-ant/src/e...
    [junit] java.vm.vendor=Sun Microsystems Inc.
    [junit] java.vendor.url=http://java.sun.com/
    [junit] path.separator=:
    [junit] java.vm.name=Java HotSpot(TM) Client VM
    [junit] file.encoding.pkg=sun.io
    [junit] user.country=US
    [junit] sun.os.patch.level=unknown
    [junit] java.vm.specification.name=Java Virtual Machine Specification
    [junit] user.dir=/home/rubys/jakarta/jakarta-ant
    [junit] java.runtime.version=1.4.1_01-b01
    [junit] java.awt.graphicsenv=sun.awt.X11GraphicsEnvironment
    [junit] basedir=/home/rubys/jakarta/jakarta-ant/src/e...
    [junit] java.endorsed.dirs=/usr/java/j2sdk1.4.1_01/jre/lib/endorsed
    [junit] os.arch=i386
    [junit] java.io.tmpdir=/tmp
    [junit] line.separator=

    [junit] java.vm.specification.vendor=Sun Microsystems Inc.
    [junit] os.name=Linux
    [junit] ant.home=${ant.home}
    [junit] sun.java2d.fontpath=
    [junit] ant.project.name=test
    [junit] java.library.path=/usr/java/j2sdk1.4.1_01/jre/lib/i386/...
    [junit] test.property=isSet
    [junit] java.specification.name=Java Platform API Specification
    [junit] java.class.version=48.0
    [junit] java.util.prefs.PreferencesFactory=java.util.prefs.FileSystemPreferences...
    [junit] os.version=2.4.18-3
    [junit] ant.file=/home/rubys/jakarta/jakarta-ant/src/e...
    [junit] user.home=/home/rubys
    [junit] b.set=false
    [junit] user.timezone=America/New_York
    [junit] java.awt.printerjob=sun.print.PSPrinterJob
    [junit] java.specification.version=1.4
    [junit] build.tests=build/testcases
    [junit] file.encoding=ANSI_X3.4-1968
    [junit] tests-classpath.value=/home/rubys/jakarta/jakarta-ant/build...
    [junit] user.name=rubys
    [junit] java.class.path=/home/rubys/jakarta/xml-xerces2/java/...
    [junit] java.vm.specification.version=1.0
    [junit] sun.arch.data.model=32
    [junit] java.home=/usr/java/j2sdk1.4.1_01/jre
    [junit] java.specification.vendor=Sun Microsystems Inc.
    [junit] user.language=en
    [junit] java.vm.info=mixed mode
    [junit] java.version=1.4.1_01
    [junit] java.ext.dirs=/usr/java/j2sdk1.4.1_01/jre/lib/ext
    [junit] sun.boot.class.path=/home/rubys/jakarta/xml-commons/java/...
    [junit] java.vendor=Sun Microsystems Inc.
    [junit] a.set=true
    [junit] file.separator=/
    [junit] java.vendor.url.bug=http://java.sun.com/cgi-bin/bugreport...
    [junit] sun.cpu.endian=little
    [junit] sun.io.unicode.encoding=UnicodeLittle
    [junit] sun.cpu.isalist=
    [junit] ------------- ---------------- ---------------
    [junit] Testsuite: org.apache.tools.ant.taskdefs.optional.ANTLRTest
    [junit] Tests run: 13, Failures: 0, Errors: 0, Time elapsed: 10.286 sec

    [junit] Testsuite: org.apache.tools.ant.taskdefs.optional.unix.SymlinkTest
    [junit] Tests run: 4, Failures: 0, Errors: 0, Time elapsed: 27.787 sec

    [junit] Testsuite: org.apache.tools.ant.taskdefs.optional.JspcTest
    [junit] Tests run: 6, Failures: 0, Errors: 0, Time elapsed: 6.952 sec

    [junit] Testsuite: org.apache.tools.ant.taskdefs.optional.PropertyFileTest
    [junit] Tests run: 2, Failures: 0, Errors: 0, Time elapsed: 0.085 sec

    [junit] Testsuite: org.apache.tools.ant.taskdefs.optional.ReplaceRegExpTest
    [junit] Tests run: 3, Failures: 0, Errors: 0, Time elapsed: 0.066 sec

    [junit] Testsuite: org.apache.tools.ant.taskdefs.optional.TraXLiaisonTest
    [junit] Tests run: 5, Failures: 0, Errors: 0, Time elapsed: 0.511 sec

    [junit] Testsuite: org.apache.tools.ant.taskdefs.optional.XmlValidateTest
    [junit] Tests run: 10, Failures: 0, Errors: 0, Time elapsed: 0.612 sec

    [junit] Testsuite: org.apache.tools.ant.taskdefs.optional.XsltTest
    [junit] Tests run: 5, Failures: 0, Errors: 0, Time elapsed: 0.464 sec

    [junit] Testsuite: org.apache.tools.ant.taskdefs.optional.XmlValidateCatalogTest
    [junit] Tests run: 2, Failures: 0, Errors: 0, Time elapsed: 0.055 sec

    [junit] Testsuite: org.apache.tools.ant.taskdefs.AbstractCvsTaskTest
    [junit] Tests run: 3, Failures: 0, Errors: 0, Time elapsed: 18.663 sec

    [junit] Testsuite: org.apache.tools.ant.taskdefs.AntStructureTest
    [junit] Tests run: 1, Failures: 0, Errors: 0, Time elapsed: 0.019 sec

    [junit] Testsuite: org.apache.tools.ant.taskdefs.AntTest
    [junit] Tests run: 22, Failures: 0, Errors: 0, Time elapsed: 1.691 sec

    [junit] Testsuite: org.apache.tools.ant.taskdefs.AvailableTest
    [junit] Tests run: 26, Failures: 0, Errors: 0, Time elapsed: 0.915 sec

    [junit] Testsuite: org.apache.tools.ant.taskdefs.BUnzip2Test
    [junit] Tests run: 1, Failures: 0, Errors: 0, Time elapsed: 1.744 sec

    [junit] Testsuite: org.apache.tools.ant.taskdefs.BZip2Test
    [junit] Tests run: 2, Failures: 0, Errors: 0, Time elapsed: 7.029 sec

    [junit] Testsuite: org.apache.tools.ant.taskdefs.BasenameTest
    [junit] Tests run: 9, Failures: 0, Errors: 0, Time elapsed: 0.115 sec

    [junit] Testsuite: org.apache.tools.ant.taskdefs.CVSPassTest
    [junit] Tests run: 5, Failures: 0, Errors: 0, Time elapsed: 0.091 sec

    [junit] Testsuite: org.apache.tools.ant.taskdefs.ChecksumTest
    [junit] Tests run: 4, Failures: 0, Errors: 0, Time elapsed: 0.131 sec

    [junit] Testsuite: org.apache.tools.ant.taskdefs.ConcatTest
    [junit] Tests run: 8, Failures: 0, Errors: 0, Time elapsed: 0.203 sec

    [junit] Testsuite: org.apache.tools.ant.taskdefs.ConditionTest
    [junit] Tests run: 38, Failures: 0, Errors: 0, Time elapsed: 0.929 sec

    [junit] Testsuite: org.apache.tools.ant.taskdefs.CopyTest
    [junit] Tests run: 6, Failures: 0, Errors: 0, Time elapsed: 8.163 sec

    [junit] Testsuite: org.apache.tools.ant.taskdefs.CopydirTest
    [junit] Tests run: 6, Failures: 0, Errors: 0, Time elapsed: 2.26 sec

    [junit] Testsuite: org.apache.tools.ant.taskdefs.CopyfileTest
    [junit] Tests run: 6, Failures: 0, Errors: 0, Time elapsed: 0.067 sec

    [junit] Testsuite: org.apache.tools.ant.taskdefs.DeleteTest
    [junit] Tests run: 3, Failures: 0, Errors: 0, Time elapsed: 0.422 sec

    [junit] Testsuite: org.apache.tools.ant.taskdefs.DeltreeTest
    [junit] Tests run: 2, Failures: 0, Errors: 0, Time elapsed: 0.019 sec

    [junit] Testsuite: org.apache.tools.ant.taskdefs.DependSetTest
    [junit] Tests run: 5, Failures: 0, Errors: 0, Time elapsed: 3.105 sec

    [junit] Testsuite: org.apache.tools.ant.taskdefs.DirnameTest
    [junit] Tests run: 5, Failures: 0, Errors: 0, Time elapsed: 0.054 sec

    [junit] Testsuite: org.apache.tools.ant.taskdefs.DynamicTest
    [junit] Tests run: 1, Failures: 0, Errors: 0, Time elapsed: 0.058 sec

    [junit] Testsuite: org.apache.tools.ant.taskdefs.EchoTest
    [junit] Tests run: 3, Failures: 0, Errors: 0, Time elapsed: 0.028 sec

    [junit] Testsuite: org.apache.tools.ant.taskdefs.ExecuteJavaTest
    [junit] Tests run: 2, Failures: 0, Errors: 0, Time elapsed: 7.528 sec

    [junit] Testsuite: org.apache.tools.ant.taskdefs.ExecuteWatchdogTest
    [junit] Tests run: 4, Failures: 0, Errors: 0, Time elapsed: 18.327 sec

    [junit] Testsuite: org.apache.tools.ant.taskdefs.FailTest
    [junit] Tests run: 5, Failures: 0, Errors: 0, Time elapsed: 0.054 sec

    [junit] Testsuite: org.apache.tools.ant.taskdefs.FilterTest
    [junit] Tests run: 9, Failures: 0, Errors: 0, Time elapsed: 0.141 sec

    [junit] Testsuite: org.apache.tools.ant.taskdefs.FixCrLfTest
    [junit] Tests run: 16, Failures: 0, Errors: 0, Time elapsed: 5.629 sec

    [junit] Testsuite: org.apache.tools.ant.taskdefs.GUnzipTest
    [junit] Tests run: 4, Failures: 0, Errors: 0, Time elapsed: 0.113 sec

    [junit] Testsuite: org.apache.tools.ant.taskdefs.GetTest
    [junit] Tests run: 6, Failures: 0, Errors: 0, Time elapsed: 0.544 sec

    [junit] Testsuite: org.apache.tools.ant.taskdefs.GzipTest
    [junit] Tests run: 6, Failures: 0, Errors: 0, Time elapsed: 0.073 sec

    [junit] Testsuite: org.apache.tools.ant.taskdefs.InitializeClassTest
    [junit] Tests run: 1, Failures: 0, Errors: 0, Time elapsed: 0.303 sec

    [junit] Testsuite: org.apache.tools.ant.taskdefs.InputTest
    [junit] Tests run: 5, Failures: 0, Errors: 0, Time elapsed: 0.058 sec

    [junit] Testsuite: org.apache.tools.ant.taskdefs.JarTest
    [junit] Tests run: 7, Failures: 0, Errors: 0, Time elapsed: 8.232 sec

    [junit] Testsuite: org.apache.tools.ant.taskdefs.JavaTest
    [junit] Tests run: 12, Failures: 0, Errors: 0, Time elapsed: 1.397 sec

    [junit] Testsuite: org.apache.tools.ant.taskdefs.JavacTest
    [junit] Tests run: 5, Failures: 0, Errors: 0, Time elapsed: 0.024 sec

    [junit] Testsuite: org.apache.tools.ant.taskdefs.LoadFileTest
    [junit] Tests run: 10, Failures: 0, Errors: 0, Time elapsed: 0.157 sec

    [junit] Testsuite: org.apache.tools.ant.taskdefs.LoadPropertiesTest
    [junit] Tests run: 1, Failures: 0, Errors: 0, Time elapsed: 0.026 sec

    [junit] Testsuite: org.apache.tools.ant.taskdefs.ManifestTest
    [junit] Tests run: 20, Failures: 0, Errors: 0, Time elapsed: 0.51 sec

    [junit] Testsuite: org.apache.tools.ant.taskdefs.MkdirTest
    [junit] Tests run: 3, Failures: 0, Errors: 0, Time elapsed: 0.027 sec

    [junit] Testsuite: org.apache.tools.ant.taskdefs.MoveTest
    [junit] Tests run: 2, Failures: 0, Errors: 0, Time elapsed: 0.026 sec

    [junit] Testsuite: org.apache.tools.ant.taskdefs.ParallelTest
    [junit] Tests run: 3, Failures: 0, Errors: 0, Time elapsed: 2.082 sec

    [junit] Testsuite: org.apache.tools.ant.taskdefs.PropertyTest
    [junit] Tests run: 6, Failures: 0, Errors: 0, Time elapsed: 0.085 sec

    [junit] Testsuite: org.apache.tools.ant.taskdefs.RenameTest
    [junit] Tests run: 4, Failures: 0, Errors: 0, Time elapsed: 0.046 sec

    [junit] Testsuite: org.apache.tools.ant.taskdefs.ReplaceTest
    [junit] Tests run: 8, Failures: 0, Errors: 0, Time elapsed: 0.09 sec

    [junit] Testsuite: org.apache.tools.ant.taskdefs.RmicTest
    [junit] Tests run: 2, Failures: 0, Errors: 0, Time elapsed: 0.01 sec

    [junit] Testsuite: org.apache.tools.ant.taskdefs.SQLExecTest
    [junit] Tests run: 2, Failures: 0, Errors: 0, Time elapsed: 0.175 sec

    [junit] Testsuite: org.apache.tools.ant.taskdefs.SleepTest
    [junit] Tests run: 6, Failures: 0, Errors: 0, Time elapsed: 4.087 sec

    [junit] Testsuite: org.apache.tools.ant.taskdefs.TStampTest
    [junit] Tests run: 4, Failures: 0, Errors: 0, Time elapsed: 0.011 sec

    [junit] Testsuite: org.apache.tools.ant.taskdefs.TarTest
    [junit] Tests run: 11, Failures: 0, Errors: 0, Time elapsed: 0.738 sec

    [junit] Testsuite: org.apache.tools.ant.taskdefs.TaskdefTest
    [junit] Tests run: 10, Failures: 0, Errors: 0, Time elapsed: 0.566 sec

    [junit] Testsuite: org.apache.tools.ant.taskdefs.TypedefTest
    [junit] Tests run: 6, Failures: 0, Errors: 0, Time elapsed: 0.353 sec

    [junit] Testsuite: org.apache.tools.ant.taskdefs.UntarTest
    [junit] Tests run: 7, Failures: 0, Errors: 0, Time elapsed: 1.105 sec

    [junit] Testsuite: org.apache.tools.ant.taskdefs.UnzipTest
    [junit] Tests run: 5, Failures: 0, Errors: 0, Time elapsed: 0.127 sec

    [junit] Testsuite: org.apache.tools.ant.taskdefs.WarTest
    [junit] Tests run: 1, Failures: 0, Errors: 0, Time elapsed: 0.08 sec

    [junit] Testsuite: org.apache.tools.ant.taskdefs.XmlPropertyTest
    [junit] Tests run: 12, Failures: 0, Errors: 0, Time elapsed: 0.268 sec

    [junit] Testsuite: org.apache.tools.ant.taskdefs.ZipTest
    [junit] Tests run: 11, Failures: 0, Errors: 0, Time elapsed: 11.275 sec

    [junit] Testsuite: org.apache.tools.ant.taskdefs.SignJarTest
    [junit] Tests run: 5, Failures: 0, Errors: 0, Time elapsed: 10.495 sec

    [junit] Testsuite: org.apache.tools.ant.taskdefs.ImportTest
    [junit] Tests run: 2, Failures: 1, Errors: 0, Time elapsed: 0.036 sec

    [junit] Testcase: testUnnamedNesting(org.apache.tools.ant.taskdefs.ImportTest):	FAILED
    [junit] Warnings logged when not expected: Duplicated project name in import. Project
unnamed-import defined first in /home/rubys/jakarta/jakarta-ant/src/etc/testcases/taskdefs/import/unnamedImport.xml
and again in /home/rubys/jakarta/jakarta-ant/src/etc/testcases/taskdefs/import/unnamed1.xmlDuplicated
project name in import. Project unnamed-import defined first in /home/rubys/jakarta/jakarta-ant/src/etc/testcases/taskdefs/import/unnamed1.xml
and again in /home/rubys/jakarta/jakarta-ant/src/etc/testcases/taskdefs/import/unnamed2.xml
    [junit] junit.framework.AssertionFailedError: Warnings logged when not expected: Duplicated
project name in import. Project unnamed-import defined first in /home/rubys/jakarta/jakarta-ant/src/etc/testcases/taskdefs/import/unnamedImport.xml
and again in /home/rubys/jakarta/jakarta-ant/src/etc/testcases/taskdefs/import/unnamed1.xmlDuplicated
project name in import. Project unnamed-import defined first in /home/rubys/jakarta/jakarta-ant/src/etc/testcases/taskdefs/import/unnamed1.xml
and again in /home/rubys/jakarta/jakarta-ant/src/etc/testcases/taskdefs/import/unnamed2.xml
    [junit] 	at junit.framework.Assert.fail(Assert.java:47)
    [junit] 	at junit.framework.Assert.assertTrue(Assert.java:20)
    [junit] 	at org.apache.tools.ant.taskdefs.ImportTest.testUnnamedNesting(ImportTest.java:83)
    [junit] 	at sun.reflect.NativeMethodAccessorImpl.invoke0(Native Method)
    [junit] 	at sun.reflect.NativeMethodAccessorImpl.invoke(NativeMethodAccessorImpl.java:39)
    [junit] 	at sun.reflect.DelegatingMethodAccessorImpl.invoke(DelegatingMethodAccessorImpl.java:25)
    [junit] 	at java.lang.reflect.Method.invoke(Method.java:324)
    [junit] 	at junit.framework.TestCase.runTest(TestCase.java:154)
    [junit] 	at junit.framework.TestCase.runBare(TestCase.java:127)
    [junit] 	at junit.framework.TestResult$1.protect(TestResult.java:106)
    [junit] 	at junit.framework.TestResult.runProtected(TestResult.java:124)
    [junit] 	at junit.framework.TestResult.run(TestResult.java:109)
    [junit] 	at junit.framework.TestCase.run(TestCase.java:118)
    [junit] 	at junit.framework.TestSuite.runTest(TestSuite.java:208)
    [junit] 	at junit.framework.TestSuite.run(TestSuite.java:203)
    [junit] 	at org.apache.tools.ant.taskdefs.optional.junit.JUnitTestRunner.run(JUnitTestRunner.java:323)
    [junit] 	at org.apache.tools.ant.taskdefs.optional.junit.JUnitTask.executeInVM(JUnitTask.java:809)
    [junit] 	at org.apache.tools.ant.taskdefs.optional.junit.JUnitTask.execute(JUnitTask.java:552)
    [junit] 	at org.apache.tools.ant.taskdefs.optional.junit.JUnitTask.execute(JUnitTask.java:528)
    [junit] 	at org.apache.tools.ant.UnknownElement.execute(UnknownElement.java:185)
    [junit] 	at org.apache.tools.ant.Task.perform(Task.java:348)
    [junit] 	at org.apache.tools.ant.Target.execute(Target.java:309)
    [junit] 	at org.apache.tools.ant.Target.performTasks(Target.java:336)
    [junit] 	at org.apache.tools.ant.Project.executeTarget(Project.java:1244)
    [junit] 	at org.apache.tools.ant.Project.executeTargets(Project.java:1188)
    [junit] 	at org.apache.tools.ant.Main.runBuild(Main.java:612)
    [junit] 	at org.apache.tools.ant.Main.start(Main.java:197)
    [junit] 	at org.apache.tools.ant.Main.main(Main.java:235)


    [junit] TEST org.apache.tools.ant.taskdefs.ImportTest FAILED
    [junit] Testsuite: org.apache.tools.ant.types.optional.depend.ClassFileSetTest
    [junit] Tests run: 5, Failures: 0, Errors: 0, Time elapsed: 1.585 sec

    [junit] Testsuite: org.apache.tools.ant.types.selectors.ContainsSelectorTest
    [junit] Tests run: 3, Failures: 0, Errors: 0, Time elapsed: 2.727 sec

    [junit] Testsuite: org.apache.tools.ant.types.selectors.FilenameSelectorTest
    [junit] Tests run: 3, Failures: 0, Errors: 0, Time elapsed: 0.063 sec

    [junit] Testsuite: org.apache.tools.ant.types.selectors.DateSelectorTest
    [junit] Tests run: 3, Failures: 0, Errors: 0, Time elapsed: 7.118 sec

    [junit] Testsuite: org.apache.tools.ant.types.selectors.DependSelectorTest
    [junit] Tests run: 3, Failures: 0, Errors: 0, Time elapsed: 7.096 sec

    [junit] Testsuite: org.apache.tools.ant.types.selectors.DepthSelectorTest
    [junit] Tests run: 3, Failures: 0, Errors: 0, Time elapsed: 0.046 sec

    [junit] Testsuite: org.apache.tools.ant.types.selectors.PresentSelectorTest
    [junit] Tests run: 3, Failures: 0, Errors: 0, Time elapsed: 7.11 sec

    [junit] Testsuite: org.apache.tools.ant.types.selectors.SizeSelectorTest
    [junit] Tests run: 3, Failures: 0, Errors: 0, Time elapsed: 0.047 sec

    [junit] Testsuite: org.apache.tools.ant.types.EnumeratedAttributeTest
    [junit] Tests run: 2, Failures: 0, Errors: 0, Time elapsed: 0.001 sec

    [junit] Testsuite: org.apache.tools.ant.types.CommandlineJavaTest
    [junit] Tests run: 3, Failures: 0, Errors: 0, Time elapsed: 0.027 sec

    [junit] Testsuite: org.apache.tools.ant.types.CommandlineTest
    [junit] Tests run: 3, Failures: 0, Errors: 0, Time elapsed: 0.002 sec

    [junit] Testsuite: org.apache.tools.ant.types.DescriptionTest
    [junit] Tests run: 4, Failures: 0, Errors: 0, Time elapsed: 0.053 sec

    [junit] Testsuite: org.apache.tools.ant.types.DirSetTest
    [junit] Tests run: 3, Failures: 0, Errors: 0, Time elapsed: 0.003 sec

    [junit] Testsuite: org.apache.tools.ant.types.XMLCatalogBuildFileTest
    [junit] Tests run: 4, Failures: 0, Errors: 0, Time elapsed: 0.217 sec

    [junit] Testsuite: org.apache.tools.ant.types.FileListTest
    [junit] Tests run: 2, Failures: 0, Errors: 0, Time elapsed: 0.002 sec

    [junit] Testsuite: org.apache.tools.ant.types.FileSetTest
    [junit] Tests run: 2, Failures: 0, Errors: 0, Time elapsed: 0.001 sec

    [junit] Testsuite: org.apache.tools.ant.types.FilterSetTest
    [junit] Tests run: 6, Failures: 0, Errors: 0, Time elapsed: 0.287 sec

    [junit] ------------- Standard Output ---------------
    [junit] Inifinite loop in tokens. Currently known tokens : [test, test1, test2]
    [junit] Problem token : @test@ called from @test2@
    [junit] ------------- ---------------- ---------------
    [junit] ------------- Standard Error -----------------
    [junit] Replacing: @test2@ -> it works
    [junit] Replacing: @test1@ -> it works
    [junit] Replacing: @test@ -> it works
    [junit] Replacing: @test@ -> test
    [junit] Replacing: @test2@ -> test2
    [junit] Replacing: @test1@ -> test1
    [junit] Replacing: @test@ -> @test@
    [junit] Replacing: @test3@ -> testvalue
    [junit] ------------- ---------------- ---------------
    [junit] Testsuite: org.apache.tools.ant.types.FlexIntegerTest
    [junit] Tests run: 1, Failures: 0, Errors: 0, Time elapsed: 0.06 sec

    [junit] Testsuite: org.apache.tools.ant.types.MapperTest
    [junit] Tests run: 3, Failures: 0, Errors: 0, Time elapsed: 1.411 sec

    [junit] Testsuite: org.apache.tools.ant.types.PathTest
    [junit] Tests run: 13, Failures: 0, Errors: 0, Time elapsed: 0.033 sec

    [junit] Testsuite: org.apache.tools.ant.types.PatternSetTest
    [junit] Tests run: 3, Failures: 0, Errors: 0, Time elapsed: 0.006 sec

    [junit] Testsuite: org.apache.tools.ant.types.XMLCatalogTest
    [junit] Tests run: 9, Failures: 0, Errors: 0, Time elapsed: 0.078 sec

    [junit] Testsuite: org.apache.tools.ant.util.facade.FacadeTaskHelperTest
    [junit] Tests run: 2, Failures: 0, Errors: 0, Time elapsed: 0 sec

    [junit] Testsuite: org.apache.tools.ant.util.facade.ImplementationSpecificArgumentTest
    [junit] Tests run: 1, Failures: 0, Errors: 0, Time elapsed: 0 sec

    [junit] Testsuite: org.apache.tools.ant.util.regexp.JakartaRegexpMatcherTest
    [junit] Tests run: 11, Failures: 0, Errors: 0, Time elapsed: 0.02 sec

    [junit] Testsuite: org.apache.tools.ant.util.regexp.JakartaOroMatcherTest
    [junit] Tests run: 11, Failures: 0, Errors: 0, Time elapsed: 0.01 sec

    [junit] Testsuite: org.apache.tools.ant.util.regexp.JakartaOroRegexpTest
    [junit] Tests run: 14, Failures: 0, Errors: 0, Time elapsed: 0.012 sec

    [junit] Testsuite: org.apache.tools.ant.util.regexp.JakartaRegexpRegexpTest
    [junit] Tests run: 14, Failures: 0, Errors: 0, Time elapsed: 0.03 sec

    [junit] Testsuite: org.apache.tools.ant.util.regexp.Jdk14RegexpMatcherTest
    [junit] Tests run: 11, Failures: 0, Errors: 0, Time elapsed: 0.005 sec

    [junit] Testsuite: org.apache.tools.ant.util.regexp.Jdk14RegexpRegexpTest
    [junit] Tests run: 14, Failures: 0, Errors: 0, Time elapsed: 0.012 sec

    [junit] Testsuite: org.apache.tools.ant.util.DOMElementWriterTest
    [junit] Tests run: 4, Failures: 0, Errors: 0, Time elapsed: 0.001 sec

    [junit] Testsuite: org.apache.tools.ant.util.CollectionUtilsTest
    [junit] Tests run: 2, Failures: 0, Errors: 0, Time elapsed: 0.001 sec

    [junit] Testsuite: org.apache.tools.ant.util.GlobPatternMapperTest
    [junit] Tests run: 4, Failures: 0, Errors: 0, Time elapsed: 0.001 sec

    [junit] Testsuite: org.apache.tools.ant.util.DateUtilsTest
    [junit] Tests run: 6, Failures: 0, Errors: 0, Time elapsed: 0.018 sec

    [junit] Testsuite: org.apache.tools.ant.util.FileUtilsTest
    [junit] Tests run: 10, Failures: 0, Errors: 0, Time elapsed: 5.023 sec

    [junit] Testsuite: org.apache.tools.ant.util.PackageNameMapperTest
    [junit] Tests run: 1, Failures: 0, Errors: 0, Time elapsed: 0.001 sec

    [junit] Testsuite: org.apache.tools.ant.util.JavaEnvUtilsTest
    [junit] Tests run: 3, Failures: 0, Errors: 0, Time elapsed: 0.002 sec

    [junit] Testsuite: org.apache.tools.ant.util.StringUtilsTest
    [junit] Tests run: 3, Failures: 0, Errors: 0, Time elapsed: 0.001 sec

    [junit] Testsuite: org.apache.tools.ant.util.JAXPUtilsTest
    [junit] Tests run: 1, Failures: 0, Errors: 0, Time elapsed: 0.001 sec

    [junit] Testsuite: org.apache.tools.ant.util.ReferencesTest
    [junit] Tests run: 1, Failures: 0, Errors: 0, Time elapsed: 0 sec

    [junit] Testsuite: org.apache.tools.ant.DirectoryScannerTest
    [junit] Tests run: 2, Failures: 0, Errors: 0, Time elapsed: 1.511 sec

    [junit] Testsuite: org.apache.tools.ant.AntClassLoaderTest
    [junit] Tests run: 1, Failures: 0, Errors: 0, Time elapsed: 0.005 sec

    [junit] Testsuite: org.apache.tools.ant.filters.LineContainsTest
    [junit] Tests run: 1, Failures: 0, Errors: 0, Time elapsed: 0.044 sec

    [junit] Testsuite: org.apache.tools.ant.CaseTest
    [junit] Tests run: 2, Failures: 0, Errors: 0, Time elapsed: 0.055 sec

    [junit] Testsuite: org.apache.tools.ant.ImmutableTest
    [junit] Tests run: 7, Failures: 0, Errors: 0, Time elapsed: 0.08 sec

    [junit] Testsuite: org.apache.tools.ant.IncludeTest
    [junit] Tests run: 12, Failures: 0, Errors: 0, Time elapsed: 0.255 sec

    [junit] Testsuite: org.apache.tools.ant.IntrospectionHelperTest
    [junit] Tests run: 6, Failures: 0, Errors: 0, Time elapsed: 0.015 sec

    [junit] Testsuite: org.apache.tools.ant.ProjectTest
    [junit] Tests run: 6, Failures: 0, Errors: 0, Time elapsed: 0.086 sec

    [junit] Testsuite: org.apache.tools.ant.PropertyExpansionTest
    [junit] Tests run: 2, Failures: 0, Errors: 0, Time elapsed: 0.018 sec

    [junit] Testsuite: org.apache.tools.ant.TopLevelTaskTest
    [junit] Tests run: 3, Failures: 0, Errors: 0, Time elapsed: 0.155 sec

    [junit] Testsuite: org.apache.tools.ant.LoaderRefTest
    [junit] Tests run: 1, Failures: 0, Errors: 0, Time elapsed: 0.282 sec

    [junit] Testsuite: org.apache.tools.zip.AsiExtraFieldTest
    [junit] Tests run: 3, Failures: 0, Errors: 0, Time elapsed: 0.016 sec

    [junit] Testsuite: org.apache.tools.zip.ExtraFieldUtilsTest
    [junit] Tests run: 2, Failures: 0, Errors: 0, Time elapsed: 0.02 sec

    [junit] Testsuite: org.apache.tools.zip.ZipEntryTest
    [junit] Tests run: 2, Failures: 0, Errors: 0, Time elapsed: 0.029 sec

    [junit] Testsuite: org.apache.tools.zip.ZipLongTest
    [junit] Tests run: 4, Failures: 0, Errors: 0, Time elapsed: 0.004 sec

    [junit] Testsuite: org.apache.tools.zip.ZipShortTest
    [junit] Tests run: 4, Failures: 0, Errors: 0, Time elapsed: 0.004 sec


BUILD FAILED
file:///home/rubys/jakarta/jakarta-ant/build.xml:1595: At least one test has failed.

Total time: 4 minutes 9 seconds

--
To unsubscribe, e-mail:   <mailto:ant-dev-unsubscribe@jakarta.apache.org>
For additional commands, e-mail: <mailto:ant-dev-help@jakarta.apache.org>


Mime
View raw message