ant-dev mailing list archives

Site index · List index
Message view « Date » · « Thread »
Top « Date » · « Thread »
From bugzi...@apache.org
Subject DO NOT REPLY [Bug 15998] New: - ANT_151_FINAL has failing test
Date Sun, 12 Jan 2003 00:00:37 GMT
DO NOT REPLY TO THIS EMAIL, BUT PLEASE POST YOUR BUG 
RELATED COMMENTS THROUGH THE WEB INTERFACE AVAILABLE AT
<http://nagoya.apache.org/bugzilla/show_bug.cgi?id=15998>.
ANY REPLY MADE TO THIS MESSAGE WILL NOT BE COLLECTED AND 
INSERTED IN THE BUG DATABASE.

http://nagoya.apache.org/bugzilla/show_bug.cgi?id=15998

ANT_151_FINAL has failing test

           Summary: ANT_151_FINAL has failing test
           Product: Ant
           Version: 1.5.1
          Platform: PC
        OS/Version: Linux
            Status: NEW
          Severity: Normal
          Priority: Other
         Component: Build Process
        AssignedTo: ant-dev@jakarta.apache.org
        ReportedBy: gus.heck@olin.edu


So I decided to back off the 1.6 alpha thing since it had failing tests.

I had the cvs commands in my shell history so I checked out the -r ANT_151_FINAL

And it has different failing tests!! Surely it wasn't released with failing tests??

Anyway here's the output for the test run:

jakarta-ant]# JAVA_HOME=/usr/java/j2sdk1.4.1_01/ ./build.sh test
Buildfile: build.xml

check_for_optional_packages:

xml-check:
#---- BEGIN writeEnvironmentReport($Revision: 1.7 $): Useful properties found: ----
java.version=1.4.1_01
version.JAXP=1.1
java.ext.dirs=/usr/java/j2sdk1.4.1_01/jre/lib/ext
version.crimson=not-present
version.SAX=2.0
java.class.path=bootstrap/lib/optional.jar:bootstrap/lib/ant.jar:lib/xercesImpl.jar:lib/xml-apis.jar:bootstrap/lib/ant.jar:lib/optional/junit.jar::/usr/java/j2sdk1.4.1_01//lib/tools.jar
version.xerces=not-present
sun.boot.class.path=/usr/java/j2sdk1.4.1_01/jre/lib/rt.jar:/usr/java/j2sdk1.4.1_01/jre/lib/i18n.jar:/usr/java/j2sdk1.4.1_01/jre/lib/sunrsasign.jar:/usr/java/j2sdk1.4.1_01/jre/lib/jsse.jar:/usr/java/j2sdk1.4.1_01/jre/lib/jce.jar:/usr/java/j2sdk1.4.1_01/jre/lib/charsets.jar:/usr/java/j2sdk1.4.1_01/jre/classes
version.DOM.draftlevel=2.0fd
version.xalan2=Xalan;Java;Xalan Java 2.2.D11;
version.DOM=2.0
version.xalan1=not-present
#----- END writeEnvironmentReport: Useful properties found: -----
# YAHOO! Your environment seems to be OK.

dump-sys-properties:
java.vm.info=mixed mode
java.vm.name=Java HotSpot(TM) Client VM
java.vm.vendor=Sun Microsystems Inc.
java.vm.version=1.4.1_01-b01
os.arch=i386
os.name=Linux
os.version=2.4.18-18.8.0
file.encoding=UTF-8
user.language=en

run-which:

dump-info:

prepare:

build:
Copying 2 files to /usr/local/jakarta-ant/build/classes

compile-tests:
Created dir: /usr/local/jakarta-ant/build/testcases
Compiling 148 source files to /usr/local/jakarta-ant/build/testcases
Note: Some input files use or override a deprecated API.
Note: Recompile with -deprecation for details.

probe-offline:

run-tests:
Testsuite: org.apache.tools.ant.filters.LineContainsTest
Tests run: 1, Failures: 0, Errors: 0, Time elapsed: 0.199 sec

Testsuite: org.apache.tools.ant.AntClassLoaderTest
Tests run: 1, Failures: 0, Errors: 0, Time elapsed: 0.067 sec

Testsuite: org.apache.tools.ant.DirectoryScannerTest
Tests run: 2, Failures: 0, Errors: 0, Time elapsed: 1.698 sec

Testsuite: org.apache.tools.ant.ImmutableTest
Tests run: 7, Failures: 0, Errors: 0, Time elapsed: 0.454 sec

Testsuite: org.apache.tools.ant.IncludeTest
Tests run: 9, Failures: 0, Errors: 0, Time elapsed: 0.559 sec

Testsuite: org.apache.tools.ant.IntrospectionHelperTest
Tests run: 6, Failures: 0, Errors: 0, Time elapsed: 0.015 sec

Testsuite: org.apache.tools.ant.ProjectTest
Tests run: 4, Failures: 0, Errors: 0, Time elapsed: 0.156 sec

Testsuite: org.apache.tools.ant.PropertyExpansionTest
Tests run: 2, Failures: 0, Errors: 0, Time elapsed: 0.102 sec

Testsuite: org.apache.tools.ant.taskdefs.condition.ContainsTest
Tests run: 1, Failures: 0, Errors: 0, Time elapsed: 0.001 sec

Testsuite: org.apache.tools.ant.taskdefs.condition.EqualsTest
Tests run: 2, Failures: 0, Errors: 0, Time elapsed: 0 sec

Testsuite: org.apache.tools.ant.taskdefs.AntStructureTest
Tests run: 1, Failures: 0, Errors: 0, Time elapsed: 0.056 sec

Testsuite: org.apache.tools.ant.taskdefs.AntTest
Tests run: 21, Failures: 0, Errors: 0, Time elapsed: 1.568 sec

Testsuite: org.apache.tools.ant.taskdefs.AvailableTest
Tests run: 26, Failures: 0, Errors: 0, Time elapsed: 1.346 sec

Testsuite: org.apache.tools.ant.taskdefs.BUnzip2Test
Tests run: 1, Failures: 0, Errors: 0, Time elapsed: 1.532 sec

Testsuite: org.apache.tools.ant.taskdefs.BZip2Test
Tests run: 2, Failures: 0, Errors: 0, Time elapsed: 8.47 sec

Testsuite: org.apache.tools.ant.taskdefs.BasenameTest
Tests run: 9, Failures: 0, Errors: 0, Time elapsed: 0.313 sec

Testsuite: org.apache.tools.ant.taskdefs.CVSPassTest
Tests run: 5, Failures: 0, Errors: 0, Time elapsed: 0.409 sec

Testsuite: org.apache.tools.ant.taskdefs.ChecksumTest
Tests run: 4, Failures: 0, Errors: 0, Time elapsed: 0.157 sec

Testsuite: org.apache.tools.ant.taskdefs.ConcatTest
Tests run: 5, Failures: 0, Errors: 0, Time elapsed: 0.183 sec

Testsuite: org.apache.tools.ant.taskdefs.ConditionTest
Tests run: 38, Failures: 0, Errors: 0, Time elapsed: 1.512 sec

Testsuite: org.apache.tools.ant.taskdefs.CopyTest
Tests run: 6, Failures: 0, Errors: 0, Time elapsed: 8.249 sec

Testsuite: org.apache.tools.ant.taskdefs.CopydirTest
Tests run: 6, Failures: 0, Errors: 0, Time elapsed: 1.069 sec

Testsuite: org.apache.tools.ant.taskdefs.CopyfileTest
Tests run: 6, Failures: 0, Errors: 0, Time elapsed: 0.201 sec

Testsuite: org.apache.tools.ant.taskdefs.DeleteTest
Tests run: 3, Failures: 0, Errors: 0, Time elapsed: 0.702 sec

Testsuite: org.apache.tools.ant.taskdefs.DeltreeTest
Tests run: 2, Failures: 0, Errors: 0, Time elapsed: 0.066 sec

Testsuite: org.apache.tools.ant.taskdefs.DependSetTest
Tests run: 5, Failures: 0, Errors: 0, Time elapsed: 3.178 sec

Testsuite: org.apache.tools.ant.taskdefs.DirnameTest
Tests run: 5, Failures: 0, Errors: 0, Time elapsed: 0.16 sec

Testsuite: org.apache.tools.ant.taskdefs.DynamicTest
Tests run: 1, Failures: 0, Errors: 0, Time elapsed: 0.053 sec

Testsuite: org.apache.tools.ant.taskdefs.EchoTest
Tests run: 3, Failures: 0, Errors: 0, Time elapsed: 0.094 sec

Testsuite: org.apache.tools.ant.taskdefs.ExecuteJavaTest
Tests run: 2, Failures: 0, Errors: 0, Time elapsed: 7.519 sec

Testsuite: org.apache.tools.ant.taskdefs.ExecuteWatchdogTest
Tests run: 4, Failures: 0, Errors: 4, Time elapsed: 0.017 sec

Testcase: testNoTimeOut(org.apache.tools.ant.taskdefs.ExecuteWatchdogTest):    
Caused an ERROR
java.io.IOException: java: not found
java.io.IOException: java.io.IOException: java: not found
        at java.lang.UNIXProcess.<init>(UNIXProcess.java:143)
        at java.lang.Runtime.execInternal(Native Method)
        at java.lang.Runtime.exec(Runtime.java:566)
        at java.lang.Runtime.exec(Runtime.java:491)
        at java.lang.Runtime.exec(Runtime.java:457)
        at
org.apache.tools.ant.taskdefs.ExecuteWatchdogTest.getProcess(ExecuteWatchdogTest.java:115)
        at
org.apache.tools.ant.taskdefs.ExecuteWatchdogTest.testNoTimeOut(ExecuteWatchdogTest.java:141)
        at sun.reflect.NativeMethodAccessorImpl.invoke0(Native Method)
        at
sun.reflect.NativeMethodAccessorImpl.invoke(NativeMethodAccessorImpl.java:39)
        at
sun.reflect.DelegatingMethodAccessorImpl.invoke(DelegatingMethodAccessorImpl.java:25)
        at java.lang.reflect.Method.invoke(Method.java:324)
        at junit.framework.TestCase.runTest(TestCase.java:154)
        at junit.framework.TestCase.runBare(TestCase.java:127)
        at junit.framework.TestResult$1.protect(TestResult.java:106)
        at junit.framework.TestResult.runProtected(TestResult.java:124)
        at junit.framework.TestResult.run(TestResult.java:109)
        at junit.framework.TestCase.run(TestCase.java:118)
        at junit.framework.TestSuite.runTest(TestSuite.java:208)
        at junit.framework.TestSuite.run(TestSuite.java:203)
        at
org.apache.tools.ant.taskdefs.optional.junit.JUnitTestRunner.run(JUnitTestRunner.java:325)
        at
org.apache.tools.ant.taskdefs.optional.junit.JUnitTask.executeInVM(JUnitTask.java:804)
        at
org.apache.tools.ant.taskdefs.optional.junit.JUnitTask.execute(JUnitTask.java:551)
        at
org.apache.tools.ant.taskdefs.optional.junit.JUnitTask.execute(JUnitTask.java:527)
        at org.apache.tools.ant.Task.perform(Task.java:319)
        at org.apache.tools.ant.Target.execute(Target.java:309)
        at org.apache.tools.ant.Target.performTasks(Target.java:336)
        at org.apache.tools.ant.Project.executeTarget(Project.java:1306)
        at org.apache.tools.ant.Project.executeTargets(Project.java:1250)
        at org.apache.tools.ant.Main.runBuild(Main.java:610)
        at org.apache.tools.ant.Main.start(Main.java:196)
        at org.apache.tools.ant.Main.main(Main.java:235)


Testcase: testTimeOut(org.apache.tools.ant.taskdefs.ExecuteWatchdogTest):      
Caused an ERROR
java.io.IOException: java: not found
java.io.IOException: java.io.IOException: java: not found
        at java.lang.UNIXProcess.<init>(UNIXProcess.java:143)
        at java.lang.Runtime.execInternal(Native Method)
        at java.lang.Runtime.exec(Runtime.java:566)
        at java.lang.Runtime.exec(Runtime.java:491)
        at java.lang.Runtime.exec(Runtime.java:457)
        at
org.apache.tools.ant.taskdefs.ExecuteWatchdogTest.getProcess(ExecuteWatchdogTest.java:115)
        at
org.apache.tools.ant.taskdefs.ExecuteWatchdogTest.testTimeOut(ExecuteWatchdogTest.java:150)
        at sun.reflect.NativeMethodAccessorImpl.invoke0(Native Method)
        at
sun.reflect.NativeMethodAccessorImpl.invoke(NativeMethodAccessorImpl.java:39)
        at
sun.reflect.DelegatingMethodAccessorImpl.invoke(DelegatingMethodAccessorImpl.java:25)
        at java.lang.reflect.Method.invoke(Method.java:324)
        at junit.framework.TestCase.runTest(TestCase.java:154)
        at junit.framework.TestCase.runBare(TestCase.java:127)
        at junit.framework.TestResult$1.protect(TestResult.java:106)
        at junit.framework.TestResult.runProtected(TestResult.java:124)
        at junit.framework.TestResult.run(TestResult.java:109)
        at junit.framework.TestCase.run(TestCase.java:118)
        at junit.framework.TestSuite.runTest(TestSuite.java:208)
        at junit.framework.TestSuite.run(TestSuite.java:203)
        at
org.apache.tools.ant.taskdefs.optional.junit.JUnitTestRunner.run(JUnitTestRunner.java:325)
        at
org.apache.tools.ant.taskdefs.optional.junit.JUnitTask.executeInVM(JUnitTask.java:804)
        at
org.apache.tools.ant.taskdefs.optional.junit.JUnitTask.execute(JUnitTask.java:551)
        at
org.apache.tools.ant.taskdefs.optional.junit.JUnitTask.execute(JUnitTask.java:527)
        at org.apache.tools.ant.Task.perform(Task.java:319)
        at org.apache.tools.ant.Target.execute(Target.java:309)
        at org.apache.tools.ant.Target.performTasks(Target.java:336)
        at org.apache.tools.ant.Project.executeTarget(Project.java:1306)
        at org.apache.tools.ant.Project.executeTargets(Project.java:1250)
        at org.apache.tools.ant.Main.runBuild(Main.java:610)
        at org.apache.tools.ant.Main.start(Main.java:196)
        at org.apache.tools.ant.Main.main(Main.java:235)


Testcase: testFailed(org.apache.tools.ant.taskdefs.ExecuteWatchdogTest):       
Caused an ERROR
java.io.IOException: java: not found
java.io.IOException: java.io.IOException: java: not found
        at java.lang.UNIXProcess.<init>(UNIXProcess.java:143)
        at java.lang.Runtime.execInternal(Native Method)
        at java.lang.Runtime.exec(Runtime.java:566)
        at java.lang.Runtime.exec(Runtime.java:491)
        at java.lang.Runtime.exec(Runtime.java:457)
        at
org.apache.tools.ant.taskdefs.ExecuteWatchdogTest.getProcess(ExecuteWatchdogTest.java:115)
        at
org.apache.tools.ant.taskdefs.ExecuteWatchdogTest.testFailed(ExecuteWatchdogTest.java:163)
        at sun.reflect.NativeMethodAccessorImpl.invoke0(Native Method)
        at
sun.reflect.NativeMethodAccessorImpl.invoke(NativeMethodAccessorImpl.java:39)
        at
sun.reflect.DelegatingMethodAccessorImpl.invoke(DelegatingMethodAccessorImpl.java:25)
        at java.lang.reflect.Method.invoke(Method.java:324)
        at junit.framework.TestCase.runTest(TestCase.java:154)
        at junit.framework.TestCase.runBare(TestCase.java:127)
        at junit.framework.TestResult$1.protect(TestResult.java:106)
        at junit.framework.TestResult.runProtected(TestResult.java:124)
        at junit.framework.TestResult.run(TestResult.java:109)
        at junit.framework.TestCase.run(TestCase.java:118)
        at junit.framework.TestSuite.runTest(TestSuite.java:208)
        at junit.framework.TestSuite.run(TestSuite.java:203)
        at
org.apache.tools.ant.taskdefs.optional.junit.JUnitTestRunner.run(JUnitTestRunner.java:325)
        at
org.apache.tools.ant.taskdefs.optional.junit.JUnitTask.executeInVM(JUnitTask.java:804)
        at
org.apache.tools.ant.taskdefs.optional.junit.JUnitTask.execute(JUnitTask.java:551)
        at
org.apache.tools.ant.taskdefs.optional.junit.JUnitTask.execute(JUnitTask.java:527)
        at org.apache.tools.ant.Task.perform(Task.java:319)
        at org.apache.tools.ant.Target.execute(Target.java:309)
        at org.apache.tools.ant.Target.performTasks(Target.java:336)
        at org.apache.tools.ant.Project.executeTarget(Project.java:1306)
        at org.apache.tools.ant.Project.executeTargets(Project.java:1250)
        at org.apache.tools.ant.Main.runBuild(Main.java:610)
        at org.apache.tools.ant.Main.start(Main.java:196)
        at org.apache.tools.ant.Main.main(Main.java:235)


Testcase: testManualStop(org.apache.tools.ant.taskdefs.ExecuteWatchdogTest):   
Caused an ERROR
java.io.IOException: java: not found
java.io.IOException: java.io.IOException: java: not found
        at java.lang.UNIXProcess.<init>(UNIXProcess.java:143)
        at java.lang.Runtime.execInternal(Native Method)
        at java.lang.Runtime.exec(Runtime.java:566)
        at java.lang.Runtime.exec(Runtime.java:491)
        at java.lang.Runtime.exec(Runtime.java:457)
        at
org.apache.tools.ant.taskdefs.ExecuteWatchdogTest.getProcess(ExecuteWatchdogTest.java:115)
        at
org.apache.tools.ant.taskdefs.ExecuteWatchdogTest.testManualStop(ExecuteWatchdogTest.java:171)
        at sun.reflect.NativeMethodAccessorImpl.invoke0(Native Method)
        at
sun.reflect.NativeMethodAccessorImpl.invoke(NativeMethodAccessorImpl.java:39)
        at
sun.reflect.DelegatingMethodAccessorImpl.invoke(DelegatingMethodAccessorImpl.java:25)
        at java.lang.reflect.Method.invoke(Method.java:324)
        at junit.framework.TestCase.runTest(TestCase.java:154)
        at junit.framework.TestCase.runBare(TestCase.java:127)
        at junit.framework.TestResult$1.protect(TestResult.java:106)
        at junit.framework.TestResult.runProtected(TestResult.java:124)
        at junit.framework.TestResult.run(TestResult.java:109)
        at junit.framework.TestCase.run(TestCase.java:118)
        at junit.framework.TestSuite.runTest(TestSuite.java:208)
        at junit.framework.TestSuite.run(TestSuite.java:203)
        at
org.apache.tools.ant.taskdefs.optional.junit.JUnitTestRunner.run(JUnitTestRunner.java:325)
        at
org.apache.tools.ant.taskdefs.optional.junit.JUnitTask.executeInVM(JUnitTask.java:804)
        at
org.apache.tools.ant.taskdefs.optional.junit.JUnitTask.execute(JUnitTask.java:551)
        at
org.apache.tools.ant.taskdefs.optional.junit.JUnitTask.execute(JUnitTask.java:527)
        at org.apache.tools.ant.Task.perform(Task.java:319)
        at org.apache.tools.ant.Target.execute(Target.java:309)
        at org.apache.tools.ant.Target.performTasks(Target.java:336)
        at org.apache.tools.ant.Project.executeTarget(Project.java:1306)
        at org.apache.tools.ant.Project.executeTargets(Project.java:1250)
        at org.apache.tools.ant.Main.runBuild(Main.java:610)
        at org.apache.tools.ant.Main.start(Main.java:196)
        at org.apache.tools.ant.Main.main(Main.java:235)



BUILD FAILED
file:/usr/local/jakarta-ant/build.xml:1248: Test
org.apache.tools.ant.taskdefs.ExecuteWatchdogTest failed

Total time: 50 seconds

--
To unsubscribe, e-mail:   <mailto:ant-dev-unsubscribe@jakarta.apache.org>
For additional commands, e-mail: <mailto:ant-dev-help@jakarta.apache.org>


Mime
View raw message