ant-dev mailing list archives

Site index · List index
Message view « Date » · « Thread »
Top « Date » · « Thread »
From Diane Holt <hol...@apache.org>
Subject [GUMP] Test Failure - Ant
Date Sun, 21 Apr 2002 13:07:21 GMT
----------------------------------------------------
This email is autogenerated from the output from:
<http://jakarta.apache.org/builds/gump/2002-04-21/test-ant.html>
----------------------------------------------------

Buildfile: build.xml

check_for_optional_packages:

xml-check:

dump-sys-properties:

run-which:
    [which] #---- BEGIN: Which report
    [which] Which.version=Which.java:($Revision: 1.2 $) WhichJar.java:($Revision: 1.1 $)
    [which] Which.special-note=No -projects provided, using DEFAULT_PROJECTS
    [which] java.version=1.3.1_02
    [which] file.encoding=ISO-8859-1
    [which] java.ext.dirs=/usr/java/jdk1.3.1_02/jre/lib/ext
    [which] java.class.path=/home/rubys/jakarta/xml-xalan/java/build/xalan.jar:/home/rubys/jakarta/xml-commons/java/external/build/xml-apis.jar:.:/usr/java/jdk1.3.1_02/lib/tools.jar:/usr/java/jdk1.3.1_02/jre/lib/rt.jar:/usr/java/jdk1.3.1_02/lib/tools.jar:/home/rubys/jakarta/jakarta-ant/build/classes:/home/rubys/jakarta/jakarta-ant/build/testcases:/home/rubys/jakarta/jakarta-ant/src/testcases:/home/rubys/jakarta/jakarta-ant/src/etc/testcases:/home/rubys/jakarta/jakarta-ant/build/lib/ant.jar:/home/rubys/jakarta/jakarta-ant/build/lib/optional.jar:/home/rubys/jakarta/xml-commons/java/build/which.jar:/home/rubys/jakarta/jakarta-ant/bootstrap/lib/ant.jar:/home/rubys/jakarta/xml-stylebook/bin/stylebook-1.0-b3_xalan-2.jar:/home/rubys/jakarta/xml-xerces2/java/build/xercesImpl.jar:/home/rubys/jakarta/xml-xerces2/java/build/xmlParserAPIs.jar:/home/rubys/jakarta/jakarta-regexp/bin/jakarta-regexp-20020421.jar:/home/rubys/jakarta/jakarta-slide/lib/antlr-tools.jar:/home/rubys/jakarta/jakarta-slide/lib/antlr.jar:/home/rubys/jakarta/dist/
    [which] junit/junit.jar:/opt/javamail-1.2/mail.jar:/home/rubys/jakarta/jakarta-log4j/dist/lib/log4j-20020421.jar:/home/rubys/jakarta/jakarta-bcel/bin/bcel.jar:/home/rubys/jakarta/jakarta-oro/jakarta-oro-20020421.jar:/home/rubys/jakarta/dist/servletapi/lib/servlet.jar:/home/rubys/jakarta/bsf/build/lib/bsf.jar:/opt/jaf-1.0.1/activation.jar:/home/rubys/jakarta/jakarta-ant/dist/lib/ant.jar:/home/rubys/jakarta/jakarta-ant/dist/lib/optional.jar
    [which] Which.status=.not-found
    [which] os.name=Linux
    [which] java.vendor=Sun Microsystems Inc.
    [which] sun.boot.class.path=/usr/java/jdk1.3.1_02/jre/lib/rt.jar:/usr/java/jdk1.3.1_02/jre/lib/i18n.jar:/usr/java/jdk1.3.1_02/jre/lib/sunrsasign.jar:/usr/java/jdk1.3.1_02/jre/classes
    [which] java.runtime.name=Java(TM) 2 Runtime Environment, Standard Edition
    [which] #---- BEGIN: Xalan.hashinfo
    [which] Xalan22+.version=Xalan Java 2.4.D1
    [which] xml-apis.jar.path=/home/rubys/jakarta/xml-commons/java/external/build/xml-apis.jar
    [which] xml-apis.jar.unknown=/usr/java/jdk1.3.1_02/jre/lib/ext/xml-apis.jar does not exist
    [which] Xalan1.version=.not-found
    [which] xml-apis.jar.ok-present=not from an official release, size:109011
    [which] xalan.jar.unknown=/usr/java/jdk1.3.1_02/jre/lib/ext/xalan.jar does not exist
    [which] xalan.jar.path=/home/rubys/jakarta/xml-xalan/java/build/xalan.jar
    [which] xalan.jar.ok-present=not from an official release, size:963694
    [which] Xalan2x.version=Xalan Java 2.4.D1
    [which] #----   END: Xalan.hashinfo
    [which] #---- BEGIN: Crimson.hashinfo
    [which] crimson.jar.unknown=/usr/java/jdk1.3.1_02/jre/lib/ext/crimson.jar does not exist
    [which] Crimson.version=.not-found
    [which] #----   END: Crimson.hashinfo
    [which] #---- BEGIN: Xerces.hashinfo
    [which] xmlParserAPIs.jar.unknown=/usr/java/jdk1.3.1_02/jre/lib/ext/xmlParserAPIs.jar
does not exist
    [which] Xerces2.version=Xerces-J 2.0.1
    [which] Xerces1.version=.not-found
    [which] xerces.jar.unknown=/usr/java/jdk1.3.1_02/jre/lib/ext/xerces.jar does not exist
    [which] #----   END: Xerces.hashinfo
    [which] #---- BEGIN: XmlCommons.hashinfo
    [which] dom.jar.unknown=/usr/java/jdk1.3.1_02/jre/lib/ext/dom.jar does not exist
    [which] XmlCommons.jaxp.version=1.1
    [which] sax.jar.unknown=/usr/java/jdk1.3.1_02/jre/lib/ext/sax.jar does not exist
    [which] xml-apis.jar.path=/home/rubys/jakarta/xml-commons/java/external/build/xml-apis.jar
    [which] XmlCommons.sax.version=2.0
    [which] xml-apis.jar.ok-present=not from an official release, size:109011
    [which] xml-apis.jar.unknown=/usr/java/jdk1.3.1_02/jre/lib/ext/xml-apis.jar does not exist
    [which] XmlCommons.version=XmlCommons 1.0
    [which] XmlCommons.dom.version=2.0
    [which] jaxp.jar.unknown=/usr/java/jdk1.3.1_02/jre/lib/ext/jaxp.jar does not exist
    [which] #----   END: XmlCommons.hashinfo
    [which] #---- BEGIN: Ant.hashinfo
    [which] ant.jar.unknown=/usr/java/jdk1.3.1_02/jre/lib/ext/ant.jar does not exist
    [which] Ant.version=Apache Ant version 1.5alpha compiled on April 21 2002
    [which] ant.jar.path=/home/rubys/jakarta/jakarta-ant/build/lib/ant.jar
    [which] ant.jar.ok-present=not from an official release, size:650170
    [which] #---- BEGIN: java.class.path.ant.jar.hashinfo
    [which] ant.jar.unknown=jar on classpath multiple times!
    [which] ant.jar.path=/home/rubys/jakarta/jakarta-ant/dist/lib/ant.jar
    [which] ant.jar.ok-present=not from an official release, size:648860
    [which] #----   END: java.class.path.ant.jar.hashinfo
    [which] #----   END: Ant.hashinfo
    [which] #----   END: Which report

dump-info:

prepare:

build:
     [copy] Copying 2 files to /home/rubys/jakarta/jakarta-ant/build/classes

compile-tests:
    [javac] Compiling 137 source files to /home/rubys/jakarta/jakarta-ant/build/testcases
    [javac] Note: Some input files use or override a deprecated API.
    [javac] Note: Recompile with -deprecation for details.

probe-offline:

run-tests:
    [junit] Testsuite: org.apache.tools.ant.taskdefs.optional.junit.JUnitTestRunnerTest
    [junit] Tests run: 5, Failures: 0, Errors: 0, Time elapsed: 0.073 sec
    [junit] 
    [junit] Testsuite: org.apache.tools.ant.taskdefs.optional.perforce.P4ChangeTest
    [junit] Tests run: 2, Failures: 0, Errors: 0, Time elapsed: 0.235 sec
    [junit] 
    [junit] Testsuite: org.apache.tools.ant.taskdefs.optional.sitraka.ClassPathLoaderTest
    [junit] Tests run: 1, Failures: 0, Errors: 0, Time elapsed: 11.096 sec
    [junit] 
    [junit] ------------- Standard Output ---------------
    [junit] Processing /usr/java/jdk1.3.1_02/jre/lib/rt.jar
    [junit] 5299 classes loaded in 11015ms
    [junit] ------------- ---------------- ---------------
    [junit] Testsuite: org.apache.tools.ant.taskdefs.optional.sitraka.ClassFileTest
    [junit] Tests run: 1, Failures: 0, Errors: 0, Time elapsed: 0.014 sec
    [junit] 
    [junit] Testsuite: org.apache.tools.ant.taskdefs.optional.PropertyFileTest
    [junit] Tests run: 2, Failures: 0, Errors: 0, Time elapsed: 0.541 sec
    [junit] 
    [junit] Testsuite: org.apache.tools.ant.taskdefs.optional.ANTLRTest
    [junit] Tests run: 7, Failures: 0, Errors: 0, Time elapsed: 40.385 sec
    [junit] 
    [junit] Testsuite: org.apache.tools.ant.taskdefs.optional.sos.SOSTest
    [junit] Tests run: 11, Failures: 0, Errors: 0, Time elapsed: 0.054 sec
    [junit] 
    [junit] Testsuite: org.apache.tools.ant.taskdefs.optional.metamata.MAuditParserTest
    [junit] Tests run: 3, Failures: 0, Errors: 0, Time elapsed: 0.053 sec
    [junit] 
    [junit] Testsuite: org.apache.tools.ant.taskdefs.optional.depend.DependTest
    [junit] Tests run: 9, Failures: 0, Errors: 0, Time elapsed: 29.918 sec
    [junit] 
    [junit] Testsuite: org.apache.tools.ant.taskdefs.optional.ReplaceRegExpTest
    [junit] Tests run: 1, Failures: 0, Errors: 0, Time elapsed: 0.244 sec
    [junit] 
    [junit] Testsuite: org.apache.tools.ant.taskdefs.optional.TraXLiaisonTest
    [junit] Tests run: 5, Failures: 0, Errors: 0, Time elapsed: 5.472 sec
    [junit] 
    [junit] Testsuite: org.apache.tools.ant.taskdefs.optional.EchoPropertiesTest
    [junit] Tests run: 8, Failures: 0, Errors: 0, Time elapsed: 1.355 sec
    [junit] 
    [junit] ------------- Standard Output ---------------
    [junit] -- listing properties --
    [junit] java.runtime.name=Java(TM) 2 Runtime Environment, Stand...
    [junit] sun.boot.library.path=/usr/java/jdk1.3.1_02/jre/lib/i386
    [junit] java.vm.version=1.3.1_02-b02
    [junit] ant.java.version=1.3
    [junit] java.vm.vendor=Sun Microsystems Inc.
    [junit] java.vendor.url=http://java.sun.com/
    [junit] path.separator=:
    [junit] java.vm.name=Java HotSpot(TM) Client VM
    [junit] file.encoding.pkg=sun.io
    [junit] java.vm.specification.name=Java Virtual Machine Specification
    [junit] user.dir=/home/rubys/jakarta/jakarta-ant
    [junit] java.runtime.version=1.3.1_02-b02
    [junit] java.awt.graphicsenv=sun.awt.X11GraphicsEnvironment
    [junit] basedir=/home/rubys/jakarta/jakarta-ant/src/e...
    [junit] os.arch=i386
    [junit] java.io.tmpdir=/tmp
    [junit] line.separator=
    [junit] 
    [junit] java.vm.specification.vendor=Sun Microsystems Inc.
    [junit] java.awt.fonts=
    [junit] os.name=Linux
    [junit] ant.home=${ant.home}
    [junit] ant.project.name=test
    [junit] java.library.path=/usr/java/jdk1.3.1_02/jre/lib/i386:/u...
    [junit] test.property=is set
    [junit] java.specification.name=Java Platform API Specification
    [junit] java.class.version=47.0
    [junit] os.version=2.4.7-10
    [junit] ant.file=/home/rubys/jakarta/jakarta-ant/src/e...
    [junit] user.home=/home/rubys
    [junit] b.set=false
    [junit] user.timezone=America/New_York
    [junit] java.awt.printerjob=sun.awt.motif.PSPrinterJob
    [junit] file.encoding=ISO-8859-1
    [junit] build.tests=build/testcases
    [junit] java.specification.version=1.3
    [junit] tests-classpath.value=/home/rubys/jakarta/jakarta-ant/build...
    [junit] user.name=rubys
    [junit] java.class.path=/home/rubys/jakarta/xml-xalan/java/bu...
    [junit] java.vm.specification.version=1.0
    [junit] java.home=/usr/java/jdk1.3.1_02/jre
    [junit] java.specification.vendor=Sun Microsystems Inc.
    [junit] user.language=en
    [junit] java.vm.info=mixed mode
    [junit] java.version=1.3.1_02
    [junit] java.ext.dirs=/usr/java/jdk1.3.1_02/jre/lib/ext
    [junit] sun.boot.class.path=/usr/java/jdk1.3.1_02/jre/lib/rt.jar:...
    [junit] java.vendor=Sun Microsystems Inc.
    [junit] a.set=true
    [junit] file.separator=/
    [junit] java.vendor.url.bug=http://java.sun.com/cgi-bin/bugreport...
    [junit] sun.io.unicode.encoding=UnicodeLittle
    [junit] sun.cpu.endian=little
    [junit] user.region=US
    [junit] sun.cpu.isalist=
    [junit] -- listing properties --
    [junit] java.runtime.name=Java(TM) 2 Runtime Environment, Stand...
    [junit] sun.boot.library.path=/usr/java/jdk1.3.1_02/jre/lib/i386
    [junit] java.vm.version=1.3.1_02-b02
    [junit] ant.java.version=1.3
    [junit] java.vm.vendor=Sun Microsystems Inc.
    [junit] java.vendor.url=http://java.sun.com/
    [junit] path.separator=:
    [junit] java.vm.name=Java HotSpot(TM) Client VM
    [junit] file.encoding.pkg=sun.io
    [junit] java.vm.specification.name=Java Virtual Machine Specification
    [junit] user.dir=/home/rubys/jakarta/jakarta-ant
    [junit] java.runtime.version=1.3.1_02-b02
    [junit] java.awt.graphicsenv=sun.awt.X11GraphicsEnvironment
    [junit] basedir=/home/rubys/jakarta/jakarta-ant/src/e...
    [junit] os.arch=i386
    [junit] java.io.tmpdir=/tmp
    [junit] line.separator=
    [junit] 
    [junit] java.vm.specification.vendor=Sun Microsystems Inc.
    [junit] java.awt.fonts=
    [junit] os.name=Linux
    [junit] ant.home=${ant.home}
    [junit] ant.project.name=test
    [junit] java.library.path=/usr/java/jdk1.3.1_02/jre/lib/i386:/u...
    [junit] test.property=is set
    [junit] java.specification.name=Java Platform API Specification
    [junit] java.class.version=47.0
    [junit] os.version=2.4.7-10
    [junit] ant.file=/home/rubys/jakarta/jakarta-ant/src/e...
    [junit] user.home=/home/rubys
    [junit] b.set=false
    [junit] user.timezone=America/New_York
    [junit] java.awt.printerjob=sun.awt.motif.PSPrinterJob
    [junit] file.encoding=ISO-8859-1
    [junit] build.tests=build/testcases
    [junit] java.specification.version=1.3
    [junit] tests-classpath.value=/home/rubys/jakarta/jakarta-ant/build...
    [junit] user.name=rubys
    [junit] java.class.path=/home/rubys/jakarta/xml-xalan/java/bu...
    [junit] java.vm.specification.version=1.0
    [junit] java.home=/usr/java/jdk1.3.1_02/jre
    [junit] java.specification.vendor=Sun Microsystems Inc.
    [junit] user.language=en
    [junit] java.vm.info=mixed mode
    [junit] java.version=1.3.1_02
    [junit] java.ext.dirs=/usr/java/jdk1.3.1_02/jre/lib/ext
    [junit] sun.boot.class.path=/usr/java/jdk1.3.1_02/jre/lib/rt.jar:...
    [junit] java.vendor=Sun Microsystems Inc.
    [junit] a.set=true
    [junit] file.separator=/
    [junit] java.vendor.url.bug=http://java.sun.com/cgi-bin/bugreport...
    [junit] sun.io.unicode.encoding=UnicodeLittle
    [junit] sun.cpu.endian=little
    [junit] user.region=US
    [junit] sun.cpu.isalist=
    [junit] -- listing properties --
    [junit] java.runtime.name=Java(TM) 2 Runtime Environment, Stand...
    [junit] sun.boot.library.path=/usr/java/jdk1.3.1_02/jre/lib/i386
    [junit] java.vm.version=1.3.1_02-b02
    [junit] ant.java.version=1.3
    [junit] java.vm.vendor=Sun Microsystems Inc.
    [junit] java.vendor.url=http://java.sun.com/
    [junit] path.separator=:
    [junit] java.vm.name=Java HotSpot(TM) Client VM
    [junit] file.encoding.pkg=sun.io
    [junit] java.vm.specification.name=Java Virtual Machine Specification
    [junit] user.dir=/home/rubys/jakarta/jakarta-ant
    [junit] java.runtime.version=1.3.1_02-b02
    [junit] java.awt.graphicsenv=sun.awt.X11GraphicsEnvironment
    [junit] basedir=/home/rubys/jakarta/jakarta-ant/src/e...
    [junit] os.arch=i386
    [junit] java.io.tmpdir=/tmp
    [junit] line.separator=
    [junit] 
    [junit] java.vm.specification.vendor=Sun Microsystems Inc.
    [junit] java.awt.fonts=
    [junit] os.name=Linux
    [junit] ant.home=${ant.home}
    [junit] ant.project.name=test
    [junit] java.library.path=/usr/java/jdk1.3.1_02/jre/lib/i386:/u...
    [junit] test.property=is set
    [junit] java.specification.name=Java Platform API Specification
    [junit] java.class.version=47.0
    [junit] os.version=2.4.7-10
    [junit] ant.file=/home/rubys/jakarta/jakarta-ant/src/e...
    [junit] user.home=/home/rubys
    [junit] b.set=false
    [junit] user.timezone=America/New_York
    [junit] java.awt.printerjob=sun.awt.motif.PSPrinterJob
    [junit] file.encoding=ISO-8859-1
    [junit] build.tests=build/testcases
    [junit] java.specification.version=1.3
    [junit] tests-classpath.value=/home/rubys/jakarta/jakarta-ant/build...
    [junit] user.name=rubys
    [junit] java.class.path=/home/rubys/jakarta/xml-xalan/java/bu...
    [junit] java.vm.specification.version=1.0
    [junit] java.home=/usr/java/jdk1.3.1_02/jre
    [junit] java.specification.vendor=Sun Microsystems Inc.
    [junit] user.language=en
    [junit] java.vm.info=mixed mode
    [junit] java.version=1.3.1_02
    [junit] java.ext.dirs=/usr/java/jdk1.3.1_02/jre/lib/ext
    [junit] sun.boot.class.path=/usr/java/jdk1.3.1_02/jre/lib/rt.jar:...
    [junit] java.vendor=Sun Microsystems Inc.
    [junit] a.set=true
    [junit] file.separator=/
    [junit] java.vendor.url.bug=http://java.sun.com/cgi-bin/bugreport...
    [junit] sun.io.unicode.encoding=UnicodeLittle
    [junit] sun.cpu.endian=little
    [junit] user.region=US
    [junit] sun.cpu.isalist=
    [junit] ------------- ---------------- ---------------
    [junit] Testsuite: org.apache.tools.ant.taskdefs.optional.XmlValidateTest
    [junit] Tests run: 3, Failures: 0, Errors: 3, Time elapsed: 0.632 sec
    [junit] 
    [junit] Testcase: testValidate(org.apache.tools.ant.taskdefs.optional.XmlValidateTest):
Caused an ERROR
    [junit] Could not start xml validation: org.apache.crimson.parser.XMLReaderImpl
    [junit] /home/rubys/jakarta/jakarta-ant/src/etc/testcases/taskdefs/optional/xmlvalidate.xml:5:
Could not start xml validation: org.apache.crimson.parser.XMLReaderImpl
    [junit] 	at org.apache.tools.ant.taskdefs.optional.XMLValidateTask.initValidator(XMLValidateTask.java:325)
    [junit] 	at org.apache.tools.ant.taskdefs.optional.XMLValidateTask.execute(XMLValidateTask.java:255)
    [junit] 	at org.apache.tools.ant.Task.perform(Task.java:313)
    [junit] 	at org.apache.tools.ant.Target.execute(Target.java:309)
    [junit] 	at org.apache.tools.ant.Target.performTasks(Target.java:334)
    [junit] 	at org.apache.tools.ant.Project.executeTarget(Project.java:1174)
    [junit] 	at org.apache.tools.ant.BuildFileTest.executeTarget(BuildFileTest.java:254)
    [junit] 	at org.apache.tools.ant.taskdefs.optional.XmlValidateTest.testValidate(XmlValidateTest.java:104)
    [junit] 	at java.lang.reflect.Method.invoke(Native Method)
    [junit] 	at junit.framework.TestCase.runTest(TestCase.java:158)
    [junit] 	at junit.framework.TestCase.runBare(TestCase.java:131)
    [junit] 	at junit.framework.TestResult$1.protect(TestResult.java:106)
    [junit] 	at junit.framework.TestResult.runProtected(TestResult.java:124)
    [junit] 	at junit.framework.TestResult.run(TestResult.java:109)
    [junit] 	at junit.framework.TestCase.run(TestCase.java:122)
    [junit] 	at junit.framework.TestSuite.runTest(TestSuite.java:208)
    [junit] 	at junit.framework.TestSuite.run(TestSuite.java:203)
    [junit] 	at org.apache.tools.ant.taskdefs.optional.junit.JUnitTestRunner.run(JUnitTestRunner.java:325)
    [junit] 	at org.apache.tools.ant.taskdefs.optional.junit.JUnitTask.executeInVM(JUnitTask.java:797)
    [junit] 	at org.apache.tools.ant.taskdefs.optional.junit.JUnitTask.execute(JUnitTask.java:544)
    [junit] 	at org.apache.tools.ant.taskdefs.optional.junit.JUnitTask.execute(JUnitTask.java:520)
    [junit] 	at org.apache.tools.ant.Task.perform(Task.java:313)
    [junit] 	at org.apache.tools.ant.Target.execute(Target.java:309)
    [junit] 	at org.apache.tools.ant.Target.performTasks(Target.java:334)
    [junit] 	at org.apache.tools.ant.Project.executeTarget(Project.java:1174)
    [junit] 	at org.apache.tools.ant.Project.executeTargets(Project.java:1118)
    [junit] 	at org.apache.tools.ant.Main.runBuild(Main.java:595)
    [junit] 	at org.apache.tools.ant.Main.start(Main.java:185)
    [junit] 	at org.apache.tools.ant.Main.main(Main.java:224)
    [junit] --- Nested Exception ---
    [junit] java.lang.ClassNotFoundException: org.apache.crimson.parser.XMLReaderImpl
    [junit] 	at java.net.URLClassLoader$1.run(URLClassLoader.java:200)
    [junit] 	at java.security.AccessController.doPrivileged(Native Method)
    [junit] 	at java.net.URLClassLoader.findClass(URLClassLoader.java:188)
    [junit] 	at java.lang.ClassLoader.loadClass(ClassLoader.java:299)
    [junit] 	at sun.misc.Launcher$AppClassLoader.loadClass(Launcher.java:286)
    [junit] 	at java.lang.ClassLoader.loadClass(ClassLoader.java:255)
    [junit] 	at java.lang.ClassLoader.loadClassInternal(ClassLoader.java:315)
    [junit] 	at java.lang.Class.forName0(Native Method)
    [junit] 	at java.lang.Class.forName(Class.java:120)
    [junit] 	at org.apache.tools.ant.taskdefs.optional.XMLValidateTask.initValidator(XMLValidateTask.java:304)
    [junit] 	at org.apache.tools.ant.taskdefs.optional.XMLValidateTask.execute(XMLValidateTask.java:255)
    [junit] 	at org.apache.tools.ant.Task.perform(Task.java:313)
    [junit] 	at org.apache.tools.ant.Target.execute(Target.java:309)
    [junit] 	at org.apache.tools.ant.Target.performTasks(Target.java:334)
    [junit] 	at org.apache.tools.ant.Project.executeTarget(Project.java:1174)
    [junit] 	at org.apache.tools.ant.BuildFileTest.executeTarget(BuildFileTest.java:254)
    [junit] 	at org.apache.tools.ant.taskdefs.optional.XmlValidateTest.testValidate(XmlValidateTest.java:104)
    [junit] 	at java.lang.reflect.Method.invoke(Native Method)
    [junit] 	at junit.framework.TestCase.runTest(TestCase.java:158)
    [junit] 	at junit.framework.TestCase.runBare(TestCase.java:131)
    [junit] 	at junit.framework.TestResult$1.protect(TestResult.java:106)
    [junit] 	at junit.framework.TestResult.runProtected(TestResult.java:124)
    [junit] 	at junit.framework.TestResult.run(TestResult.java:109)
    [junit] 	at junit.framework.TestCase.run(TestCase.java:122)
    [junit] 	at junit.framework.TestSuite.runTest(TestSuite.java:208)
    [junit] 	at junit.framework.TestSuite.run(TestSuite.java:203)
    [junit] 	at org.apache.tools.ant.taskdefs.optional.junit.JUnitTestRunner.run(JUnitTestRunner.java:325)
    [junit] 	at org.apache.tools.ant.taskdefs.optional.junit.JUnitTask.executeInVM(JUnitTask.java:797)
    [junit] 	at org.apache.tools.ant.taskdefs.optional.junit.JUnitTask.execute(JUnitTask.java:544)
    [junit] 	at org.apache.tools.ant.taskdefs.optional.junit.JUnitTask.execute(JUnitTask.java:520)
    [junit] 	at org.apache.tools.ant.Task.perform(Task.java:313)
    [junit] 	at org.apache.tools.ant.Target.execute(Target.java:309)
    [junit] 	at org.apache.tools.ant.Target.performTasks(Target.java:334)
    [junit] 	at org.apache.tools.ant.Project.executeTarget(Project.java:1174)
    [junit] 	at org.apache.tools.ant.Project.executeTargets(Project.java:1118)
    [junit] 	at org.apache.tools.ant.Main.runBuild(Main.java:595)
    [junit] 	at org.apache.tools.ant.Main.start(Main.java:185)
    [junit] 	at org.apache.tools.ant.Main.main(Main.java:224)
    [junit] 
    [junit] 
    [junit] Testcase: testDeepValidate(org.apache.tools.ant.taskdefs.optional.XmlValidateTest):
Caused an ERROR
    [junit] Could not start xml validation: org.apache.crimson.parser.XMLReaderImpl
    [junit] /home/rubys/jakarta/jakarta-ant/src/etc/testcases/taskdefs/optional/xml/validate.xml:5:
Could not start xml validation: org.apache.crimson.parser.XMLReaderImpl
    [junit] 	at org.apache.tools.ant.taskdefs.optional.XMLValidateTask.initValidator(XMLValidateTask.java:325)
    [junit] 	at org.apache.tools.ant.taskdefs.optional.XMLValidateTask.execute(XMLValidateTask.java:255)
    [junit] 	at org.apache.tools.ant.Task.perform(Task.java:313)
    [junit] 	at org.apache.tools.ant.Target.execute(Target.java:309)
    [junit] 	at org.apache.tools.ant.Target.performTasks(Target.java:334)
    [junit] 	at org.apache.tools.ant.Project.executeTarget(Project.java:1174)
    [junit] 	at org.apache.tools.ant.taskdefs.Ant.execute(Ant.java:355)
    [junit] 	at org.apache.tools.ant.Task.perform(Task.java:313)
    [junit] 	at org.apache.tools.ant.Target.execute(Target.java:309)
    [junit] 	at org.apache.tools.ant.Target.performTasks(Target.java:334)
    [junit] 	at org.apache.tools.ant.Project.executeTarget(Project.java:1174)
    [junit] 	at org.apache.tools.ant.BuildFileTest.executeTarget(BuildFileTest.java:254)
    [junit] 	at org.apache.tools.ant.taskdefs.optional.XmlValidateTest.testDeepValidate(XmlValidateTest.java:112)
    [junit] 	at java.lang.reflect.Method.invoke(Native Method)
    [junit] 	at junit.framework.TestCase.runTest(TestCase.java:158)
    [junit] 	at junit.framework.TestCase.runBare(TestCase.java:131)
    [junit] 	at junit.framework.TestResult$1.protect(TestResult.java:106)
    [junit] 	at junit.framework.TestResult.runProtected(TestResult.java:124)
    [junit] 	at junit.framework.TestResult.run(TestResult.java:109)
    [junit] 	at junit.framework.TestCase.run(TestCase.java:122)
    [junit] 	at junit.framework.TestSuite.runTest(TestSuite.java:208)
    [junit] 	at junit.framework.TestSuite.run(TestSuite.java:203)
    [junit] 	at org.apache.tools.ant.taskdefs.optional.junit.JUnitTestRunner.run(JUnitTestRunner.java:325)
    [junit] 	at org.apache.tools.ant.taskdefs.optional.junit.JUnitTask.executeInVM(JUnitTask.java:797)
    [junit] 	at org.apache.tools.ant.taskdefs.optional.junit.JUnitTask.execute(JUnitTask.java:544)
    [junit] 	at org.apache.tools.ant.taskdefs.optional.junit.JUnitTask.execute(JUnitTask.java:520)
    [junit] 	at org.apache.tools.ant.Task.perform(Task.java:313)
    [junit] 	at org.apache.tools.ant.Target.execute(Target.java:309)
    [junit] 	at org.apache.tools.ant.Target.performTasks(Target.java:334)
    [junit] 	at org.apache.tools.ant.Project.executeTarget(Project.java:1174)
    [junit] 	at org.apache.tools.ant.Project.executeTargets(Project.java:1118)
    [junit] 	at org.apache.tools.ant.Main.runBuild(Main.java:595)
    [junit] 	at org.apache.tools.ant.Main.start(Main.java:185)
    [junit] 	at org.apache.tools.ant.Main.main(Main.java:224)
    [junit] --- Nested Exception ---
    [junit] java.lang.ClassNotFoundException: org.apache.crimson.parser.XMLReaderImpl
    [junit] 	at java.net.URLClassLoader$1.run(URLClassLoader.java:200)
    [junit] 	at java.security.AccessController.doPrivileged(Native Method)
    [junit] 	at java.net.URLClassLoader.findClass(URLClassLoader.java:188)
    [junit] 	at java.lang.ClassLoader.loadClass(ClassLoader.java:299)
    [junit] 	at sun.misc.Launcher$AppClassLoader.loadClass(Launcher.java:286)
    [junit] 	at java.lang.ClassLoader.loadClass(ClassLoader.java:255)
    [junit] 	at java.lang.ClassLoader.loadClassInternal(ClassLoader.java:315)
    [junit] 	at java.lang.Class.forName0(Native Method)
    [junit] 	at java.lang.Class.forName(Class.java:120)
    [junit] 	at org.apache.tools.ant.taskdefs.optional.XMLValidateTask.initValidator(XMLValidateTask.java:304)
    [junit] 	at org.apache.tools.ant.taskdefs.optional.XMLValidateTask.execute(XMLValidateTask.java:255)
    [junit] 	at org.apache.tools.ant.Task.perform(Task.java:313)
    [junit] 	at org.apache.tools.ant.Target.execute(Target.java:309)
    [junit] 	at org.apache.tools.ant.Target.performTasks(Target.java:334)
    [junit] 	at org.apache.tools.ant.Project.executeTarget(Project.java:1174)
    [junit] 	at org.apache.tools.ant.taskdefs.Ant.execute(Ant.java:355)
    [junit] 	at org.apache.tools.ant.Task.perform(Task.java:313)
    [junit] 	at org.apache.tools.ant.Target.execute(Target.java:309)
    [junit] 	at org.apache.tools.ant.Target.performTasks(Target.java:334)
    [junit] 	at org.apache.tools.ant.Project.executeTarget(Project.java:1174)
    [junit] 	at org.apache.tools.ant.BuildFileTest.executeTarget(BuildFileTest.java:254)
    [junit] 	at org.apache.tools.ant.taskdefs.optional.XmlValidateTest.testDeepValidate(XmlValidateTest.java:112)
    [junit] 	at java.lang.reflect.Method.invoke(Native Method)
    [junit] 	at junit.framework.TestCase.runTest(TestCase.java:158)
    [junit] 	at junit.framework.TestCase.runBare(TestCase.java:131)
    [junit] 	at junit.framework.TestResult$1.protect(TestResult.java:106)
    [junit] 	at junit.framework.TestResult.runProtected(TestResult.java:124)
    [junit] 	at junit.framework.TestResult.run(TestResult.java:109)
    [junit] 	at junit.framework.TestCase.run(TestCase.java:122)
    [junit] 	at junit.framework.TestSuite.runTest(TestSuite.java:208)
    [junit] 	at junit.framework.TestSuite.run(TestSuite.java:203)
    [junit] 	at org.apache.tools.ant.taskdefs.optional.junit.JUnitTestRunner.run(JUnitTestRunner.java:325)
    [junit] 	at org.apache.tools.ant.taskdefs.optional.junit.JUnitTask.executeInVM(JUnitTask.java:797)
    [junit] 	at org.apache.tools.ant.taskdefs.optional.junit.JUnitTask.execute(JUnitTask.java:544)
    [junit] 	at org.apache.tools.ant.taskdefs.optional.junit.JUnitTask.execute(JUnitTask.java:520)
    [junit] 	at org.apache.tools.ant.Task.perform(Task.java:313)
    [junit] 	at org.apache.tools.ant.Target.execute(Target.java:309)
    [junit] 	at org.apache.tools.ant.Target.performTasks(Target.java:334)
    [junit] 	at org.apache.tools.ant.Project.executeTarget(Project.java:1174)
    [junit] 	at org.apache.tools.ant.Project.executeTargets(Project.java:1118)
    [junit] 	at org.apache.tools.ant.Main.runBuild(Main.java:595)
    [junit] 	at org.apache.tools.ant.Main.start(Main.java:185)
    [junit] 	at org.apache.tools.ant.Main.main(Main.java:224)
    [junit] 
    [junit] 
    [junit] Testcase: testXmlCatalog(org.apache.tools.ant.taskdefs.optional.XmlValidateTest):
Caused an ERROR
    [junit] Could not start xml validation: org.apache.crimson.parser.XMLReaderImpl
    [junit] /home/rubys/jakarta/jakarta-ant/src/etc/testcases/taskdefs/optional/xmlvalidate.xml:19:
Could not start xml validation: org.apache.crimson.parser.XMLReaderImpl
    [junit] 	at org.apache.tools.ant.taskdefs.optional.XMLValidateTask.initValidator(XMLValidateTask.java:325)
    [junit] 	at org.apache.tools.ant.taskdefs.optional.XMLValidateTask.execute(XMLValidateTask.java:255)
    [junit] 	at org.apache.tools.ant.Task.perform(Task.java:313)
    [junit] 	at org.apache.tools.ant.Target.execute(Target.java:309)
    [junit] 	at org.apache.tools.ant.Target.performTasks(Target.java:334)
    [junit] 	at org.apache.tools.ant.Project.executeTarget(Project.java:1174)
    [junit] 	at org.apache.tools.ant.BuildFileTest.executeTarget(BuildFileTest.java:254)
    [junit] 	at org.apache.tools.ant.taskdefs.optional.XmlValidateTest.testXmlCatalog(XmlValidateTest.java:119)
    [junit] 	at java.lang.reflect.Method.invoke(Native Method)
    [junit] 	at junit.framework.TestCase.runTest(TestCase.java:158)
    [junit] 	at junit.framework.TestCase.runBare(TestCase.java:131)
    [junit] 	at junit.framework.TestResult$1.protect(TestResult.java:106)
    [junit] 	at junit.framework.TestResult.runProtected(TestResult.java:124)
    [junit] 	at junit.framework.TestResult.run(TestResult.java:109)
    [junit] 	at junit.framework.TestCase.run(TestCase.java:122)
    [junit] 	at junit.framework.TestSuite.runTest(TestSuite.java:208)
    [junit] 	at junit.framework.TestSuite.run(TestSuite.java:203)
    [junit] 	at org.apache.tools.ant.taskdefs.optional.junit.JUnitTestRunner.run(JUnitTestRunner.java:325)
    [junit] 	at org.apache.tools.ant.taskdefs.optional.junit.JUnitTask.executeInVM(JUnitTask.java:797)
    [junit] 	at org.apache.tools.ant.taskdefs.optional.junit.JUnitTask.execute(JUnitTask.java:544)
    [junit] 	at org.apache.tools.ant.taskdefs.optional.junit.JUnitTask.execute(JUnitTask.java:520)
    [junit] 	at org.apache.tools.ant.Task.perform(Task.java:313)
    [junit] 	at org.apache.tools.ant.Target.execute(Target.java:309)
    [junit] 	at org.apache.tools.ant.Target.performTasks(Target.java:334)
    [junit] 	at org.apache.tools.ant.Project.executeTarget(Project.java:1174)
    [junit] 	at org.apache.tools.ant.Project.executeTargets(Project.java:1118)
    [junit] 	at org.apache.tools.ant.Main.runBuild(Main.java:595)
    [junit] 	at org.apache.tools.ant.Main.start(Main.java:185)
    [junit] 	at org.apache.tools.ant.Main.main(Main.java:224)
    [junit] --- Nested Exception ---
    [junit] java.lang.ClassNotFoundException: org.apache.crimson.parser.XMLReaderImpl
    [junit] 	at java.net.URLClassLoader$1.run(URLClassLoader.java:200)
    [junit] 	at java.security.AccessController.doPrivileged(Native Method)
    [junit] 	at java.net.URLClassLoader.findClass(URLClassLoader.java:188)
    [junit] 	at java.lang.ClassLoader.loadClass(ClassLoader.java:299)
    [junit] 	at sun.misc.Launcher$AppClassLoader.loadClass(Launcher.java:286)
    [junit] 	at java.lang.ClassLoader.loadClass(ClassLoader.java:255)
    [junit] 	at java.lang.ClassLoader.loadClassInternal(ClassLoader.java:315)
    [junit] 	at java.lang.Class.forName0(Native Method)
    [junit] 	at java.lang.Class.forName(Class.java:120)
    [junit] 	at org.apache.tools.ant.taskdefs.optional.XMLValidateTask.initValidator(XMLValidateTask.java:304)
    [junit] 	at org.apache.tools.ant.taskdefs.optional.XMLValidateTask.execute(XMLValidateTask.java:255)
    [junit] 	at org.apache.tools.ant.Task.perform(Task.java:313)
    [junit] 	at org.apache.tools.ant.Target.execute(Target.java:309)
    [junit] 	at org.apache.tools.ant.Target.performTasks(Target.java:334)
    [junit] 	at org.apache.tools.ant.Project.executeTarget(Project.java:1174)
    [junit] 	at org.apache.tools.ant.BuildFileTest.executeTarget(BuildFileTest.java:254)
    [junit] 	at org.apache.tools.ant.taskdefs.optional.XmlValidateTest.testXmlCatalog(XmlValidateTest.java:119)
    [junit] 	at java.lang.reflect.Method.invoke(Native Method)
    [junit] 	at junit.framework.TestCase.runTest(TestCase.java:158)
    [junit] 	at junit.framework.TestCase.runBare(TestCase.java:131)
    [junit] 	at junit.framework.TestResult$1.protect(TestResult.java:106)
    [junit] 	at junit.framework.TestResult.runProtected(TestResult.java:124)
    [junit] 	at junit.framework.TestResult.run(TestResult.java:109)
    [junit] 	at junit.framework.TestCase.run(TestCase.java:122)
    [junit] 	at junit.framework.TestSuite.runTest(TestSuite.java:208)
    [junit] 	at junit.framework.TestSuite.run(TestSuite.java:203)
    [junit] 	at org.apache.tools.ant.taskdefs.optional.junit.JUnitTestRunner.run(JUnitTestRunner.java:325)
    [junit] 	at org.apache.tools.ant.taskdefs.optional.junit.JUnitTask.executeInVM(JUnitTask.java:797)
    [junit] 	at org.apache.tools.ant.taskdefs.optional.junit.JUnitTask.execute(JUnitTask.java:544)
    [junit] 	at org.apache.tools.ant.taskdefs.optional.junit.JUnitTask.execute(JUnitTask.java:520)
    [junit] 	at org.apache.tools.ant.Task.perform(Task.java:313)
    [junit] 	at org.apache.tools.ant.Target.execute(Target.java:309)
    [junit] 	at org.apache.tools.ant.Target.performTasks(Target.java:334)
    [junit] 	at org.apache.tools.ant.Project.executeTarget(Project.java:1174)
    [junit] 	at org.apache.tools.ant.Project.executeTargets(Project.java:1118)
    [junit] 	at org.apache.tools.ant.Main.runBuild(Main.java:595)
    [junit] 	at org.apache.tools.ant.Main.start(Main.java:185)
    [junit] 	at org.apache.tools.ant.Main.main(Main.java:224)
    [junit] 
    [junit] 

BUILD FAILED
/home/rubys/jakarta/jakarta-ant/build.xml:1208: Test org.apache.tools.ant.taskdefs.optional.XmlValidateTest
failed

Total time: 2 minutes 12 seconds

--
To unsubscribe, e-mail:   <mailto:ant-dev-unsubscribe@jakarta.apache.org>
For additional commands, e-mail: <mailto:ant-dev-help@jakarta.apache.org>


Mime
View raw message