ant-dev mailing list archives

Site index · List index
Message view « Date » · « Thread »
Top « Date » · « Thread »
From Diane Holt <hol...@apache.org>
Subject [GUMP] Test Failure - Ant
Date Sun, 24 Feb 2002 14:02:40 GMT
----------------------------------------------------
This email is autogenerated from the output from:
<http://jakarta.apache.org/builds/gump/2002-02-24/test-ant.html>
----------------------------------------------------

Buildfile: build.xml

check_for_optional_packages:

xml-check:

dump-sys-properties:

run-which:
    [which] #---- BEGIN: Which report
    [which] Which.version=Which.java:($Revision: 1.2 $) WhichJar.java:($Revision: 1.1 $)
    [which] Which.special-note=No -projects provided, using DEFAULT_PROJECTS
    [which] java.version=1.3.1_02
    [which] file.encoding=ISO-8859-1
    [which] java.ext.dirs=/usr/java/jdk1.3.1_02/jre/lib/ext
    [which] java.class.path=/home/rubys/jakarta/xml-xalan/java/build/xalan.jar:/home/rubys/jakarta/xml-commons/java/external/build/xml-apis.jar:.:/usr/java/jdk1.3.1_02/lib/tools.jar:/usr/java/jdk1.3.1_02/jre/lib/rt.jar:/usr/java/jdk1.3.1_02/lib/tools.jar:/home/rubys/jakarta/jakarta-ant/build/classes:/home/rubys/jakarta/jakarta-ant/build/testcases:/home/rubys/jakarta/jakarta-ant/src/testcases:/home/rubys/jakarta/jakarta-ant/src/etc/testcases:/home/rubys/jakarta/jakarta-ant/build/lib/ant.jar:/home/rubys/jakarta/jakarta-ant/build/lib/optional.jar:/home/rubys/jakarta/xml-commons/java/build/which.jar:/home/rubys/jakarta/jakarta-ant/bootstrap/lib/ant.jar:/home/rubys/jakarta/xml-stylebook/bin/stylebook-1.0-b3_xalan-2.jar:/home/rubys/jakarta/xml-xerces2/java/build/xercesImpl.jar:/home/rubys/jakarta/xml-xerces2/java/build/xmlParserAPIs.jar:/home/rubys/jakarta/jakarta-regexp/bin/jakarta-regexp-20020224.jar:/home/rubys/jakarta/jakarta-slide/lib/antlr-tools.jar:/home/rubys/jakarta/jakarta-slide/lib/antlr.jar:/home/rubys/jakarta/dist/
    [which] junit/junit.jar:/opt/javamail-1.2/mail.jar:/home/rubys/jakarta/jakarta-log4j/dist/lib/log4j-20020224.jar:/home/rubys/jakarta/jakarta-bcel/bin/bcel.jar:/home/rubys/jakarta/jakarta-oro/jakarta-oro-20020224.jar:/home/rubys/jakarta/bsf/build/lib/bsf.jar:/opt/jaf-1.0.1/activation.jar:/home/rubys/jakarta/jakarta-ant/dist/lib/ant.jar:/home/rubys/jakarta/jakarta-ant/dist/lib/optional.jar
    [which] Which.status=.not-found
    [which] os.name=Linux
    [which] java.vendor=Sun Microsystems Inc.
    [which] sun.boot.class.path=/usr/java/jdk1.3.1_02/jre/lib/rt.jar:/usr/java/jdk1.3.1_02/jre/lib/i18n.jar:/usr/java/jdk1.3.1_02/jre/lib/sunrsasign.jar:/usr/java/jdk1.3.1_02/jre/classes
    [which] java.runtime.name=Java(TM) 2 Runtime Environment, Standard Edition
    [which] #---- BEGIN: Xalan.hashinfo
    [which] Xalan22+.version=Xalan Java 2.3.1
    [which] xml-apis.jar.path=/home/rubys/jakarta/xml-commons/java/external/build/xml-apis.jar
    [which] xml-apis.jar.unknown=/usr/java/jdk1.3.1_02/jre/lib/ext/xml-apis.jar does not exist
    [which] Xalan1.version=.not-found
    [which] xml-apis.jar.ok-present=not from an official release, size:107793
    [which] xalan.jar.unknown=/usr/java/jdk1.3.1_02/jre/lib/ext/xalan.jar does not exist
    [which] xalan.jar.path=/home/rubys/jakarta/xml-xalan/java/build/xalan.jar
    [which] xalan.jar.ok-present=not from an official release, size:906847
    [which] Xalan2x.version=Xalan Java 2.3.1
    [which] #----   END: Xalan.hashinfo
    [which] #---- BEGIN: Crimson.hashinfo
    [which] crimson.jar.unknown=/usr/java/jdk1.3.1_02/jre/lib/ext/crimson.jar does not exist
    [which] Crimson.version=.not-found
    [which] #----   END: Crimson.hashinfo
    [which] #---- BEGIN: Xerces.hashinfo
    [which] xmlParserAPIs.jar.unknown=/usr/java/jdk1.3.1_02/jre/lib/ext/xmlParserAPIs.jar
does not exist
    [which] Xerces2.version=Xerces-J 2.0.0
    [which] Xerces1.version=.not-found
    [which] xerces.jar.unknown=/usr/java/jdk1.3.1_02/jre/lib/ext/xerces.jar does not exist
    [which] #----   END: Xerces.hashinfo
    [which] #---- BEGIN: XmlCommons.hashinfo
    [which] dom.jar.unknown=/usr/java/jdk1.3.1_02/jre/lib/ext/dom.jar does not exist
    [which] XmlCommons.jaxp.version=1.1
    [which] sax.jar.unknown=/usr/java/jdk1.3.1_02/jre/lib/ext/sax.jar does not exist
    [which] xml-apis.jar.path=/home/rubys/jakarta/xml-commons/java/external/build/xml-apis.jar
    [which] XmlCommons.sax.version=2.0
    [which] xml-apis.jar.ok-present=not from an official release, size:107793
    [which] xml-apis.jar.unknown=/usr/java/jdk1.3.1_02/jre/lib/ext/xml-apis.jar does not exist
    [which] XmlCommons.version=XmlCommons 1.0
    [which] XmlCommons.dom.version=2.0
    [which] jaxp.jar.unknown=/usr/java/jdk1.3.1_02/jre/lib/ext/jaxp.jar does not exist
    [which] #----   END: XmlCommons.hashinfo
    [which] #---- BEGIN: Ant.hashinfo
    [which] ant.jar.unknown=/usr/java/jdk1.3.1_02/jre/lib/ext/ant.jar does not exist
    [which] Ant.version=Apache Ant version 1.5alpha compiled on February 24 2002
    [which] ant.jar.path=/home/rubys/jakarta/jakarta-ant/build/lib/ant.jar
    [which] ant.jar.ok-present=not from an official release, size:547196
    [which] #---- BEGIN: java.class.path.ant.jar.hashinfo
    [which] ant.jar.unknown=jar on classpath multiple times!
    [which] ant.jar.path=/home/rubys/jakarta/jakarta-ant/dist/lib/ant.jar
    [which] ant.jar.ok-present=not from an official release, size:547196
    [which] #----   END: java.class.path.ant.jar.hashinfo
    [which] #----   END: Ant.hashinfo
    [which] #----   END: Which report

dump-info:

prepare:

build:
     [copy] Copying 2 files to /home/rubys/jakarta/jakarta-ant/build/classes

compile-tests:
    [javac] Compiling 111 source files to /home/rubys/jakarta/jakarta-ant/build/testcases
    [javac] Note: Some input files use or override a deprecated API.
    [javac] Note: Recompile with -deprecation for details.

run-tests:
    [junit] Testsuite: org.apache.tools.ant.taskdefs.optional.junit.JUnitTestRunnerTest
    [junit] Tests run: 5, Failures: 0, Errors: 0, Time elapsed: 0.072 sec
    [junit] 
    [junit] Testsuite: org.apache.tools.ant.taskdefs.optional.perforce.P4ChangeTest
    [junit] Tests run: 2, Failures: 0, Errors: 0, Time elapsed: 0.274 sec
    [junit] 
    [junit] Testsuite: org.apache.tools.ant.taskdefs.optional.sitraka.ClassPathLoaderTest
    [junit] Tests run: 1, Failures: 0, Errors: 0, Time elapsed: 10.742 sec
    [junit] 
    [junit] ------------- Standard Output ---------------
    [junit] Processing /usr/java/jdk1.3.1_02/jre/lib/rt.jar
    [junit] 5299 classes loaded in 10650ms
    [junit] ------------- ---------------- ---------------
    [junit] Testsuite: org.apache.tools.ant.taskdefs.optional.sitraka.ClassFileTest
    [junit] Tests run: 1, Failures: 0, Errors: 0, Time elapsed: 0.014 sec
    [junit] 
    [junit] Testsuite: org.apache.tools.ant.taskdefs.optional.PropertyFileTest
    [junit] Tests run: 2, Failures: 0, Errors: 2, Time elapsed: 1.398 sec
    [junit] 
    [junit] Testcase: testUpdatesExistingProperties(org.apache.tools.ant.taskdefs.optional.PropertyFileTest):
Caused an ERROR
    [junit] org.apache.xerces.parsers.StandardParserConfiguration
    [junit] java.lang.ClassCastException: org.apache.xerces.parsers.StandardParserConfiguration
    [junit] 	at org.apache.xerces.parsers.SAXParser.<init>(Unknown Source)
    [junit] 	at org.apache.xerces.jaxp.SAXParserImpl.<init>(Unknown Source)
    [junit] 	at org.apache.xerces.jaxp.SAXParserFactoryImpl.newSAXParser(Unknown Source)
    [junit] 	at org.apache.tools.ant.ProjectHelper.parse(ProjectHelper.java:119)
    [junit] 	at org.apache.tools.ant.ProjectHelper.configureProject(ProjectHelper.java:99)
    [junit] 	at org.apache.tools.ant.BuildFileTest.configureProject(BuildFileTest.java:215)
    [junit] 	at org.apache.tools.ant.taskdefs.optional.PropertyFileTest.setUp(PropertyFileTest.java:87)
    [junit] 	at junit.framework.TestCase.runBare(TestCase.java:129)
    [junit] 	at junit.framework.TestResult$1.protect(TestResult.java:106)
    [junit] 	at junit.framework.TestResult.runProtected(TestResult.java:124)
    [junit] 	at junit.framework.TestResult.run(TestResult.java:109)
    [junit] 	at junit.framework.TestCase.run(TestCase.java:122)
    [junit] 	at junit.framework.TestSuite.runTest(TestSuite.java:173)
    [junit] 	at junit.framework.TestSuite.run(TestSuite.java:168)
    [junit] 	at org.apache.tools.ant.taskdefs.optional.junit.JUnitTestRunner.run(JUnitTestRunner.java:265)
    [junit] 	at org.apache.tools.ant.taskdefs.optional.junit.JUnitTask.executeInVM(JUnitTask.java:644)
    [junit] 	at org.apache.tools.ant.taskdefs.optional.junit.JUnitTask.execute(JUnitTask.java:446)
    [junit] 	at org.apache.tools.ant.taskdefs.optional.junit.JUnitTask.execute(JUnitTask.java:423)
    [junit] 	at org.apache.tools.ant.Task.perform(Task.java:223)
    [junit] 	at org.apache.tools.ant.Target.execute(Target.java:186)
    [junit] 	at org.apache.tools.ant.Target.performTasks(Target.java:204)
    [junit] 	at org.apache.tools.ant.Project.executeTarget(Project.java:931)
    [junit] 	at org.apache.tools.ant.Project.executeTargets(Project.java:885)
    [junit] 	at org.apache.tools.ant.Main.runBuild(Main.java:527)
    [junit] 	at org.apache.tools.ant.Main.start(Main.java:163)
    [junit] 	at org.apache.tools.ant.Main.main(Main.java:187)
    [junit] 
    [junit] 
    [junit] Testcase: testExerciseDefaultAndIncrement(org.apache.tools.ant.taskdefs.optional.PropertyFileTest):
Caused an ERROR
    [junit] org.apache.xerces.parsers.StandardParserConfiguration
    [junit] java.lang.ClassCastException: org.apache.xerces.parsers.StandardParserConfiguration
    [junit] 	at org.apache.xerces.parsers.SAXParser.<init>(Unknown Source)
    [junit] 	at org.apache.xerces.jaxp.SAXParserImpl.<init>(Unknown Source)
    [junit] 	at org.apache.xerces.jaxp.SAXParserFactoryImpl.newSAXParser(Unknown Source)
    [junit] 	at org.apache.tools.ant.ProjectHelper.parse(ProjectHelper.java:119)
    [junit] 	at org.apache.tools.ant.ProjectHelper.configureProject(ProjectHelper.java:99)
    [junit] 	at org.apache.tools.ant.BuildFileTest.configureProject(BuildFileTest.java:215)
    [junit] 	at org.apache.tools.ant.taskdefs.optional.PropertyFileTest.setUp(PropertyFileTest.java:87)
    [junit] 	at junit.framework.TestCase.runBare(TestCase.java:129)
    [junit] 	at junit.framework.TestResult$1.protect(TestResult.java:106)
    [junit] 	at junit.framework.TestResult.runProtected(TestResult.java:124)
    [junit] 	at junit.framework.TestResult.run(TestResult.java:109)
    [junit] 	at junit.framework.TestCase.run(TestCase.java:122)
    [junit] 	at junit.framework.TestSuite.runTest(TestSuite.java:173)
    [junit] 	at junit.framework.TestSuite.run(TestSuite.java:168)
    [junit] 	at org.apache.tools.ant.taskdefs.optional.junit.JUnitTestRunner.run(JUnitTestRunner.java:265)
    [junit] 	at org.apache.tools.ant.taskdefs.optional.junit.JUnitTask.executeInVM(JUnitTask.java:644)
    [junit] 	at org.apache.tools.ant.taskdefs.optional.junit.JUnitTask.execute(JUnitTask.java:446)
    [junit] 	at org.apache.tools.ant.taskdefs.optional.junit.JUnitTask.execute(JUnitTask.java:423)
    [junit] 	at org.apache.tools.ant.Task.perform(Task.java:223)
    [junit] 	at org.apache.tools.ant.Target.execute(Target.java:186)
    [junit] 	at org.apache.tools.ant.Target.performTasks(Target.java:204)
    [junit] 	at org.apache.tools.ant.Project.executeTarget(Project.java:931)
    [junit] 	at org.apache.tools.ant.Project.executeTargets(Project.java:885)
    [junit] 	at org.apache.tools.ant.Main.runBuild(Main.java:527)
    [junit] 	at org.apache.tools.ant.Main.start(Main.java:163)
    [junit] 	at org.apache.tools.ant.Main.main(Main.java:187)
    [junit] 
    [junit] 

BUILD FAILED
/home/rubys/jakarta/jakarta-ant/build.xml:1088: Test org.apache.tools.ant.taskdefs.optional.PropertyFileTest
failed

Total time: 45 seconds

--
To unsubscribe, e-mail:   <mailto:ant-dev-unsubscribe@jakarta.apache.org>
For additional commands, e-mail: <mailto:ant-dev-help@jakarta.apache.org>


Mime
View raw message