ant-dev mailing list archives

Site index · List index
Message view « Date » · « Thread »
Top « Date » · « Thread »
From Diane Holt <hol...@apache.org>
Subject [GUMP] Test Failure - Ant
Date Fri, 01 Feb 2002 13:25:20 GMT
----------------------------------------------------
This email is autogenerated from the output from:
<http://jakarta.apache.org/builds/gump/2002-02-01/test-ant.html>
----------------------------------------------------

Buildfile: build.xml

check_for_optional_packages:

xml-check:

dump-sys-properties:

run-which:
    [which] #---- BEGIN: Which report
    [which] Which.version=Which.java:($Revision: 1.2 $) WhichJar.java:($Revision: 1.1 $)
    [which] Which.special-note=No -projects provided, using DEFAULT_PROJECTS
    [which] java.version=1.3.1_02
    [which] file.encoding=ISO-8859-1
    [which] java.ext.dirs=/usr/java/jdk1.3.1_02/jre/lib/ext
    [which] java.class.path=/home/rubys/jakarta/xml-xalan/java/build/xalan.jar:/home/rubys/jakarta/xml-xerces/java/build/xerces.jar:/home/rubys/jakarta/xml-commons/java/external/build/xml-apis.jar:.:/usr/java/jdk1.3.1_02/lib/tools.jar:/usr/java/jdk1.3.1_02/jre/lib/rt.jar:/usr/java/jdk1.3.1_02/lib/tools.jar:/home/rubys/jakarta/jakarta-ant/build/classes:/home/rubys/jakarta/jakarta-ant/build/testcases:/home/rubys/jakarta/jakarta-ant/src/testcases:/home/rubys/jakarta/jakarta-ant/src/etc/testcases:/home/rubys/jakarta/jakarta-ant/build/lib/ant.jar:/home/rubys/jakarta/jakarta-ant/build/lib/optional.jar:/home/rubys/jakarta/xml-commons/java/build/which.jar:/home/rubys/jakarta/jakarta-ant/bootstrap/lib/ant.jar:/home/rubys/jakarta/xml-stylebook/bin/stylebook-1.0-b3_xalan-2.jar:/home/rubys/jakarta/jakarta-regexp/jakarta-regexp-1.3-dev/jakarta-regexp-1.3-dev.jar:/home/rubys/jakarta/jakarta-slide/lib/antlr-tools.jar:/home/rubys/jakarta/jakarta-slide/lib/antlr.jar:/home/rubys/jakarta/dist/junit/junit.jar:/opt/javamail-1.2/mail.jar:/home
    [which] /rubys/jakarta/jakarta-log4j/dist/lib/log4j-20020201.jar:/home/rubys/jakarta/jakarta-bcel/bin/bcel.jar:/home/rubys/jakarta/jakarta-oro/jakarta-oro-20020201/jakarta-oro-20020201.jar:/home/rubys/jakarta/bsf/build/lib/bsf.jar:/opt/jaf-1.0.1/activation.jar:/home/rubys/jakarta/jakarta-ant/dist/lib/ant.jar:/home/rubys/jakarta/jakarta-ant/dist/lib/optional.jar
    [which] Which.status=.not-found
    [which] os.name=Linux
    [which] java.vendor=Sun Microsystems Inc.
    [which] sun.boot.class.path=/usr/java/jdk1.3.1_02/jre/lib/rt.jar:/usr/java/jdk1.3.1_02/jre/lib/i18n.jar:/usr/java/jdk1.3.1_02/jre/lib/sunrsasign.jar:/usr/java/jdk1.3.1_02/jre/classes
    [which] java.runtime.name=Java(TM) 2 Runtime Environment, Standard Edition
    [which] #---- BEGIN: Xalan.hashinfo
    [which] Xalan22+.version=Xalan Java 2.2.0
    [which] xml-apis.jar.path=/home/rubys/jakarta/xml-commons/java/external/build/xml-apis.jar
    [which] xml-apis.jar.unknown=/usr/java/jdk1.3.1_02/jre/lib/ext/xml-apis.jar does not exist
    [which] Xalan1.version=.not-found
    [which] xml-apis.jar.ok-present=not from an official release, size:100193
    [which] xalan.jar.unknown=/usr/java/jdk1.3.1_02/jre/lib/ext/xalan.jar does not exist
    [which] xalan.jar.path=/home/rubys/jakarta/xml-xalan/java/build/xalan.jar
    [which] xalan.jar.ok-present=not from an official release, size:905502
    [which] Xalan2x.version=Xalan Java 2.2.0
    [which] #----   END: Xalan.hashinfo
    [which] #---- BEGIN: Crimson.hashinfo
    [which] crimson.jar.unknown=/usr/java/jdk1.3.1_02/jre/lib/ext/crimson.jar does not exist
    [which] Crimson.version=.not-found
    [which] #----   END: Crimson.hashinfo
    [which] #---- BEGIN: Xerces.hashinfo
    [which] xmlParserAPIs.jar.unknown=/usr/java/jdk1.3.1_02/jre/lib/ext/xmlParserAPIs.jar
does not exist
    [which] xerces.jar.ok-present=not from an official release, size:1543556
    [which] Xerces2.version=.not-found
    [which] Xerces1.version=Xerces 1.4.4
    [which] xerces.jar.path=/home/rubys/jakarta/xml-xerces/java/build/xerces.jar
    [which] xerces.jar.unknown=/usr/java/jdk1.3.1_02/jre/lib/ext/xerces.jar does not exist
    [which] #----   END: Xerces.hashinfo
    [which] #---- BEGIN: XmlCommons.hashinfo
    [which] dom.jar.unknown=/usr/java/jdk1.3.1_02/jre/lib/ext/dom.jar does not exist
    [which] XmlCommons.jaxp.version=1.1
    [which] sax.jar.unknown=/usr/java/jdk1.3.1_02/jre/lib/ext/sax.jar does not exist
    [which] xml-apis.jar.path=/home/rubys/jakarta/xml-commons/java/external/build/xml-apis.jar
    [which] XmlCommons.sax.version=2.0
    [which] xml-apis.jar.ok-present=not from an official release, size:100193
    [which] xml-apis.jar.unknown=/usr/java/jdk1.3.1_02/jre/lib/ext/xml-apis.jar does not exist
    [which] XmlCommons.version=XmlCommons 1.0
    [which] XmlCommons.dom.version=2.0
    [which] jaxp.jar.unknown=/usr/java/jdk1.3.1_02/jre/lib/ext/jaxp.jar does not exist
    [which] #----   END: XmlCommons.hashinfo
    [which] #---- BEGIN: Ant.hashinfo
    [which] ant.jar.unknown=/usr/java/jdk1.3.1_02/jre/lib/ext/ant.jar does not exist
    [which] Ant.version=Apache Ant version 1.5alpha compiled on February 1 2002
    [which] ant.jar.path=/home/rubys/jakarta/jakarta-ant/build/lib/ant.jar
    [which] ant.jar.ok-present=not from an official release, size:561499
    [which] #---- BEGIN: java.class.path.ant.jar.hashinfo
    [which] ant.jar.unknown=jar on classpath multiple times!
    [which] ant.jar.path=/home/rubys/jakarta/jakarta-ant/dist/lib/ant.jar
    [which] ant.jar.ok-present=not from an official release, size:543506
    [which] #----   END: java.class.path.ant.jar.hashinfo
    [which] #----   END: Ant.hashinfo
    [which] #----   END: Which report

dump-info:

prepare:

build:
     [copy] Copying 2 files to /home/rubys/jakarta/jakarta-ant/build/classes

compile-tests:
    [javac] Compiling 104 source files to /home/rubys/jakarta/jakarta-ant/build/testcases
    [javac] Note: Some input files use or override a deprecated API.
    [javac] Note: Recompile with -deprecation for details.

run-tests:
    [junit] Testsuite: org.apache.tools.ant.taskdefs.optional.junit.JUnitTestRunnerTest
    [junit] Tests run: 5, Failures: 0, Errors: 0, Time elapsed: 0.075 sec
    [junit] 
    [junit] Testsuite: org.apache.tools.ant.taskdefs.optional.perforce.P4ChangeTest
    [junit] Tests run: 2, Failures: 0, Errors: 0, Time elapsed: 0.29 sec
    [junit] 
    [junit] Testsuite: org.apache.tools.ant.taskdefs.optional.sitraka.ClassPathLoaderTest
    [junit] Tests run: 1, Failures: 0, Errors: 0, Time elapsed: 10.321 sec
    [junit] 
    [junit] ------------- Standard Output ---------------
    [junit] Processing /usr/java/jdk1.3.1_02/jre/lib/rt.jar
    [junit] 5299 classes loaded in 10211ms
    [junit] ------------- ---------------- ---------------
    [junit] Testsuite: org.apache.tools.ant.taskdefs.optional.sitraka.ClassFileTest
    [junit] Tests run: 1, Failures: 0, Errors: 0, Time elapsed: 0.014 sec
    [junit] 
    [junit] Testsuite: org.apache.tools.ant.taskdefs.optional.sitraka.XMLReportTest
    [junit] Tests run: 1, Failures: 0, Errors: 0, Time elapsed: 17.85 sec
    [junit] 
    [junit] Testsuite: org.apache.tools.ant.taskdefs.optional.PropertyFileTest
    [junit] Tests run: 1, Failures: 0, Errors: 0, Time elapsed: 0.373 sec
    [junit] 
    [junit] Testsuite: org.apache.tools.ant.taskdefs.optional.ANTLRTest
    [junit] Tests run: 7, Failures: 0, Errors: 0, Time elapsed: 39.63 sec
    [junit] 
    [junit] Testsuite: org.apache.tools.ant.taskdefs.optional.sos.SOSTest
    [junit] Tests run: 11, Failures: 0, Errors: 0, Time elapsed: 0.05 sec
    [junit] 
    [junit] Testsuite: org.apache.tools.ant.taskdefs.optional.ReplaceRegExpTest
    [junit] Tests run: 1, Failures: 0, Errors: 0, Time elapsed: 0.201 sec
    [junit] 
    [junit] Testsuite: org.apache.tools.ant.taskdefs.optional.TraXLiaisonTest
    [junit] Tests run: 4, Failures: 0, Errors: 0, Time elapsed: 5.774 sec
    [junit] 
    [junit] Testsuite: org.apache.tools.ant.taskdefs.condition.EqualsTest
    [junit] Tests run: 2, Failures: 0, Errors: 0, Time elapsed: 0.002 sec
    [junit] 
    [junit] Testsuite: org.apache.tools.ant.taskdefs.AntStructureTest
    [junit] Tests run: 1, Failures: 0, Errors: 0, Time elapsed: 0.132 sec
    [junit] 
    [junit] Testsuite: org.apache.tools.ant.taskdefs.AntTest
    [junit] Tests run: 14, Failures: 0, Errors: 0, Time elapsed: 2.843 sec
    [junit] 
    [junit] Testsuite: org.apache.tools.ant.taskdefs.AvailableTest
    [junit] Tests run: 19, Failures: 0, Errors: 0, Time elapsed: 2.459 sec
    [junit] 
    [junit] Testsuite: org.apache.tools.ant.taskdefs.ChecksumTest
    [junit] Tests run: 4, Failures: 0, Errors: 0, Time elapsed: 1.173 sec
    [junit] 
    [junit] Testsuite: org.apache.tools.ant.taskdefs.BUnzip2Test
    [junit] Tests run: 1, Failures: 0, Errors: 0, Time elapsed: 4.613 sec
    [junit] 
    [junit] Testsuite: org.apache.tools.ant.taskdefs.BZip2Test
    [junit] Tests run: 1, Failures: 0, Errors: 0, Time elapsed: 34.522 sec
    [junit] 
    [junit] Testsuite: org.apache.tools.ant.taskdefs.CVSPassTest
    [junit] Tests run: 5, Failures: 0, Errors: 0, Time elapsed: 0.703 sec
    [junit] 
    [junit] Testsuite: org.apache.tools.ant.taskdefs.CopydirTest
    [junit] Tests run: 6, Failures: 0, Errors: 0, Time elapsed: 3.761 sec
    [junit] 
    [junit] Testsuite: org.apache.tools.ant.taskdefs.CopyfileTest
    [junit] Tests run: 6, Failures: 0, Errors: 0, Time elapsed: 0.734 sec
    [junit] 
    [junit] Testsuite: org.apache.tools.ant.taskdefs.DeleteTest
    [junit] Tests run: 3, Failures: 0, Errors: 0, Time elapsed: 1.481 sec
    [junit] 
    [junit] Testsuite: org.apache.tools.ant.taskdefs.DeltreeTest
    [junit] Tests run: 2, Failures: 0, Errors: 0, Time elapsed: 0.229 sec
    [junit] 
    [junit] Testsuite: org.apache.tools.ant.taskdefs.ConditionTest
    [junit] Tests run: 23, Failures: 0, Errors: 0, Time elapsed: 3.599 sec
    [junit] 
    [junit] Testsuite: org.apache.tools.ant.taskdefs.EchoTest
    [junit] Tests run: 3, Failures: 0, Errors: 0, Time elapsed: 0.359 sec
    [junit] 
    [junit] Testsuite: org.apache.tools.ant.taskdefs.DependSetTest
    [junit] Tests run: 5, Failures: 0, Errors: 0, Time elapsed: 3.692 sec
    [junit] 
    [junit] Testsuite: org.apache.tools.ant.taskdefs.FailTest
    [junit] Tests run: 5, Failures: 0, Errors: 0, Time elapsed: 0.605 sec
    [junit] 
    [junit] Testsuite: org.apache.tools.ant.taskdefs.FilterTest
    [junit] Tests run: 8, Failures: 0, Errors: 0, Time elapsed: 1.077 sec
    [junit] 
    [junit] Testsuite: org.apache.tools.ant.taskdefs.CopyTest
    [junit] Tests run: 3, Failures: 0, Errors: 0, Time elapsed: 8.415 sec
    [junit] 
    [junit] Testsuite: org.apache.tools.ant.taskdefs.GUnzipTest
    [junit] Tests run: 4, Failures: 0, Errors: 0, Time elapsed: 0.604 sec
    [junit] 
    [junit] Testsuite: org.apache.tools.ant.taskdefs.GetTest
    [junit] Tests run: 6, Failures: 0, Errors: 1, Time elapsed: 1.146 sec
    [junit] 
    [junit] Testcase: test6(org.apache.tools.ant.taskdefs.GetTest):	Caused an ERROR
    [junit] java.net.ConnectException: Connection refused
    [junit] /home/rubys/jakarta/jakarta-ant/src/etc/testcases/taskdefs/get.xml:26: java.net.ConnectException:
Connection refused
    [junit] 	at org.apache.tools.ant.taskdefs.Get.execute(Get.java:232)
    [junit] 	at org.apache.tools.ant.Task.perform(Task.java:223)
    [junit] 	at org.apache.tools.ant.Target.execute(Target.java:186)
    [junit] 	at org.apache.tools.ant.Target.performTasks(Target.java:204)
    [junit] 	at org.apache.tools.ant.Project.executeTarget(Project.java:921)
    [junit] 	at org.apache.tools.ant.BuildFileTest.executeTarget(BuildFileTest.java:187)
    [junit] 	at org.apache.tools.ant.taskdefs.GetTest.test6(GetTest.java:94)
    [junit] 	at java.lang.reflect.Method.invoke(Native Method)
    [junit] 	at junit.framework.TestCase.runTest(TestCase.java:157)
    [junit] 	at junit.framework.TestCase.runBare(TestCase.java:131)
    [junit] 	at junit.framework.TestResult$1.protect(TestResult.java:106)
    [junit] 	at junit.framework.TestResult.runProtected(TestResult.java:124)
    [junit] 	at junit.framework.TestResult.run(TestResult.java:109)
    [junit] 	at junit.framework.TestCase.run(TestCase.java:122)
    [junit] 	at junit.framework.TestSuite.runTest(TestSuite.java:173)
    [junit] 	at junit.framework.TestSuite.run(TestSuite.java:168)
    [junit] 	at org.apache.tools.ant.taskdefs.optional.junit.JUnitTestRunner.run(JUnitTestRunner.java:265)
    [junit] 	at org.apache.tools.ant.taskdefs.optional.junit.JUnitTask.executeInVM(JUnitTask.java:643)
    [junit] 	at org.apache.tools.ant.taskdefs.optional.junit.JUnitTask.execute(JUnitTask.java:446)
    [junit] 	at org.apache.tools.ant.taskdefs.optional.junit.JUnitTask.execute(JUnitTask.java:423)
    [junit] 	at org.apache.tools.ant.Task.perform(Task.java:223)
    [junit] 	at org.apache.tools.ant.Target.execute(Target.java:186)
    [junit] 	at org.apache.tools.ant.Target.performTasks(Target.java:204)
    [junit] 	at org.apache.tools.ant.Project.executeTarget(Project.java:921)
    [junit] 	at org.apache.tools.ant.Project.executeTargets(Project.java:875)
    [junit] 	at org.apache.tools.ant.Main.runBuild(Main.java:481)
    [junit] 	at org.apache.tools.ant.Main.start(Main.java:159)
    [junit] 	at org.apache.tools.ant.Main.main(Main.java:183)
    [junit] --- Nested Exception ---
    [junit] java.net.ConnectException: Connection refused
    [junit] 	at java.net.PlainSocketImpl.socketConnect(Native Method)
    [junit] 	at java.net.PlainSocketImpl.doConnect(PlainSocketImpl.java:355)
    [junit] 	at java.net.PlainSocketImpl.connectToAddress(PlainSocketImpl.java:142)
    [junit] 	at java.net.PlainSocketImpl.connect(PlainSocketImpl.java:129)
    [junit] 	at java.net.Socket.<init>(Socket.java:273)
    [junit] 	at java.net.Socket.<init>(Socket.java:100)
    [junit] 	at sun.net.NetworkClient.doConnect(NetworkClient.java:50)
    [junit] 	at sun.net.www.http.HttpClient.openServer(HttpClient.java:335)
    [junit] 	at sun.net.www.http.HttpClient.openServer(HttpClient.java:521)
    [junit] 	at sun.net.www.http.HttpClient.<init>(HttpClient.java:271)
    [junit] 	at sun.net.www.http.HttpClient.<init>(HttpClient.java:281)
    [junit] 	at sun.net.www.http.HttpClient.New(HttpClient.java:293)
    [junit] 	at sun.net.www.protocol.http.HttpURLConnection.connect(HttpURLConnection.java:404)
    [junit] 	at org.apache.tools.ant.taskdefs.Get.execute(Get.java:156)
    [junit] 	at org.apache.tools.ant.Task.perform(Task.java:223)
    [junit] 	at org.apache.tools.ant.Target.execute(Target.java:186)
    [junit] 	at org.apache.tools.ant.Target.performTasks(Target.java:204)
    [junit] 	at org.apache.tools.ant.Project.executeTarget(Project.java:921)
    [junit] 	at org.apache.tools.ant.BuildFileTest.executeTarget(BuildFileTest.java:187)
    [junit] 	at org.apache.tools.ant.taskdefs.GetTest.test6(GetTest.java:94)
    [junit] 	at java.lang.reflect.Method.invoke(Native Method)
    [junit] 	at junit.framework.TestCase.runTest(TestCase.java:157)
    [junit] 	at junit.framework.TestCase.runBare(TestCase.java:131)
    [junit] 	at junit.framework.TestResult$1.protect(TestResult.java:106)
    [junit] 	at junit.framework.TestResult.runProtected(TestResult.java:124)
    [junit] 	at junit.framework.TestResult.run(TestResult.java:109)
    [junit] 	at junit.framework.TestCase.run(TestCase.java:122)
    [junit] 	at junit.framework.TestSuite.runTest(TestSuite.java:173)
    [junit] 	at junit.framework.TestSuite.run(TestSuite.java:168)
    [junit] 	at org.apache.tools.ant.taskdefs.optional.junit.JUnitTestRunner.run(JUnitTestRunner.java:265)
    [junit] 	at org.apache.tools.ant.taskdefs.optional.junit.JUnitTask.executeInVM(JUnitTask.java:643)
    [junit] 	at org.apache.tools.ant.taskdefs.optional.junit.JUnitTask.execute(JUnitTask.java:446)
    [junit] 	at org.apache.tools.ant.taskdefs.optional.junit.JUnitTask.execute(JUnitTask.java:423)
    [junit] 	at org.apache.tools.ant.Task.perform(Task.java:223)
    [junit] 	at org.apache.tools.ant.Target.execute(Target.java:186)
    [junit] 	at org.apache.tools.ant.Target.performTasks(Target.java:204)
    [junit] 	at org.apache.tools.ant.Project.executeTarget(Project.java:921)
    [junit] 	at org.apache.tools.ant.Project.executeTargets(Project.java:875)
    [junit] 	at org.apache.tools.ant.Main.runBuild(Main.java:481)
    [junit] 	at org.apache.tools.ant.Main.start(Main.java:159)
    [junit] 	at org.apache.tools.ant.Main.main(Main.java:183)
    [junit] 
    [junit] 

BUILD FAILED
/home/rubys/jakarta/jakarta-ant/build.xml:875: Test org.apache.tools.ant.taskdefs.GetTest
failed

Total time: 3 minutes, no seconds.

--
To unsubscribe, e-mail:   <mailto:ant-dev-unsubscribe@jakarta.apache.org>
For additional commands, e-mail: <mailto:ant-dev-help@jakarta.apache.org>


Mime
View raw message