ant-dev mailing list archives

Site index · List index
Message view « Date » · « Thread »
Top « Date » · « Thread »
From bugzi...@apache.org
Subject DO NOT REPLY [Bug 3974] New: - Apache Ver.1.3.12 make problem -- 'make does no go thtough'
Date Thu, 04 Oct 2001 16:46:20 GMT
DO NOT REPLY TO THIS EMAIL, BUT PLEASE POST YOUR BUG 
RELATED COMMENTS THROUGH THE WEB INTERFACE AVAILABLE AT
<http://nagoya.apache.org/bugzilla/show_bug.cgi?id=3974>.
ANY REPLY MADE TO THIS MESSAGE WILL NOT BE COLLECTED AND 
INSERTED IN THE BUG DATABASE.

http://nagoya.apache.org/bugzilla/show_bug.cgi?id=3974

Apache Ver.1.3.12 make problem -- 'make does no go thtough'

           Summary: Apache Ver.1.3.12 make problem -- 'make does no go
                    thtough'
           Product: Ant
           Version: 1.3
          Platform: Sun
        OS/Version: Solaris
            Status: NEW
          Severity: Blocker
          Priority: Other
         Component: Build Process
        AssignedTo: ant-dev@jakarta.apache.org
        ReportedBy: sachink@boss-solutions.com


Dear all,

I am trying to install Apache 1.3.12 from source on solaris 2.6
Configuration process complets successfully but while 'make', I get following 
error
message.

I've gone through similar problem reported earlier and tried the same but could 
not resolve the issue.

I did,

%./configure --prefix=/usr/local/apache
make 

Error message

"ap_snprintf.c", line 1163: va_start: argument 
mismatch                            
ap_snprintf.c: In function 
`ap_snprintf':                                          
ap_snprintf.c:1163: `__builtin_va_alist' undeclared (first use in this 
function)   
ap_snprintf.c:1163: (Each undeclared identifier is reported only 
once              
ap_snprintf.c:1163: for each function it appears 
in.)                              
gmake[2]: *** [ap_snprintf.o] Error 
1                                              
gmake[1]: *** [subdirs] Error 
1                                                    
gmake: *** [build-std] Error 
2                                                     
make: Fatal error: Command failed for target 
`build'                               

Anybody's help is highly appreciated.

Sachin

Mime
View raw message