ant-dev mailing list archives

Site index · List index
Message view « Date » · « Thread »
Top « Date » · « Thread »
From Diane Holt <hol...@apache.org>
Subject [GUMP] Test Failure - Ant
Date Fri, 30 Mar 2001 17:33:14 GMT
----------------------------------------------------
This email is autogenerated from the output from:
<http://jakarta.apache.org/builds/gump/2001-03-30/test-ant.html>
----------------------------------------------------

Buildfile: build.xml

dump-info:
     [echo] java.vm.info=mixed mode
     [echo] java.vm.name=Java HotSpot(TM) Client VM
     [echo] java.vm.vendor=Sun Microsystems Inc.
     [echo] java.vm.version=1.3.0
     [echo] os.arch=i386
     [echo] os.name=Linux
     [echo] os.version=2.2.14-5.0
     [echo] file.encoding=ISO-8859-1
     [echo] user.language=en

prepare:

check_for_optional_packages:

build:
     [copy] Copying 2 files to /home/rubys/jakarta/jakarta-ant/build/classes

compile-tests:
    [mkdir] Created dir: /home/rubys/jakarta/jakarta-ant/build/testcases
    [javac] Compiling 41 source files to /home/rubys/jakarta/jakarta-ant/build/testcases

run-tests:
    [junit] Testsuite: org.apache.tools.ant.taskdefs.AntStructureTest
    [junit] Tests run: 1, Failures: 0, Errors: 0, Time elapsed: 0.137 sec
    [junit] 
    [junit] Testcase: test1 took 0.13 sec
    [junit] Testsuite: org.apache.tools.ant.taskdefs.AntTest
    [junit] Tests run: 6, Failures: 0, Errors: 0, Time elapsed: 0.69 sec
    [junit] 
    [junit] Testcase: test1 took 0.159 sec
    [junit] Testcase: test2 took 0.08 sec
    [junit] Testcase: test3 took 0.103 sec
    [junit] Testcase: test4 took 0.111 sec
    [junit] Testcase: test5 took 0.125 sec
    [junit] Testcase: test6 took 0.112 sec
    [junit] Testsuite: org.apache.tools.ant.taskdefs.AvailableTest
    [junit] Tests run: 14, Failures: 0, Errors: 0, Time elapsed: 1.533 sec
    [junit] 
    [junit] Testcase: test1 took 0.105 sec
    [junit] Testcase: test2 took 0.082 sec
    [junit] Testcase: test3 took 0.104 sec
    [junit] Testcase: test4 took 0.245 sec
    [junit] Testcase: test5 took 0.101 sec
    [junit] Testcase: test6 took 0.087 sec
    [junit] Testcase: test7 took 0.101 sec
    [junit] Testcase: test8 took 0.117 sec
    [junit] Testcase: test9 took 0.1 sec
    [junit] Testcase: test10 took 0.108 sec
    [junit] Testcase: test11 took 0.085 sec
    [junit] Testcase: test12 took 0.084 sec
    [junit] Testcase: test13 took 0.121 sec
    [junit] Testcase: test15 took 0.086 sec
    [junit] Testsuite: org.apache.tools.ant.taskdefs.CopydirTest
    [junit] Tests run: 6, Failures: 0, Errors: 0, Time elapsed: 0.805 sec
    [junit] 
    [junit] Testcase: test1 took 0.093 sec
    [junit] Testcase: test2 took 0.088 sec
    [junit] Testcase: test3 took 0.073 sec
    [junit] Testcase: test4 took 0.146 sec
    [junit] Testcase: test5 took 0.252 sec
    [junit] Testcase: test6 took 0.15 sec
    [junit] Testsuite: org.apache.tools.ant.taskdefs.CopyfileTest
    [junit] Tests run: 6, Failures: 0, Errors: 0, Time elapsed: 0.632 sec
    [junit] 
    [junit] Testcase: test1 took 0.101 sec
    [junit] Testcase: test2 took 0.076 sec
    [junit] Testcase: test3 took 0.179 sec
    [junit] Testcase: test4 took 0.089 sec
    [junit] Testcase: test5 took 0.107 sec
    [junit] Testcase: test6 took 0.079 sec
    [junit] Testsuite: org.apache.tools.ant.taskdefs.DeleteTest
    [junit] Tests run: 3, Failures: 0, Errors: 0, Time elapsed: 0.655 sec
    [junit] 
    [junit] Testcase: test1 took 0.132 sec
    [junit] Testcase: test2 took 0.209 sec
    [junit] Testcase: test4 took 0.312 sec
    [junit] Testsuite: org.apache.tools.ant.taskdefs.DeltreeTest
    [junit] Tests run: 2, Failures: 0, Errors: 0, Time elapsed: 0.156 sec
    [junit] 
    [junit] Testcase: test1 took 0.085 sec
    [junit] Testcase: test2 took 0.07 sec
    [junit] Testsuite: org.apache.tools.ant.taskdefs.EchoTest
    [junit] Tests run: 3, Failures: 0, Errors: 0, Time elapsed: 0.236 sec
    [junit] 
    [junit] Testcase: test1 took 0.09 sec
    [junit] Testcase: test2 took 0.069 sec
    [junit] Testcase: test3 took 0.076 sec
    [junit] Testsuite: org.apache.tools.ant.taskdefs.FailTest
    [junit] Tests run: 2, Failures: 0, Errors: 0, Time elapsed: 0.16 sec
    [junit] 
    [junit] Testcase: test1 took 0.088 sec
    [junit] Testcase: test2 took 0.071 sec
    [junit] Testsuite: org.apache.tools.ant.taskdefs.FilterTest
    [junit] Tests run: 8, Failures: 0, Errors: 0, Time elapsed: 0.791 sec
    [junit] 
    [junit] Testcase: test1 took 0.123 sec
    [junit] Testcase: test2 took 0.088 sec
    [junit] Testcase: test3 took 0.074 sec
    [junit] Testcase: test4 took 0.082 sec
    [junit] Testcase: test5 took 0.146 sec
    [junit] Testcase: test6 took 0.092 sec
    [junit] Testcase: test7 took 0.079 sec
    [junit] Testcase: test8 took 0.104 sec
    [junit] Testsuite: org.apache.tools.ant.taskdefs.GetTest
    [junit] Tests run: 6, Failures: 0, Errors: 1, Time elapsed: 76.835 sec
    [junit] 
    [junit] Testcase: test1 took 0.089 sec
    [junit] Testcase: test2 took 0.076 sec
    [junit] Testcase: test3 took 0.07 sec
    [junit] Testcase: test4 took 0.069 sec
    [junit] Testcase: test5 took 0.074 sec
    [junit] Testcase: test6 took 76.45 sec
    [junit] 	Caused an ERROR
    [junit] java.net.ConnectException: Connection refused
    [junit] /home/rubys/jakarta/jakarta-ant/src/etc/testcases/taskdefs/get.xml:26: java.net.ConnectException:
Connection refused
    [junit] --- Nested Exception ---
    [junit] java.net.ConnectException: Connection refused
    [junit] 	at java.net.PlainSocketImpl.socketConnect(Native Method)
    [junit] 	at java.net.PlainSocketImpl.doConnect(PlainSocketImpl.java:312)
    [junit] 	at java.net.PlainSocketImpl.connectToAddress(PlainSocketImpl.java:125)
    [junit] 	at java.net.PlainSocketImpl.connect(PlainSocketImpl.java:112)
    [junit] 	at java.net.Socket.<init>(Socket.java:273)
    [junit] 	at java.net.Socket.<init>(Socket.java:100)
    [junit] 	at sun.net.NetworkClient.doConnect(NetworkClient.java:50)
    [junit] 	at sun.net.www.http.HttpClient.openServer(HttpClient.java:331)
    [junit] 	at sun.net.www.http.HttpClient.openServer(HttpClient.java:517)
    [junit] 	at sun.net.www.http.HttpClient.<init>(HttpClient.java:267)
    [junit] 	at sun.net.www.http.HttpClient.<init>(HttpClient.java:277)
    [junit] 	at sun.net.www.http.HttpClient.New(HttpClient.java:289)
    [junit] 	at sun.net.www.protocol.http.HttpURLConnection.connect(HttpURLConnection.java:379)
    [junit] 	at org.apache.tools.ant.taskdefs.Get.execute(Get.java:128)
    [junit] 	at org.apache.tools.ant.Target.execute(Target.java:153)
    [junit] 	at org.apache.tools.ant.Project.runTarget(Project.java:908)
    [junit] 	at org.apache.tools.ant.Project.executeTarget(Project.java:536)
    [junit] 	at org.apache.tools.ant.taskdefs.TaskdefsTest.executeTarget(Unknown Source)
    [junit] 	at org.apache.tools.ant.taskdefs.GetTest.test6(Unknown Source)
    [junit] 	at java.lang.reflect.Method.invoke(Native Method)
    [junit] 	at junit.framework.TestCase.runTest(TestCase.java:156)
    [junit] 	at junit.framework.TestCase.runBare(TestCase.java:130)
    [junit] 	at junit.framework.TestResult$1.protect(TestResult.java:106)
    [junit] 	at junit.framework.TestResult.runProtected(TestResult.java:124)
    [junit] 	at junit.framework.TestResult.run(TestResult.java:109)
    [junit] 	at junit.framework.TestCase.run(TestCase.java:121)
    [junit] 	at junit.framework.TestSuite.runTest(TestSuite.java:157)
    [junit] 	at junit.framework.TestSuite.run(TestSuite.java:152)
    [junit] 	at org.apache.tools.ant.taskdefs.optional.junit.JUnitTestRunner.run(Unknown Source)
    [junit] 	at org.apache.tools.ant.taskdefs.optional.junit.JUnitTask.executeInVM(Unknown
Source)
    [junit] 	at org.apache.tools.ant.taskdefs.optional.junit.JUnitTask.execute(Unknown Source)
    [junit] 	at org.apache.tools.ant.taskdefs.optional.junit.JUnitTask.execute(Unknown Source)
    [junit] 	at org.apache.tools.ant.Target.execute(Target.java:153)
    [junit] 	at org.apache.tools.ant.Project.runTarget(Project.java:908)
    [junit] 	at org.apache.tools.ant.Project.executeTarget(Project.java:536)
    [junit] 	at org.apache.tools.ant.Project.executeTargets(Project.java:510)
    [junit] 	at org.apache.tools.ant.Main.runBuild(Main.java:421)
    [junit] 	at org.apache.tools.ant.Main.main(Main.java:149)
    [junit] 

BUILD FAILED

/home/rubys/jakarta/jakarta-ant/build.xml:611: Test org.apache.tools.ant.taskdefs.GetTest
failed

Total time: 1 minute 47 seconds

Mime
View raw message