ant-dev mailing list archives

Site index · List index
Message view « Date » · « Thread »
Top « Date » · « Thread »
From "Erik Meade" <eme...@geekfarm.org>
Subject RE: Build Failed
Date Fri, 06 Oct 2000 21:59:41 GMT
Yes, that did it.  When I runtests I get this error though:
Any ideas?

Erik


runtests:
    [junit] Testsuite: org.apache.tools.ant.taskdefs.GzipTest
    [junit] Tests run: 1, Failures: 0, Errors: 1, Time elapsed: 0 sec
    [junit]
    [junit]     Caused an ERROR
    [junit] Prohibited package name: java.lang
    [junit] java.lang.SecurityException: Prohibited package name: java.lang
    [junit]     at java.lang.ClassLoader.defineClass(Unknown Source)
    [junit]     at java.lang.ClassLoader.defineClass(Unknown Source)
    [junit]     at
org.apache.tools.ant.AntClassLoader.getClassFromStream(AntCla
ssLoader.java:389)
    [junit]     at
org.apache.tools.ant.AntClassLoader.findClass(AntClassLoader.
java:434)
    [junit]     at
org.apache.tools.ant.AntClassLoader.findClass(AntClassLoader.
java:407)
    [junit]     at
org.apache.tools.ant.AntClassLoader.loadClass(AntClassLoader.
java:337)
    [junit]     at java.lang.ClassLoader.loadClass(Unknown Source)
    [junit]     at java.lang.ClassLoader.loadClassInternal(Unknown Source)
    [junit]     at java.lang.Class.getMethod0(Native Method)
    [junit]     at java.lang.Class.getMethod(Unknown Source)
    [junit]     at
org.apache.tools.ant.taskdefs.optional.junit.JUnitTestRunner.
<init>(JUnitTestRunner.java:165)
    [junit]     at
org.apache.tools.ant.taskdefs.optional.junit.JUnitTask.execut
e(JUnitTask.java:231)
    [junit]     at org.apache.tools.ant.Target.execute(Target.java:142)
    [junit]     at org.apache.tools.ant.Project.runTarget(Project.java:814)
    [junit]     at
org.apache.tools.ant.Project.executeTarget(Project.java:532)
    [junit]     at
org.apache.tools.ant.Project.executeTargets(Project.java:506)

    [junit]     at org.apache.tools.ant.Main.runBuild(Main.java:400)
    [junit]     at org.apache.tools.ant.Main.main(Main.java:130)
    [junit]

BUILD FAILED

E:\java\cvs\jakarta-ant\build.xml:323: Test
org.apache.tools.ant.taskdefs.GzipTe
st failed

> -----Original Message-----
> From: Jose Alberto Fernandez [mailto:JFernandez@viquity.com]
> Sent: Friday, October 06, 2000 2:11 PM
> To: 'ant-dev@jakarta.apache.org'
> Subject: RE: Build Failed
>
>
> Everytime a new feature of ANT is used in the ANT build itself, it will
> require for those with old versions to re-bootstrap. Your case in point.
>
> > -----Original Message-----
> > From: Erik Meade [mailto:emeade@geekfarm.org]
> > Sent: Friday, October 06, 2000 1:59 PM
> > To: ant-dev@jakarta.apache.org
> > Subject: RE: Build Failed
> >
> >
> > I didn't need to do that last week, is this the result of
> > a recent change?
> >
> > Erik
> >
> > > -----Original Message-----
> > > From: Jose Alberto Fernandez
> > > Sent: Friday, October 06, 2000 1:43 PM
> > > To: 'ant-dev@jakarta.apache.org'
> > > Subject: RE: Build Failed
> > >
> > >
> > > You need to bootstrap.
> > >
> > > > -----Original Message-----
> > > > From: Erik Meade
> > > > Sent: Friday, October 06, 2000 1:41 PM
> > > > To: ant-dev@jakarta.apache.org
> > > > Subject: Build Failed
> > > >
> > > >
> > > > I just check Ant out of CVS, went to build it and got:
> > > >
> > > > BUILD FAILED
> > > >
> > > > E:\java\cvs\jakarta-ant\build.xml:103: Could not create
> > > > task of type: copy because I can't find it in the list
> > > > of task class definitions
> > > >
> > > >
> > > > Erik Meade
> > > >
> >


Mime
View raw message