ambari-user mailing list archives

Site index · List index
Message view « Date » · « Thread »
Top « Date » · « Thread »
From Ascot Moss <ascot.m...@gmail.com>
Subject Build Error
Date Tue, 26 Jul 2016 11:41:28 GMT
Hi,


Please help!
I am trying to build Ambari 2.2.2, got the following error as follows:

Stack trace was suppressed. Run with `LOGGY_STACKS=true` to see the trace.

[INFO]
------------------------------------------------------------------------

[INFO] Reactor Summary:

[INFO]

[INFO] Ambari Main ........................................ SUCCESS [04:51
min]

[INFO] Apache Ambari Project POM .......................... SUCCESS [
4.361 s]

[INFO] Ambari Web ......................................... FAILURE [02:55
min]

[INFO] Ambari Views ....................................... SKIPPED

[INFO] Ambari Admin View .................................. SKIPPED

[INFO] ambari-metrics ..................................... SKIPPED

[INFO] Ambari Metrics Common .............................. SKIPPED

[INFO] Ambari Metrics Hadoop Sink ......................... SKIPPED

[INFO] Ambari Metrics Flume Sink .......................... SKIPPED

[INFO] Ambari Metrics Kafka Sink .......................... SKIPPED

[INFO] Ambari Metrics Storm Sink .......................... SKIPPED

[INFO] Ambari Metrics Collector ........................... SKIPPED

[INFO] Ambari Metrics Monitor ............................. SKIPPED

[INFO] Ambari Metrics Grafana ............................. SKIPPED

[INFO] Ambari Metrics Assembly ............................ SKIPPED

[INFO] Ambari Server ...................................... SKIPPED

[INFO] Ambari Agent ....................................... SKIPPED

[INFO] Ambari Client ...................................... SKIPPED

[INFO] Ambari Python Client ............................... SKIPPED

[INFO] Ambari Groovy Client ............................... SKIPPED

[INFO] Ambari Shell ....................................... SKIPPED

[INFO] Ambari Python Shell ................................ SKIPPED

[INFO] Ambari Groovy Shell ................................ SKIPPED

[INFO]
------------------------------------------------------------------------

[INFO] BUILD FAILURE

[INFO]
------------------------------------------------------------------------

[ERROR] Failed to execute goal
org.codehaus.mojo:exec-maven-plugin:1.2.1:exec (compile-brunch) on project
ambari-web: Command execution failed. Process exited with an error: 1 (Exit
value: 1) -> [Help 1]

[ERROR]

[ERROR] To see the full stack trace of the errors, re-run Maven with the -e
switch.

[ERROR] Re-run Maven using the -X switch to enable full debug logging.

[ERROR]

[ERROR] For more information about the errors and possible solutions,
please read the following articles:

[ERROR] [Help 1]
http://cwiki.apache.org/confluence/display/MAVEN/MojoExecutionException

[ERROR]

[ERROR] After correcting the problems, you can resume the build with the
command

[ERROR]   mvn <goals> -rf :ambari-web


Any ideas how to resolve it?

Regards

Mime
View raw message