ambari-user mailing list archives

Site index · List index
Message view « Date » · « Thread »
Top « Date » · « Thread »
From rammohan ganapavarapu <rammohanga...@gmail.com>
Subject Metrics build failure
Date Thu, 11 Feb 2016 17:56:44 GMT
Hi,

I am trying to build apache-ambari-2.2.1 from source, i am getting this
error for ambari-metrics project any help to resolve this would be great.

[ERROR] Failed to execute goal
org.codehaus.mojo:build-helper-maven-plugin:1.8:regex-property
(parse-package-version) on project ambari-metrics: No match to regex
'^([0-9]+)\.([0-9]+)\.([0-9]+)\.([0-9]+)(\.|-).*' found in '2.2.1'. ->
[Help 1]
org.apache.maven.lifecycle.LifecycleExecutionException: Failed to execute
goal org.codehaus.mojo:build-helper-maven-plugin:1.8:regex-property
(parse-package-version) on project ambari-metrics: No match to regex
'^([0-9]+)\.([0-9]+)\.([0-9]+)\.([0-9]+)(\.|-).*' found in '2.2.1'.
    at
org.apache.maven.lifecycle.internal.MojoExecutor.execute(MojoExecutor.java:212)
    at
org.apache.maven.lifecycle.internal.MojoExecutor.execute(MojoExecutor.java:153)
    at
org.apache.maven.lifecycle.internal.MojoExecutor.execute(MojoExecutor.java:145)
    at
org.apache.maven.lifecycle.internal.LifecycleModuleBuilder.buildProject(LifecycleModuleBuilder.java:116)
    at
org.apache.maven.lifecycle.internal.LifecycleModuleBuilder.buildProject(LifecycleModuleBuilder.java:80)
    at
org.apache.maven.lifecycle.internal.builder.singlethreaded.SingleThreadedBuilder.build(SingleThreadedBuilder.java:51)
    at
org.apache.maven.lifecycle.internal.LifecycleStarter.execute(LifecycleStarter.java:128)
    at org.apache.maven.DefaultMaven.doExecute(DefaultMaven.java:307)
    at org.apache.maven.DefaultMaven.doExecute(DefaultMaven.java:193)
    at org.apache.maven.DefaultMaven.execute(DefaultMaven.java:106)
    at org.apache.maven.cli.MavenCli.execute(MavenCli.java:863)
    at org.apache.maven.cli.MavenCli.doMain(MavenCli.java:288)
    at org.apache.maven.cli.MavenCli.main(MavenCli.java:199)
    at sun.reflect.NativeMethodAccessorImpl.invoke0(Native Method)
    at
sun.reflect.NativeMethodAccessorImpl.invoke(NativeMethodAccessorImpl.java:62)
    at
sun.reflect.DelegatingMethodAccessorImpl.invoke(DelegatingMethodAccessorImpl.java:43)
    at java.lang.reflect.Method.invoke(Method.java:497)
    at
org.codehaus.plexus.classworlds.launcher.Launcher.launchEnhanced(Launcher.java:289)
    at
org.codehaus.plexus.classworlds.launcher.Launcher.launch(Launcher.java:229)
    at
org.codehaus.plexus.classworlds.launcher.Launcher.mainWithExitCode(Launcher.java:415)
    at
org.codehaus.plexus.classworlds.launcher.Launcher.main(Launcher.java:356)
Caused by: org.apache.maven.plugin.MojoFailureException: No match to regex
'^([0-9]+)\.([0-9]+)\.([0-9]+)\.([0-9]+)(\.|-).*' found in '2.2.1'.
    at
org.codehaus.mojo.buildhelper.RegexPropertyMojo.execute(RegexPropertyMojo.java:105)
    at
org.apache.maven.plugin.DefaultBuildPluginManager.executeMojo(DefaultBuildPluginManager.java:134)
    at
org.apache.maven.lifecycle.internal.MojoExecutor.execute(MojoExecutor.java:207)
    ... 20 more


Thanks,

Mime
View raw message