ambari-user mailing list archives

Site index · List index
Message view « Date » · « Thread »
Top « Date » · « Thread »
From jongchul seon <jongchul.s...@gmail.com>
Subject ambari-agent (ver. 2.0.0.0) build failer
Date Mon, 13 Apr 2015 21:10:59 GMT
Hi

I'm trying to build ambari 2.0.

I've got below error message..

My build envrionment is as below

maven version ; 3.0.5
python : 2.7.8
os : centos 6.5
java : open jdk 1.7

Do I miss something?


[INFO] Ambari Main ....................................... SUCCESS [9.723s]
[INFO] Apache Ambari Project POM ......................... SUCCESS [0.347s]
[INFO] Ambari Web ........................................ SUCCESS
[6:02.729s]
[INFO] Ambari Views ...................................... SUCCESS [3.203s]
[INFO] Ambari Admin View ................................. SUCCESS [48.014s]
[INFO] Ambari Metrics Common ............................. SUCCESS [3.494s]
[INFO] Ambari Server ..................................... SUCCESS
[4:21.089s]
[INFO] Ambari Agent ...................................... FAILURE [2.536s]
[INFO] Ambari Client ..................................... SKIPPED
[INFO] Ambari Python Client .............................. SKIPPED
[INFO] Ambari Groovy Client .............................. SKIPPED
[INFO] Ambari Shell ...................................... SKIPPED
[INFO] Ambari Python Shell ............................... SKIPPED
[INFO] Ambari Groovy Shell ............................... SKIPPED
[INFO]
------------------------------------------------------------------------
[INFO] BUILD FAILURE
[INFO]
------------------------------------------------------------------------
[INFO] Total time: 11:32.204s
[INFO] Finished at: Sun Apr 12 18:45:48 EDT 2015
[INFO] Final Memory: 82M/811M
[INFO]
------------------------------------------------------------------------
[ERROR] Failed to execute goal org.codehaus.mojo:exec-maven-plugin:1.2:exec
(python-package) on project ambari-agent: Command execution failed. Process
exited with an error: 1(Exit value: 1) -> [Help 1]
[ERROR]
[ERROR] To see the full stack trace of the errors, re-run Maven with the -e
switch.
[ERROR] Re-run Maven using the -X switch to enable full debug logging.
[ERROR]
[ERROR] For more information about the errors and possible solutions,
please read the following articles:
[ERROR] [Help 1]
http://cwiki.apache.org/confluence/display/MAVEN/MojoExecutionException
[ERROR]
[ERROR] After correcting the problems, you can resume the build with the
command

Mime
View raw message