ambari-issues mailing list archives

Site index · List index
Message view « Date » · « Thread »
Top « Date » · « Thread »
From "Jonathan Hurley (JIRA)" <j...@apache.org>
Subject [jira] [Created] (AMBARI-22596) Ambari Builds Are Failing With Python Test Errors
Date Tue, 05 Dec 2017 16:20:00 GMT
Jonathan Hurley created AMBARI-22596:
----------------------------------------

             Summary: Ambari Builds Are Failing With Python Test Errors
                 Key: AMBARI-22596
                 URL: https://issues.apache.org/jira/browse/AMBARI-22596
             Project: Ambari
          Issue Type: Bug
    Affects Versions: 2.6.1
            Reporter: Jonathan Hurley
             Fix For: 2.6.1


Ambari builds have been failing for a long time:
https://builds.apache.org/job/Ambari-branch-2.6

Looks like some Python problems:
{code}
======================================================================
ERROR: test_check_database_name_property (TestAmbariServer.TestAmbariServer)
----------------------------------------------------------------------
Traceback (most recent call last):
  File "/home/jenkins/jenkins-slave/workspace/Ambari-branch-2.6/ambari-common/src/test/python/mock/mock.py",
line 1199, in patched
    return func(*args, **keywargs)
  File "/home/jenkins/jenkins-slave/workspace/Ambari-branch-2.6/ambari-server/src/test/python/TestAmbariServer.py",
line 7997, in test_check_database_name_property
    args = parser.parse_args()
  File "/usr/lib/python2.7/optparse.py", line 1402, in parse_args
    self.error(str(err))
  File "/usr/lib/python2.7/optparse.py", line 1584, in error
    self.exit(2, "%s: error: %s\n" % (self.get_prog_name(), msg))
  File "/usr/lib/python2.7/optparse.py", line 1574, in exit
    sys.exit(status)
SystemExit: 2

----------------------------------------------------------------------
Ran 276 tests in 7.423s

FAILED (errors=1)
----------------------------------------------------------------------
Failed tests:
ERROR: test_check_database_name_property (TestAmbariServer.TestAmbariServer)
----------------------------------------------------------------------
Traceback (most recent call last):
  File "/home/jenkins/jenkins-slave/workspace/Ambari-branch-2.6/ambari-common/src/test/python/mock/mock.py",
line 1199, in patched
    return func(*args, **keywargs)
  File "/home/jenkins/jenkins-slave/workspace/Ambari-branch-2.6/ambari-server/src/test/python/TestAmbariServer.py",
line 7997, in test_check_database_name_property
    args = parser.parse_args()
  File "/usr/lib/python2.7/optparse.py", line 1402, in parse_args
    self.error(str(err))
  File "/usr/lib/python2.7/optparse.py", line 1584, in error
    self.exit(2, "%s: error: %s\n" % (self.get_prog_name(), msg))
  File "/usr/lib/python2.7/optparse.py", line 1574, in exit
    sys.exit(status)
SystemExit: 2
{code}



--
This message was sent by Atlassian JIRA
(v6.4.14#64029)

Mime
View raw message