ambari-issues mailing list archives

Site index · List index
Message view « Date » · « Thread »
Top « Date » · « Thread »
From "Hudson (JIRA)" <j...@apache.org>
Subject [jira] [Commented] (AMBARI-22002) Ambari Unit Tests Fail In trunk
Date Wed, 20 Sep 2017 10:34:00 GMT

    [ https://issues.apache.org/jira/browse/AMBARI-22002?page=com.atlassian.jira.plugin.system.issuetabpanels:comment-tabpanel&focusedCommentId=16172997#comment-16172997
] 

Hudson commented on AMBARI-22002:
---------------------------------

FAILURE: Integrated in Jenkins build Ambari-trunk-Commit #8101 (See [https://builds.apache.org/job/Ambari-trunk-Commit/8101/])
AMBARI-22002.Ambari Unit Tests Fail In trunk(Prabhjyot Singh via Venkata (venkatasairam.lanka:
[http://git-wip-us.apache.org/repos/asf?p=ambari.git&a=commit&h=8467a2048300ac54caf84ad785a8cc0a96f3cb65])
* (edit) ambari-server/src/test/python/stacks/2.6/ZEPPELIN/test_zeppelin_070.py


> Ambari Unit Tests Fail In trunk
> -------------------------------
>
>                 Key: AMBARI-22002
>                 URL: https://issues.apache.org/jira/browse/AMBARI-22002
>             Project: Ambari
>          Issue Type: Bug
>    Affects Versions: 3.0.0
>            Reporter: Prabhjyot Singh
>            Assignee: Prabhjyot Singh
>             Fix For: 3.0.0
>
>         Attachments: AMBARI-22002_trunk_v1.patch
>
>
> The following unit tests are failing trunk builds:
> https://builds.apache.org/job/Ambari-trunk-Commit/8095/consoleFull
> {code}
> OK
> ----------------------------------------------------------------------
> Failed tests:
> ERROR: test_configure_default (test_zeppelin_master.TestZeppelinMaster)
> ----------------------------------------------------------------------
> Traceback (most recent call last):
>   File "/home/jenkins/jenkins-slave/workspace/Ambari-trunk-Commit/ambari-common/src/test/python/mock/mock.py",
line 1199, in patched
>     return func(*args, **keywargs)
>   File "/home/jenkins/jenkins-slave/workspace/Ambari-trunk-Commit/ambari-server/src/test/python/stacks/2.5/ZEPPELIN/test_zeppelin_master.py",
line 145, in test_configure_default
>     target = RMFTestCase.TARGET_COMMON_SERVICES
>   File "/home/jenkins/jenkins-slave/workspace/Ambari-trunk-Commit/ambari-server/src/test/python/stacks/utils/RMFTestCase.py",
line 126, in executeScript
>     raise RuntimeError("Cannot load class %s from %s: %s" % (classname, norm_path, err.message))
> RuntimeError: Cannot load class Master from ZEPPELIN/0.6.0.2.5/package/scripts/master.py:

> ERROR: test_configure_secured (test_zeppelin_master.TestZeppelinMaster)
> ----------------------------------------------------------------------
> Traceback (most recent call last):
>   File "/home/jenkins/jenkins-slave/workspace/Ambari-trunk-Commit/ambari-common/src/test/python/mock/mock.py",
line 1199, in patched
>     return func(*args, **keywargs)
>   File "/home/jenkins/jenkins-slave/workspace/Ambari-trunk-Commit/ambari-server/src/test/python/stacks/2.5/ZEPPELIN/test_zeppelin_master.py",
line 156, in test_configure_secured
>     target = RMFTestCase.TARGET_COMMON_SERVICES
>   File "/home/jenkins/jenkins-slave/workspace/Ambari-trunk-Commit/ambari-server/src/test/python/stacks/utils/RMFTestCase.py",
line 126, in executeScript
>     raise RuntimeError("Cannot load class %s from %s: %s" % (classname, norm_path, err.message))
> RuntimeError: Cannot load class Master from ZEPPELIN/0.6.0.2.5/package/scripts/master.py:

> ERROR: test_start_default (test_zeppelin_master.TestZeppelinMaster)
> ----------------------------------------------------------------------
> Traceback (most recent call last):
>   File "/home/jenkins/jenkins-slave/workspace/Ambari-trunk-Commit/ambari-common/src/test/python/mock/mock.py",
line 1199, in patched
>     return func(*args, **keywargs)
>   File "/home/jenkins/jenkins-slave/workspace/Ambari-trunk-Commit/ambari-server/src/test/python/stacks/2.5/ZEPPELIN/test_zeppelin_master.py",
line 213, in test_start_default
>     target = RMFTestCase.TARGET_COMMON_SERVICES
>   File "/home/jenkins/jenkins-slave/workspace/Ambari-trunk-Commit/ambari-server/src/test/python/stacks/utils/RMFTestCase.py",
line 126, in executeScript
>     raise RuntimeError("Cannot load class %s from %s: %s" % (classname, norm_path, err.message))
> RuntimeError: Cannot load class Master from ZEPPELIN/0.6.0.2.5/package/scripts/master.py:

> ERROR: test_start_secured (test_zeppelin_master.TestZeppelinMaster)
> ----------------------------------------------------------------------
> Traceback (most recent call last):
>   File "/home/jenkins/jenkins-slave/workspace/Ambari-trunk-Commit/ambari-common/src/test/python/mock/mock.py",
line 1199, in patched
>     return func(*args, **keywargs)
>   File "/home/jenkins/jenkins-slave/workspace/Ambari-trunk-Commit/ambari-server/src/test/python/stacks/2.5/ZEPPELIN/test_zeppelin_master.py",
line 227, in test_start_secured
>     target = RMFTestCase.TARGET_COMMON_SERVICES
>   File "/home/jenkins/jenkins-slave/workspace/Ambari-trunk-Commit/ambari-server/src/test/python/stacks/utils/RMFTestCase.py",
line 126, in executeScript
>     raise RuntimeError("Cannot load class %s from %s: %s" % (classname, norm_path, err.message))
> RuntimeError: Cannot load class Master from ZEPPELIN/0.6.0.2.5/package/scripts/master.py:

> ERROR: test_stop_default (test_zeppelin_master.TestZeppelinMaster)
> ----------------------------------------------------------------------
> Traceback (most recent call last):
>   File "/home/jenkins/jenkins-slave/workspace/Ambari-trunk-Commit/ambari-common/src/test/python/mock/mock.py",
line 1199, in patched
>     return func(*args, **keywargs)
>   File "/home/jenkins/jenkins-slave/workspace/Ambari-trunk-Commit/ambari-server/src/test/python/stacks/2.5/ZEPPELIN/test_zeppelin_master.py",
line 190, in test_stop_default
>     target = RMFTestCase.TARGET_COMMON_SERVICES
>   File "/home/jenkins/jenkins-slave/workspace/Ambari-trunk-Commit/ambari-server/src/test/python/stacks/utils/RMFTestCase.py",
line 126, in executeScript
>     raise RuntimeError("Cannot load class %s from %s: %s" % (classname, norm_path, err.message))
> RuntimeError: Cannot load class Master from ZEPPELIN/0.6.0.2.5/package/scripts/master.py:

> ERROR: test_stop_secured (test_zeppelin_master.TestZeppelinMaster)
> ----------------------------------------------------------------------
> Traceback (most recent call last):
>   File "/home/jenkins/jenkins-slave/workspace/Ambari-trunk-Commit/ambari-common/src/test/python/mock/mock.py",
line 1199, in patched
>     return func(*args, **keywargs)
>   File "/home/jenkins/jenkins-slave/workspace/Ambari-trunk-Commit/ambari-server/src/test/python/stacks/2.5/ZEPPELIN/test_zeppelin_master.py",
line 167, in test_stop_secured
>     target = RMFTestCase.TARGET_COMMON_SERVICES
>   File "/home/jenkins/jenkins-slave/workspace/Ambari-trunk-Commit/ambari-server/src/test/python/stacks/utils/RMFTestCase.py",
line 126, in executeScript
>     raise RuntimeError("Cannot load class %s from %s: %s" % (classname, norm_path, err.message))
> RuntimeError: Cannot load class Master from ZEPPELIN/0.6.0.2.5/package/scripts/master.py:

> {code}



--
This message was sent by Atlassian JIRA
(v6.4.14#64029)

Mime
View raw message