ambari-issues mailing list archives

Site index · List index
Message view « Date » · « Thread »
Top « Date » · « Thread »
From "ketan kunde (JIRA)" <j...@apache.org>
Subject [jira] [Created] (AMBARI-21887) Unable to compile amabari-admin and ambari-web
Date Wed, 06 Sep 2017 09:23:00 GMT
ketan kunde created AMBARI-21887:
------------------------------------

             Summary: Unable to compile amabari-admin and ambari-web
                 Key: AMBARI-21887
                 URL: https://issues.apache.org/jira/browse/AMBARI-21887
             Project: Ambari
          Issue Type: Bug
          Components: ambari-admin, ambari-web
    Affects Versions: 2.5.1
         Environment: arch : s390x
OS : ub 16.04
maven : 3.3.9
JDK : openjdk8
            Reporter: ketan kunde
            Priority: Blocker


while building ambari-web i get the below logs on doing a mvn clean install -fn


[INFO] Running 'yarn install ignore-engines pure-lockfile' in /home/apache-ambari-2.5.1-src/ambari-web
[ERROR] /home/apache-ambari-2.5.1-src/ambari-web/node/node: 1: /home/apache-ambari-2.5.1-src/ambari-web/node/node:
Syntax error: "(" unexpected
[INFO] ------------------------------------------------------------------------
[INFO] BUILD FAILURE
[INFO] ------------------------------------------------------------------------
[INFO] Total time: 03:17 min
[INFO] Finished at: 2017-09-06T09:15:56+00:00
[INFO] Final Memory: 11M/27M

******************************************************************************************************

The below logs are while executing ambari-admin
Installed node locally.
[INFO] NPM 2.15.0 is already installed.
[INFO]
[INFO] --- frontend-maven-plugin:1.3:npm (npm install) @ ambari-admin ---
[INFO] Running 'npm install' in /home/apache-ambari-2.5.1-src/ambari-admin/src/main/resources/ui/admin-web
[ERROR] /home/apache-ambari-2.5.1-src/ambari-admin/src/main/resources/ui/admin-web/node/node:
1: /home/apache-ambari-2.5.1-src/ambari-admin/src/main/resources/ui/admin-web/node/node: Syntax
error: "(" unexpected
[INFO] ------------------------------------------------------------------------
[INFO] BUILD FAILURE
[INFO] ------------------------------------------------------------------------
[INFO] Total time: 01:55 min
[INFO] Finished at: 2017-09-06T09:21:12+00:00
[INFO] Final Memory: 12M/30M

Ned help to this fixed



--
This message was sent by Atlassian JIRA
(v6.4.14#64029)

Mime
View raw message