ambari-issues mailing list archives

Site index · List index
Message view « Date » · « Thread »
Top « Date » · « Thread »
From "Arnaud Launay (JIRA)" <j...@apache.org>
Subject [jira] [Commented] (AMBARI-20618) Debian compilation fails
Date Wed, 29 Mar 2017 11:14:41 GMT

    [ https://issues.apache.org/jira/browse/AMBARI-20618?page=com.atlassian.jira.plugin.system.issuetabpanels:comment-tabpanel&focusedCommentId=15946941#comment-15946941
] 

Arnaud Launay commented on AMBARI-20618:
----------------------------------------

[INFO] ------------------------------------------------------------------------
[INFO] Reactor Summary:
[INFO] 
[INFO] Ambari Main ........................................ FAILURE [  3.287 s]
[INFO] Apache Ambari Project POM .......................... SKIPPED
[INFO] Ambari Web ......................................... SKIPPED
[INFO] Ambari Views ....................................... SKIPPED
[INFO] Ambari Admin View .................................. SKIPPED
[INFO] ambari-metrics ..................................... SKIPPED
[INFO] Ambari Metrics Common .............................. SKIPPED
[INFO] Ambari Metrics Hadoop Sink ......................... SKIPPED
[INFO] Ambari Metrics Flume Sink .......................... SKIPPED
[INFO] Ambari Metrics Kafka Sink .......................... SKIPPED
[INFO] Ambari Metrics Storm Sink .......................... SKIPPED
[INFO] Ambari Metrics Storm Sink (Legacy) ................. SKIPPED
[INFO] Ambari Metrics Collector ........................... SKIPPED
[INFO] Ambari Metrics Monitor ............................. SKIPPED
[INFO] Ambari Metrics Grafana ............................. SKIPPED
[INFO] Ambari Metrics Assembly ............................ SKIPPED
[INFO] Ambari Server ...................................... SKIPPED
[INFO] Ambari Functional Tests ............................ SKIPPED
[INFO] Ambari Agent ....................................... SKIPPED
[INFO] Ambari Client ...................................... SKIPPED
[INFO] Ambari Python Client ............................... SKIPPED
[INFO] Ambari Groovy Client ............................... SKIPPED
[INFO] Ambari Shell ....................................... SKIPPED
[INFO] Ambari Python Shell ................................ SKIPPED
[INFO] Ambari Groovy Shell ................................ SKIPPED
[INFO] ambari-logsearch ................................... SKIPPED
[INFO] Ambari Logsearch Appender .......................... SKIPPED
[INFO] Ambari Logsearch Solr Client ....................... SKIPPED
[INFO] Ambari Logsearch Portal ............................ SKIPPED
[INFO] Ambari Logsearch Log Feeder ........................ SKIPPED
[INFO] Ambari Logsearch Assembly .......................... SKIPPED
[INFO] ------------------------------------------------------------------------
[INFO] BUILD FAILURE
[INFO] ------------------------------------------------------------------------
[INFO] Total time: 4.007 s
[INFO] Finished at: 2017-03-29T13:12:24+02:00
[INFO] Final Memory: 31M/689M
[INFO] ------------------------------------------------------------------------
[ERROR] Failed to execute goal org.apache.maven.plugins:maven-assembly-plugin:2.4.1:single
(make-assembly) on project ambari: No formats specified in the execution parameters or the
assembly descriptor. -> [Help 1]
org.apache.maven.lifecycle.LifecycleExecutionException: Failed to execute goal org.apache.maven.plugins:maven-assembly-plugin:2.4.1:single
(make-assembly) on project ambari: No formats specified in the execution parameters or the
assembly descriptor.
	at org.apache.maven.lifecycle.internal.MojoExecutor.execute(MojoExecutor.java:212)
	at org.apache.maven.lifecycle.internal.MojoExecutor.execute(MojoExecutor.java:153)
	at org.apache.maven.lifecycle.internal.MojoExecutor.execute(MojoExecutor.java:145)
	at org.apache.maven.lifecycle.internal.LifecycleModuleBuilder.buildProject(LifecycleModuleBuilder.java:116)
	at org.apache.maven.lifecycle.internal.LifecycleModuleBuilder.buildProject(LifecycleModuleBuilder.java:80)
	at org.apache.maven.lifecycle.internal.builder.singlethreaded.SingleThreadedBuilder.build(SingleThreadedBuilder.java:51)
	at org.apache.maven.lifecycle.internal.LifecycleStarter.execute(LifecycleStarter.java:128)
	at org.apache.maven.DefaultMaven.doExecute(DefaultMaven.java:307)
	at org.apache.maven.DefaultMaven.doExecute(DefaultMaven.java:193)
	at org.apache.maven.DefaultMaven.execute(DefaultMaven.java:106)
	at org.apache.maven.cli.MavenCli.execute(MavenCli.java:863)
	at org.apache.maven.cli.MavenCli.doMain(MavenCli.java:288)
	at org.apache.maven.cli.MavenCli.main(MavenCli.java:199)
	at sun.reflect.NativeMethodAccessorImpl.invoke0(Native Method)
	at sun.reflect.NativeMethodAccessorImpl.invoke(NativeMethodAccessorImpl.java:57)
	at sun.reflect.DelegatingMethodAccessorImpl.invoke(DelegatingMethodAccessorImpl.java:43)
	at java.lang.reflect.Method.invoke(Method.java:606)
	at org.codehaus.plexus.classworlds.launcher.Launcher.launchEnhanced(Launcher.java:289)
	at org.codehaus.plexus.classworlds.launcher.Launcher.launch(Launcher.java:229)
	at org.codehaus.plexus.classworlds.launcher.Launcher.mainWithExitCode(Launcher.java:415)
	at org.codehaus.plexus.classworlds.launcher.Launcher.main(Launcher.java:356)
Caused by: org.apache.maven.plugin.MojoFailureException: No formats specified in the execution
parameters or the assembly descriptor.
	at org.apache.maven.plugin.assembly.mojos.AbstractAssemblyMojo.execute(AbstractAssemblyMojo.java:425)
	at org.apache.maven.plugin.DefaultBuildPluginManager.executeMojo(DefaultBuildPluginManager.java:134)
	at org.apache.maven.lifecycle.internal.MojoExecutor.execute(MojoExecutor.java:207)
	... 20 more
[ERROR] 
[ERROR] 
[ERROR] For more information about the errors and possible solutions, please read the following
articles:
[ERROR] [Help 1] http://cwiki.apache.org/confluence/display/MAVEN/MojoFailureException


> Debian compilation fails
> ------------------------
>
>                 Key: AMBARI-20618
>                 URL: https://issues.apache.org/jira/browse/AMBARI-20618
>             Project: Ambari
>          Issue Type: Bug
>    Affects Versions: 2.4.2
>         Environment: Debian Jessie 8.7
>            Reporter: Arnaud Launay
>              Labels: build
>         Attachments: ambari.log
>
>
> ambari 2.4.2 fails to compile under Debian 8.
> server:~/tmp/apache-ambari-2.4.2-src$ mvn --version
> Apache Maven 3.3.9
> Maven home: /usr/share/maven
> Java version: 1.7.0_121, vendor: Oracle Corporation
> Java home: /usr/lib/jvm/java-7-openjdk-amd64/jre
> Default locale: en_US, platform encoding: ANSI_X3.4-1968
> OS name: "linux", version: "3.16.0-4-amd64", arch: "amd64", family: "unix"
> Log enclosed:
> mvn -B clean install package jdeb:jdeb -DskipTests -Dpython.ver="python >= 2.6" -e
-X | tee -a /tmp/ambari.log



--
This message was sent by Atlassian JIRA
(v6.3.15#6346)

Mime
View raw message