ambari-issues mailing list archives

Site index · List index
Message view « Date » · « Thread »
Top « Date » · « Thread »
From "Jeff Saremi (JIRA)" <j...@apache.org>
Subject [jira] [Created] (AMBARI-19807) Build failure for ambari-metrics-assembly (2.4.2)
Date Tue, 31 Jan 2017 23:35:51 GMT
Jeff Saremi created AMBARI-19807:
------------------------------------

             Summary: Build failure for ambari-metrics-assembly (2.4.2)
                 Key: AMBARI-19807
                 URL: https://issues.apache.org/jira/browse/AMBARI-19807
             Project: Ambari
          Issue Type: Bug
          Components: ambari-metrics
    Affects Versions: 2.4.2
         Environment: Windows 10
            Reporter: Jeff Saremi


It is not clear what this exception is due to:

[INFO] Ambari Main ........................................ SUCCESS [  0.819 s]
[INFO] Apache Ambari Project POM .......................... SUCCESS [  0.010 s]
[INFO] Ambari Web ......................................... SUCCESS [ 49.025 s]
[INFO] Ambari Views ....................................... SUCCESS [  0.524 s]
[INFO] Ambari Admin View .................................. SUCCESS [  7.605 s]
[INFO] ambari-metrics ..................................... SUCCESS [  0.216 s]
[INFO] Ambari Metrics Common .............................. SUCCESS [  0.339 s]
[INFO] Ambari Metrics Hadoop Sink ......................... SUCCESS [  1.391 s]
[INFO] Ambari Metrics Flume Sink .......................... SUCCESS [  0.895 s]
[INFO] Ambari Metrics Kafka Sink .......................... SUCCESS [  0.609 s]
[INFO] Ambari Metrics Storm Sink .......................... SUCCESS [  0.958 s]
[INFO] Ambari Metrics Storm Sink (Legacy) ................. SUCCESS [  0.743 s]
[INFO] Ambari Metrics Collector ........................... SUCCESS [  4.498 s]
[INFO] Ambari Metrics Monitor ............................. SUCCESS [  0.938 s]
[INFO] Ambari Metrics Grafana ............................. SUCCESS [ 17.317 s]
[INFO] Ambari Metrics Assembly ............................ FAILURE [ 52.005 s]


[ERROR] Failed to execute goal org.apache.maven.plugins:maven-assembly-plugin:2.2-beta-5:single
(grafana) on project ambari-metrics-assembly: Execution grafana of goal org.apache.maven.plugins:maven-assembly-plugin:2.2-beta-5:single
failed. NullPointerException -> [Help 1]
org.apache.maven.lifecycle.LifecycleExecutionException: Failed to execute goal org.apache.maven.plugins:maven-assembly-plugin:2.2-beta-5:single
(grafana) on project ambari-metrics-assembly: Execution grafana of goal org.apache.maven.plugins:maven-assembly-plugin:2.2-beta-5:single
failed.
        at org.apache.maven.lifecycle.internal.MojoExecutor.execute(MojoExecutor.java:212)
        at org.apache.maven.lifecycle.internal.MojoExecutor.execute(MojoExecutor.java:153)
        at org.apache.maven.lifecycle.internal.MojoExecutor.execute(MojoExecutor.java:145)
        at org.apache.maven.lifecycle.internal.LifecycleModuleBuilder.buildProject(LifecycleModuleBuilder.java:116)
        at org.apache.maven.lifecycle.internal.LifecycleModuleBuilder.buildProject(LifecycleModuleBuilder.java:80)
        at org.apache.maven.lifecycle.internal.builder.singlethreaded.SingleThreadedBuilder.build(SingleThreadedBuilder.java:51)
        at org.apache.maven.lifecycle.internal.LifecycleStarter.execute(LifecycleStarter.java:128)
        at org.apache.maven.DefaultMaven.doExecute(DefaultMaven.java:307)
        at org.apache.maven.DefaultMaven.doExecute(DefaultMaven.java:193)
        at org.apache.maven.DefaultMaven.execute(DefaultMaven.java:106)
        at org.apache.maven.cli.MavenCli.execute(MavenCli.java:863)
        at org.apache.maven.cli.MavenCli.doMain(MavenCli.java:288)
        at org.apache.maven.cli.MavenCli.main(MavenCli.java:199)
        at sun.reflect.NativeMethodAccessorImpl.invoke0(Native Method)
        at sun.reflect.NativeMethodAccessorImpl.invoke(NativeMethodAccessorImpl.java:62)
        at sun.reflect.DelegatingMethodAccessorImpl.invoke(DelegatingMethodAccessorImpl.java:43)
        at java.lang.reflect.Method.invoke(Method.java:498)
        at org.codehaus.plexus.classworlds.launcher.Launcher.launchEnhanced(Launcher.java:289)
        at org.codehaus.plexus.classworlds.launcher.Launcher.launch(Launcher.java:229)
        at org.codehaus.plexus.classworlds.launcher.Launcher.mainWithExitCode(Launcher.java:415)
        at org.codehaus.plexus.classworlds.launcher.Launcher.main(Launcher.java:356)
Caused by: org.apache.maven.plugin.PluginExecutionException: Execution grafana of goal org.apache.maven.plugins:maven-assembly-plugin:2.2-beta-5:single
failed.
        at org.apache.maven.plugin.DefaultBuildPluginManager.executeMojo(DefaultBuildPluginManager.java:145)
        at org.apache.maven.lifecycle.internal.MojoExecutor.execute(MojoExecutor.java:207)
        ... 20 more
Caused by: java.lang.NullPointerException
        at java.io.File.<init>(File.java:360)
        at org.apache.maven.plugin.assembly.io.RelativeFileLocatorStrategy.resolve(RelativeFileLocatorStrategy.java:45)
        at org.apache.maven.shared.io.location.Locator.resolve(Locator.java:81)
        at org.apache.maven.plugin.assembly.io.DefaultAssemblyReader.addAssemblyFromDescriptor(DefaultAssemblyReader.java:309)
        at org.apache.maven.plugin.assembly.io.DefaultAssemblyReader.readAssemblies(DefaultAssemblyReader.java:140)
        at org.apache.maven.plugin.assembly.mojos.AbstractAssemblyMojo.execute(AbstractAssemblyMojo.java:352)
        at org.apache.maven.plugin.DefaultBuildPluginManager.executeMojo(DefaultBuildPluginManager.java:134)



--
This message was sent by Atlassian JIRA
(v6.3.15#6346)

Mime
View raw message