ambari-issues mailing list archives

Site index · List index
Message view « Date » · « Thread »
Top « Date » · « Thread »
From "Nahappan Somasundaram (JIRA)" <j...@apache.org>
Subject [jira] [Updated] (AMBARI-18927) Unit test failure: ServiceComponentHostTest
Date Fri, 18 Nov 2016 01:28:58 GMT

     [ https://issues.apache.org/jira/browse/AMBARI-18927?page=com.atlassian.jira.plugin.system.issuetabpanels:all-tabpanel
]

Nahappan Somasundaram updated AMBARI-18927:
-------------------------------------------
    Status: Patch Available  (was: Open)

> Unit test failure: ServiceComponentHostTest
> -------------------------------------------
>
>                 Key: AMBARI-18927
>                 URL: https://issues.apache.org/jira/browse/AMBARI-18927
>             Project: Ambari
>          Issue Type: Bug
>          Components: ambari-server
>    Affects Versions: 2.5.0
>            Reporter: Nahappan Somasundaram
>            Assignee: Nahappan Somasundaram
>             Fix For: 2.5.0
>
>         Attachments: rb53868.patch
>
>
> *mvn test -DskipPythonTests -Dtest=ServiceComponentHostTest*
> -------------------------------------------------------
>  T E S T S
> -------------------------------------------------------
> Picked up _JAVA_OPTIONS: -Xmx2048m -XX:MaxPermSize=512m -Djava.awt.headless=true
> Running org.apache.ambari.server.state.svccomphost.ServiceComponentHostTest
> Tests run: 13, Failures: 1, Errors: 0, Skipped: 2, Time elapsed: 29.64 sec <<<
FAILURE! - in org.apache.ambari.server.state.svccomphost.ServiceComponentHostTest
> testStaleConfigs(org.apache.ambari.server.state.svccomphost.ServiceComponentHostTest)
 Time elapsed: 1.879 sec  <<< FAILURE!
> java.lang.AssertionError
> 	at org.apache.ambari.server.state.svccomphost.ServiceComponentHostTest.testStaleConfigs(ServiceComponentHostTest.java:858)
> Results :
> Failed tests:
>   ServiceComponentHostTest.testStaleConfigs:858 null
> Tests run: 13, Failures: 1, Errors: 0, Skipped: 2
> [INFO] ------------------------------------------------------------------------
> [INFO] BUILD FAILURE
> [INFO] ------------------------------------------------------------------------



--
This message was sent by Atlassian JIRA
(v6.3.4#6332)

Mime
View raw message