ambari-issues mailing list archives

Site index · List index
Message view « Date » · « Thread »
Top « Date » · « Thread »
From "Masahiro Tanaka (JIRA)" <j...@apache.org>
Subject [jira] [Commented] (AMBARI-17290) Ambari Metrics Flume Sink test failed at trunk
Date Mon, 20 Jun 2016 23:58:58 GMT

    [ https://issues.apache.org/jira/browse/AMBARI-17290?page=com.atlassian.jira.plugin.system.issuetabpanels:comment-tabpanel&focusedCommentId=15340725#comment-15340725
] 

Masahiro Tanaka commented on AMBARI-17290:
------------------------------------------

AMBARI-17304 fixed this issue

> Ambari Metrics Flume Sink test failed at trunk
> ----------------------------------------------
>
>                 Key: AMBARI-17290
>                 URL: https://issues.apache.org/jira/browse/AMBARI-17290
>             Project: Ambari
>          Issue Type: Bug
>          Components: ambari-metrics
>    Affects Versions: trunk
>         Environment: CentOS6 (Used Dockerfile in dev-support)
>            Reporter: Masahiro Tanaka
>
> I ran {{mvn clean test}} and I got an error.
> {code}
> -------------------------------------------------------
>  T E S T S
> -------------------------------------------------------
> Running org.apache.hadoop.metrics2.sink.flume.FlumeTimelineMetricsSinkTest
> Tests run: 1, Failures: 0, Errors: 1, Skipped: 0, Time elapsed: 0.456 sec <<<
FAILURE! - in org.apache.hadoop.metrics2.sink.flume.FlumeTimelineMetricsSinkTest
> initializationError(org.apache.hadoop.metrics2.sink.flume.FlumeTimelineMetricsSinkTest)
 Time elapsed: 0.006 sec  <<< ERROR!
> java.lang.IllegalStateException: Failed to transform class with name org.apache.hadoop.metrics2.sink.timeline.AbstractTimelineMetricsSink.
Reason: findLiveCollectorHostsFromKnownCollector (Ljava/lang/S
> tring;Ljava/lang/String;)Ljava/util/Collection; in org.apache.hadoop.metrics2.sink.timeline.AbstractTimelineMetricsSink:
failed to resolve types
> Caused by: javassist.CannotCompileException: findLiveCollectorHostsFromKnownCollector
(Ljava/lang/String;Ljava/lang/String;)Ljava/util/Collection; in org.apache.hadoop.metrics2.sink.timeline.AbstractTi
> melineMetricsSink: failed to resolve types
> Caused by: javassist.bytecode.BadBytecode: findLiveCollectorHostsFromKnownCollector (Ljava/lang/String;Ljava/lang/String;)Ljava/util/Collection;
in org.apache.hadoop.metrics2.sink.timeline.AbstractTime
> lineMetricsSink: failed to resolve types
> Caused by: javassist.bytecode.BadBytecode: failed to resolve types
> Caused by: javassist.NotFoundException: com.google.common.reflect.TypeToken
> Results :
> Tests in error:
>   FlumeTimelineMetricsSinkTest.initializationError ยป IllegalState Failed to tran...
> Tests run: 1, Failures: 0, Errors: 1, Skipped: 0
> {code}



--
This message was sent by Atlassian JIRA
(v6.3.4#6332)

Mime
View raw message