ambari-issues mailing list archives

Site index · List index
Message view « Date » · « Thread »
Top « Date » · « Thread »
From "Hudson (JIRA)" <j...@apache.org>
Subject [jira] [Commented] (AMBARI-16265) Storm python tests are brocken
Date Thu, 05 May 2016 10:48:12 GMT

    [ https://issues.apache.org/jira/browse/AMBARI-16265?page=com.atlassian.jira.plugin.system.issuetabpanels:comment-tabpanel&focusedCommentId=15272187#comment-15272187
] 

Hudson commented on AMBARI-16265:
---------------------------------

FAILURE: Integrated in Ambari-trunk-Commit #4796 (See [https://builds.apache.org/job/Ambari-trunk-Commit/4796/])
AMBARI-16265. Storm python tests are brocken.(vbrodetskyi) (vbrodetskyi: [http://git-wip-us.apache.org/repos/asf?p=ambari.git&a=commit&h=0a745f8bacf924b13cb4ba5d444dec45fd492830])
* ambari-server/src/test/python/stacks/2.1/STORM/test_storm_ui_server.py


> Storm python tests are brocken
> ------------------------------
>
>                 Key: AMBARI-16265
>                 URL: https://issues.apache.org/jira/browse/AMBARI-16265
>             Project: Ambari
>          Issue Type: Bug
>          Components: ambari-server
>    Affects Versions: 2.4.0
>            Reporter: Vitaly Brodetskyi
>            Assignee: Vitaly Brodetskyi
>            Priority: Critical
>             Fix For: 2.4.0
>
>         Attachments: AMBARI-16265.patch
>
>
> {code}
> ----------------------------------------------------------------------
> Failed tests:
> FAIL: test_start_default (test_storm_ui_server.TestStormUiServer)
> ----------------------------------------------------------------------
> Traceback (most recent call last):
>   File "/home/vtkhir/projects/ACTUAL-AMBARI/incubator-ambari/ambari-common/src/test/python/mock/mock.py",
line 1199, in patched
>     return func(*args, **keywargs)
>   File "/home/vtkhir/projects/ACTUAL-AMBARI/incubator-ambari/ambari-server/src/test/python/stacks/2.1/STORM/test_storm_ui_server.py",
line 77, in test_start_default
>     try_sleep = 10,
>   File "/home/vtkhir/projects/ACTUAL-AMBARI/incubator-ambari/ambari-server/src/test/python/stacks/utils/RMFTestCase.py",
line 256, in assertResourceCalled
>     self.assertEquals(name, resource.name)
> AssertionError: "/usr/jdk64/jdk1.7.0_45/bin/jps -l  | grep backtype.storm.ui.core$ &&
/usr/jdk64/jdk1.7.0_45/bin/jps -l  | grep backtype.storm.ui.core$ | awk {'print $1'} >
/var/run/storm/ui.pid" != u"/usr/jdk64/jdk1.7.0_45/bin/jps -l  | grep storm.ui.core$ &&
/usr/jdk64/jdk1.7.0_45/bin/jps -l  | grep storm.ui.core$ | awk {'print $1'} > /var/run/storm/ui.pid"
> FAIL: test_start_secured (test_storm_ui_server.TestStormUiServer)
> ----------------------------------------------------------------------
> Traceback (most recent call last):
>   File "/home/vtkhir/projects/ACTUAL-AMBARI/incubator-ambari/ambari-common/src/test/python/mock/mock.py",
line 1199, in patched
>     return func(*args, **keywargs)
>   File "/home/vtkhir/projects/ACTUAL-AMBARI/incubator-ambari/ambari-server/src/test/python/stacks/2.1/STORM/test_storm_ui_server.py",
line 152, in test_start_secured
>     try_sleep = 10,
>   File "/home/vtkhir/projects/ACTUAL-AMBARI/incubator-ambari/ambari-server/src/test/python/stacks/utils/RMFTestCase.py",
line 256, in assertResourceCalled
>     self.assertEquals(name, resource.name)
> AssertionError: "/usr/jdk64/jdk1.7.0_45/bin/jps -l  | grep backtype.storm.ui.core$ &&
/usr/jdk64/jdk1.7.0_45/bin/jps -l  | grep backtype.storm.ui.core$ | awk {'print $1'} >
/var/run/storm/ui.pid" != u"/usr/jdk64/jdk1.7.0_45/bin/jps -l  | grep storm.ui.core$ &&
/usr/jdk64/jdk1.7.0_45/bin/jps -l  | grep storm.ui.core$ | awk {'print $1'} > /var/run/storm/ui.pid"
> ----------------------------------------------------------------------
> Total run:1014
> Total errors:0
> Total failures:2
> ERROR
> {code}



--
This message was sent by Atlassian JIRA
(v6.3.4#6332)

Mime
View raw message