ambari-issues mailing list archives

Site index · List index
Message view « Date » · « Thread »
Top « Date » · « Thread »
From "Jaimin D Jetly (JIRA)" <j...@apache.org>
Subject [jira] [Updated] (AMBARI-16173) Ambari trunk builds fails on Tez view project
Date Thu, 28 Apr 2016 22:39:12 GMT

     [ https://issues.apache.org/jira/browse/AMBARI-16173?page=com.atlassian.jira.plugin.system.issuetabpanels:all-tabpanel
]

Jaimin D Jetly updated AMBARI-16173:
------------------------------------
    Description: 
{code}
[INFO] ------------------------------------------------------------------------
[INFO] Reactor Summary:
[INFO] 
[INFO] Ambari Contrib Views .............................. SUCCESS [9.593s]
[INFO] Ambari View Utils ................................. SUCCESS [7.579s]
[INFO] Ambari View Commons ............................... SUCCESS [2.625s]
[INFO] Files ............................................. SUCCESS [1:11.325s]
[INFO] Jobs .............................................. SUCCESS [1:03.394s]
[INFO] Pig ............................................... SUCCESS [24.869s]
[INFO] Slider ............................................ SUCCESS [24.725s]
[INFO] Capacity Scheduler ................................ SUCCESS [39.088s]
[INFO] Tez ............................................... FAILURE [1.004s]
[INFO] Storm_Monitoring .................................. SKIPPED
[INFO] Zeppelin .......................................... SKIPPED
[INFO] Hue To Ambari Migration-view ...................... SKIPPED
[INFO] Hive .............................................. SKIPPED
[INFO] ------------------------------------------------------------------------
[INFO] BUILD FAILURE
[INFO] ------------------------------------------------------------------------
[INFO] Total time: 4:04.916s
[INFO] Finished at: Thu Apr 28 17:01:56 UTC 2016
[INFO] Final Memory: 76M/1982M
[INFO] ------------------------------------------------------------------------
{code}
{color:red}\[ERROR\] Failed to execute goal com.google.code.maven-replacer-plugin:replacer:1.5.3:replace
(default) on project tez-view: File 'target/classes/index.html' does not exist -> \[Help
1\]{color}

> Ambari trunk builds fails on Tez view project
> ---------------------------------------------
>
>                 Key: AMBARI-16173
>                 URL: https://issues.apache.org/jira/browse/AMBARI-16173
>             Project: Ambari
>          Issue Type: Bug
>    Affects Versions: 2.4.0
>            Reporter: Jaimin D Jetly
>            Assignee: Jaimin D Jetly
>            Priority: Critical
>             Fix For: 2.4.0
>
>         Attachments: AMBARI-16173.patch
>
>
> {code}
> [INFO] ------------------------------------------------------------------------
> [INFO] Reactor Summary:
> [INFO] 
> [INFO] Ambari Contrib Views .............................. SUCCESS [9.593s]
> [INFO] Ambari View Utils ................................. SUCCESS [7.579s]
> [INFO] Ambari View Commons ............................... SUCCESS [2.625s]
> [INFO] Files ............................................. SUCCESS [1:11.325s]
> [INFO] Jobs .............................................. SUCCESS [1:03.394s]
> [INFO] Pig ............................................... SUCCESS [24.869s]
> [INFO] Slider ............................................ SUCCESS [24.725s]
> [INFO] Capacity Scheduler ................................ SUCCESS [39.088s]
> [INFO] Tez ............................................... FAILURE [1.004s]
> [INFO] Storm_Monitoring .................................. SKIPPED
> [INFO] Zeppelin .......................................... SKIPPED
> [INFO] Hue To Ambari Migration-view ...................... SKIPPED
> [INFO] Hive .............................................. SKIPPED
> [INFO] ------------------------------------------------------------------------
> [INFO] BUILD FAILURE
> [INFO] ------------------------------------------------------------------------
> [INFO] Total time: 4:04.916s
> [INFO] Finished at: Thu Apr 28 17:01:56 UTC 2016
> [INFO] Final Memory: 76M/1982M
> [INFO] ------------------------------------------------------------------------
> {code}
> {color:red}\[ERROR\] Failed to execute goal com.google.code.maven-replacer-plugin:replacer:1.5.3:replace
(default) on project tez-view: File 'target/classes/index.html' does not exist -> \[Help
1\]{color}



--
This message was sent by Atlassian JIRA
(v6.3.4#6332)

Mime
View raw message