ambari-issues mailing list archives

Site index · List index
Message view « Date » · « Thread »
Top « Date » · « Thread »
From "Hudson (JIRA)" <j...@apache.org>
Subject [jira] [Commented] (AMBARI-15553) Oozie Unit Test Failures
Date Thu, 24 Mar 2016 16:08:25 GMT

    [ https://issues.apache.org/jira/browse/AMBARI-15553?page=com.atlassian.jira.plugin.system.issuetabpanels:comment-tabpanel&focusedCommentId=15210468#comment-15210468
] 

Hudson commented on AMBARI-15553:
---------------------------------

FAILURE: Integrated in Ambari-trunk-Commit #4539 (See [https://builds.apache.org/job/Ambari-trunk-Commit/4539/])
AMBARI-15553. Oozie Unit Test Failures (aonishuk) (aonishuk: [http://git-wip-us.apache.org/repos/asf?p=ambari.git&a=commit&h=bd7b8693c9a2453066af6e42a65df4e8449f7286])
* ambari-common/src/main/python/resource_management/libraries/functions/oozie_prepare_war.py


> Oozie Unit Test Failures
> ------------------------
>
>                 Key: AMBARI-15553
>                 URL: https://issues.apache.org/jira/browse/AMBARI-15553
>             Project: Ambari
>          Issue Type: Bug
>          Components: ambari-server
>    Affects Versions: 2.4.0
>            Reporter: Jayush Luniya
>            Assignee: Andrew Onischuk
>            Priority: Blocker
>             Fix For: 2.4.0
>
>         Attachments: AMBARI-15553.patch
>
>
> Seeing following unit test failures in trunk. [~aonishuk] Can you take a look at it?
> ----------------------------------------------------------------------
> Failed tests:
> FAIL: test_configure_default (test_oozie_server.TestOozieServer)
> ----------------------------------------------------------------------
> Traceback (most recent call last):
>   File "/Users/jluniya/release/trunk2/ambari/ambari-common/src/test/python/mock/mock.py",
line 1199, in patched
>     return func(*args, **keywargs)
>   File "/Users/jluniya/release/trunk2/ambari/ambari-server/src/test/python/stacks/2.0.6/OOZIE/test_oozie_server.py",
line 55, in test_configure_default
>     self.assert_configure_default()
>   File "/Users/jluniya/release/trunk2/ambari/ambari-server/src/test/python/stacks/2.0.6/OOZIE/test_oozie_server.py",
line 868, in assert_configure_default
>     mode = 0644,
>   File "/Users/jluniya/release/trunk2/ambari/ambari-server/src/test/python/stacks/utils/RMFTestCase.py",
line 254, in assertResourceCalled
>     self.assertEquals(kwargs, resource.arguments)
> AssertionError: {'content': 'ext-2.2.zip', 'mode': 420} != {'content': '', 'mode': 420}
> - {'content': 'ext-2.2.zip', 'mode': 420}
> ?              -----------
> + {'content': '', 'mode': 420}
> FAIL: test_configure_default_hdp22 (test_oozie_server.TestOozieServer)
> ----------------------------------------------------------------------
> Traceback (most recent call last):
>   File "/Users/jluniya/release/trunk2/ambari/ambari-common/src/test/python/mock/mock.py",
line 1199, in patched
>     return func(*args, **keywargs)
>   File "/Users/jluniya/release/trunk2/ambari/ambari-server/src/test/python/stacks/2.0.6/OOZIE/test_oozie_server.py",
line 1091, in test_configure_default_hdp22
>     self.assert_configure_default()
>   File "/Users/jluniya/release/trunk2/ambari/ambari-server/src/test/python/stacks/2.0.6/OOZIE/test_oozie_server.py",
line 868, in assert_configure_default
>     mode = 0644,
>   File "/Users/jluniya/release/trunk2/ambari/ambari-server/src/test/python/stacks/utils/RMFTestCase.py",
line 254, in assertResourceCalled
>     self.assertEquals(kwargs, resource.arguments)
> AssertionError: {'content': 'ext-2.2.zip', 'mode': 420} != {'content': '', 'mode': 420}
> - {'content': 'ext-2.2.zip', 'mode': 420}
> ?              -----------
> + {'content': '', 'mode': 420}
> FAIL: test_configure_default_mysql (test_oozie_server.TestOozieServer)
> ----------------------------------------------------------------------
> Traceback (most recent call last):
>   File "/Users/jluniya/release/trunk2/ambari/ambari-common/src/test/python/mock/mock.py",
line 1199, in patched
>     return func(*args, **keywargs)
>   File "/Users/jluniya/release/trunk2/ambari/ambari-server/src/test/python/stacks/2.0.6/OOZIE/test_oozie_server.py",
line 269, in test_configure_default_mysql
>     mode = 0644,
>   File "/Users/jluniya/release/trunk2/ambari/ambari-server/src/test/python/stacks/utils/RMFTestCase.py",
line 254, in assertResourceCalled
>     self.assertEquals(kwargs, resource.arguments)
> AssertionError: {'content': 'ext-2.2.zip', 'mode': 420} != {'content': '', 'mode': 420}
> - {'content': 'ext-2.2.zip', 'mode': 420}
> ?              -----------
> + {'content': '', 'mode': 420}
> FAIL: test_configure_existing_sqla (test_oozie_server.TestOozieServer)
> ----------------------------------------------------------------------
> Traceback (most recent call last):
>   File "/Users/jluniya/release/trunk2/ambari/ambari-common/src/test/python/mock/mock.py",
line 1199, in patched
>     return func(*args, **keywargs)
>   File "/Users/jluniya/release/trunk2/ambari/ambari-server/src/test/python/stacks/2.0.6/OOZIE/test_oozie_server.py",
line 495, in test_configure_existing_sqla
>     mode = 0644,
>   File "/Users/jluniya/release/trunk2/ambari/ambari-server/src/test/python/stacks/utils/RMFTestCase.py",
line 254, in assertResourceCalled
>     self.assertEquals(kwargs, resource.arguments)
> AssertionError: {'content': 'ext-2.2.zip', 'mode': 420} != {'content': '', 'mode': 420}
> - {'content': 'ext-2.2.zip', 'mode': 420}
> ?              -----------
> + {'content': '', 'mode': 420}
> FAIL: test_configure_secured (test_oozie_server.TestOozieServer)
> ----------------------------------------------------------------------
> Traceback (most recent call last):
>   File "/Users/jluniya/release/trunk2/ambari/ambari-common/src/test/python/mock/mock.py",
line 1199, in patched
>     return func(*args, **keywargs)
>   File "/Users/jluniya/release/trunk2/ambari/ambari-server/src/test/python/stacks/2.0.6/OOZIE/test_oozie_server.py",
line 599, in test_configure_secured
>     self.assert_configure_secured()
>   File "/Users/jluniya/release/trunk2/ambari/ambari-server/src/test/python/stacks/2.0.6/OOZIE/test_oozie_server.py",
line 1063, in assert_configure_secured
>     mode = 0644,
>   File "/Users/jluniya/release/trunk2/ambari/ambari-server/src/test/python/stacks/utils/RMFTestCase.py",
line 254, in assertResourceCalled
>     self.assertEquals(kwargs, resource.arguments)
> AssertionError: {'content': 'ext-2.2.zip', 'mode': 420} != {'content': '', 'mode': 420}
> - {'content': 'ext-2.2.zip', 'mode': 420}
> ?              -----------
> + {'content': '', 'mode': 420}
> FAIL: test_start_default (test_oozie_server.TestOozieServer)
> ----------------------------------------------------------------------
> Traceback (most recent call last):
>   File "/Users/jluniya/release/trunk2/ambari/ambari-common/src/test/python/mock/mock.py",
line 1199, in patched
>     return func(*args, **keywargs)
>   File "/Users/jluniya/release/trunk2/ambari/ambari-server/src/test/python/stacks/2.0.6/OOZIE/test_oozie_server.py",
line 521, in test_start_default
>     self.assert_configure_default()
>   File "/Users/jluniya/release/trunk2/ambari/ambari-server/src/test/python/stacks/2.0.6/OOZIE/test_oozie_server.py",
line 868, in assert_configure_default
>     mode = 0644,
>   File "/Users/jluniya/release/trunk2/ambari/ambari-server/src/test/python/stacks/utils/RMFTestCase.py",
line 254, in assertResourceCalled
>     self.assertEquals(kwargs, resource.arguments)
> AssertionError: {'content': 'ext-2.2.zip', 'mode': 420} != {'content': '', 'mode': 420}
> - {'content': 'ext-2.2.zip', 'mode': 420}
> ?              -----------
> + {'content': '', 'mode': 420}
> FAIL: test_start_secured (test_oozie_server.TestOozieServer)
> ----------------------------------------------------------------------
> Traceback (most recent call last):
>   File "/Users/jluniya/release/trunk2/ambari/ambari-common/src/test/python/mock/mock.py",
line 1199, in patched
>     return func(*args, **keywargs)
>   File "/Users/jluniya/release/trunk2/ambari/ambari-server/src/test/python/stacks/2.0.6/OOZIE/test_oozie_server.py",
line 616, in test_start_secured
>     self.assert_configure_secured()
>   File "/Users/jluniya/release/trunk2/ambari/ambari-server/src/test/python/stacks/2.0.6/OOZIE/test_oozie_server.py",
line 1063, in assert_configure_secured
>     mode = 0644,
>   File "/Users/jluniya/release/trunk2/ambari/ambari-server/src/test/python/stacks/utils/RMFTestCase.py",
line 254, in assertResourceCalled
>     self.assertEquals(kwargs, resource.arguments)
> AssertionError: {'content': 'ext-2.2.zip', 'mode': 420} != {'content': '', 'mode': 420}
> - {'content': 'ext-2.2.zip', 'mode': 420}
> ?              -----------
> + {'content': '', 'mode': 420}
> ----------------------------------------------------------------------
> Total run:929
> Total errors:0
> Total failures:7



--
This message was sent by Atlassian JIRA
(v6.3.4#6332)

Mime
View raw message