ambari-dev mailing list archives

Site index · List index
Message view « Date » · « Thread »
Top « Date » · « Thread »
From "Hudson (JIRA)" <j...@apache.org>
Subject [jira] [Commented] (AMBARI-14741) Ambari Web Unit Test failure on trunk (App.WizardStep8Controller)
Date Wed, 20 Jan 2016 22:55:40 GMT

    [ https://issues.apache.org/jira/browse/AMBARI-14741?page=com.atlassian.jira.plugin.system.issuetabpanels:comment-tabpanel&focusedCommentId=15109667#comment-15109667
] 

Hudson commented on AMBARI-14741:
---------------------------------

FAILURE: Integrated in Ambari-trunk-Commit #4201 (See [https://builds.apache.org/job/Ambari-trunk-Commit/4201/])
AMBARI-14741. Ambari Web Unit Test failure on trunk (onechiporenko: [http://git-wip-us.apache.org/repos/asf?p=ambari.git&a=commit&h=ddf479ef9ef1f4754cbfae075f0a9f36d99c901e])
* ambari-web/test/views/common/configs/config_history_flow_test.js
* ambari-web/test/controllers/global/update_controller_test.js
* ambari-web/test/controllers/global/user_settings_controller_test.js
* ambari-web/test/controllers/application_test.js
* ambari-web/test/controllers/main/service/item_test.js
* ambari-web/test/views/main/host/details/host_component_views/datanode_view_test.js
* ambari-web/test/views/common/chart/linear_time_test.js
* ambari-web/test/views/main/admin/stack_upgrade/version_view_test.js
* ambari-web/test/controllers/wizard/step7_test.js
* ambari-web/test/controllers/main/admin/highAvailability/resourceManager/step3_controller_test.js
* ambari-web/test/controllers/wizard/step2_test.js
* ambari-web/test/controllers/main/admin/kerberos_test.js
* ambari-web/package.json
* ambari-web/test/controllers/main/alerts/alert_instances_controller_test.js
* ambari-web/test/models/cluster_states_test.js
* ambari-web/test/views/common/widget/graph_widget_view_test.js
* ambari-web/test/controllers/wizard/step3_test.js
* ambari-web/test/controllers/main/service/reassign/step1_controller_test.js
* ambari-web/test/controllers/main_test.js
* ambari-web/test/helpers.js
* ambari-web/test/views/main/admin/stack_upgrade/upgrade_group_view_test.js
* ambari-web/test/mixins/wizard/wizardProgressPageController_test.js
* ambari-web/test/controllers/main/admin/highAvailability/progress_popup_controller_test.js
* ambari-web/test/views/common/widget/gauge_widget_view_test.js
* ambari-web/test/views/main/dashboard/widgets_test.js
* ambari-web/test/mixins/common/widget_mixin_test.js
* ambari-web/app/assets/test/tests.js
* ambari-web/test/controllers/main/alerts/definitions_details_controller_test.js
* ambari-web/app/utils/ajax/ajax_queue.js
* ambari-web/app/router.js
* ambari-web/test/views/main/dashboard/widget_test.js
* ambari-web/test/mixins/common/table_server_view_mixin_test.js
* ambari-web/test/mixins/main/host/details/host_components/install_component_test.js
* ambari-web/test/views/common/controls_view_test.js
* ambari-web/test/router_test.js
* ambari-web/test/controllers/main/alerts/manage_alert_notifications_controller_test.js
* ambari-web/test/views/main/host/details/host_component_views/decommissionable_test.js
* ambari-web/test/utils/host_progress_popup_test.js
* ambari-web/test/controllers/global/background_operations_test.js
* ambari-web/test/controllers/main/service/reassign/step6_controller_test.js
* ambari-web/test/controllers/main/admin/highAvailability/progress_controller_test.js
* ambari-web/test/models/host_test.js
* ambari-web/test/mixins/main/host/details/host_components/decommissionable_test.js
* ambari-web/test/controllers/main/service/add_controller_test.js
* ambari-web/test/utils/batch_scheduled_requests_test.js
* ambari-web/test/controllers/global/cluster_controller_test.js
* ambari-web/app/utils/ajax/ajax.js
* ambari-web/test/views/main/service/services/ranger_test.js
* ambari-web/test/views/common/widget/number_widget_view_test.js
* ambari-web/test/views/main/admin/stack_upgrade/upgrade_wizard_view_test.js
* ambari-web/test/controllers/main/service_test.js
* ambari-web/test/utils/ajax/ajax_test.js
* ambari-web/test/controllers/main/alerts/definitions_configs_controller_test.js
* ambari-web/test/controllers/main/charts/heatmap_test.js
* ambari-web/test/controllers/main/alert_definitions_controller_test.js
* ambari-web/test/controllers/main/views_controller_test.js
* ambari-web/test/utils/ajax/ajax_queue_test.js
* ambari-web/test/controllers/main/admin/stack_and_upgrade_controller_test.js
* ambari-web/test/controllers/main/alerts/add_alert_definition/add_alert_definition_controller_test.js
* ambari-web/test/controllers/main/host/details_test.js
* ambari-web/test/utils/updater_test.js
* ambari-web/app/utils/helper.js
* ambari-web/test/controllers/installer_test.js
* ambari-web/test/controllers/main/dashboard/config_history_controller_test.js
* ambari-web/test/controllers/main/service/reassign/step4_controller_test.js
* ambari-web/test/controllers/wizard/step8_test.js
* ambari-web/test/controllers/main/host/add_controller_test.js
* ambari-web/test/controllers/main/service/info/config_test.js
* ambari-web/test/views/main/dashboard/widgets/namenode_cpu_test.js
* ambari-web/test/controllers/wizard_test.js
* ambari-web/test/controllers/main/service/reassign/step7_controller_test.js
* ambari-web/test/controllers/main/host_test.js
* ambari-web/test/controllers/wizard/step9_test.js
* ambari-web/test/controllers/main/service/info/summary_test.js
* ambari-web/test/views/common/quick_link_view_test.js
* ambari-web/test/controllers/wizard/step6_test.js
* ambari-web/test/mixins/common/widgets/export_metrics_mixin_test.js


> Ambari Web Unit Test failure on trunk (App.WizardStep8Controller)
> -----------------------------------------------------------------
>
>                 Key: AMBARI-14741
>                 URL: https://issues.apache.org/jira/browse/AMBARI-14741
>             Project: Ambari
>          Issue Type: Bug
>          Components: ambari-web
>    Affects Versions: 2.4.0
>            Reporter: Oleg Nechiporenko
>            Assignee: Oleg Nechiporenko
>            Priority: Critical
>             Fix For: 2.4.0
>
>         Attachments: AMBARI-14741.patch
>
>
>   ✖ 1 of 23093 tests failed:
>   1) Ambari Web Unit tests test/controllers/wizard/step8_test App.WizardStep8Controller
Queued requests #createNotification "before each" hook:
>      TypeError: 'undefined' is not a function (near '...then(function () {...')
(file:///home/jenkins/jenkins-slave/workspace/Ambari-trunk-Commit/ambari-web/public/javascripts/app.js:34107)
>   
> 
> TypeError: 'undefined' is not a function (near '...then(function () {...')
>   file:///home/jenkins/jenkins-slave/workspace/Ambari-trunk-Commit/ambari-web/public/javascripts/app.js:34107
>   file:///home/jenkins/jenkins-slave/workspace/Ambari-trunk-Commit/ambari-web/public/javascripts/app.js:34033
> npm ERR! Test failed.  See above for more details.
> npm ERR! not ok code 0
> {code}



--
This message was sent by Atlassian JIRA
(v6.3.4#6332)

Mime
View raw message