ambari-dev mailing list archives

Site index · List index
Message view « Date » · « Thread »
Top « Date » · « Thread »
From "Jayush Luniya (JIRA)" <>
Subject [jira] [Created] (AMBARI-14346) Apache Build Failure: Surefire crashes
Date Fri, 11 Dec 2015 19:12:46 GMT
Jayush Luniya created AMBARI-14346:

             Summary: Apache Build Failure: Surefire crashes
                 Key: AMBARI-14346
             Project: Ambari
          Issue Type: Bug
          Components: ambari-server
    Affects Versions: 2.3.0
            Reporter: Jayush Luniya
            Assignee: Ajit Kumar
            Priority: Blocker
             Fix For: 2.3.0

Surefire crashes. This looks like We should
update surefire plugin version from 2.13 to 2.15+

ERROR] Failed to execute goal org.codehaus.mojo:exec-maven-plugin:1.2.1:exec (ambari-web unit
tests) on project ambari-web: Command execution failed. Process exited with an error: 1 (Exit
value: 1) -> [Help 1]
[ERROR] Failed to execute goal org.apache.maven.plugins:maven-surefire-plugin:2.13:test (default-test)
on project ambari-server: ExecutionException; nested exception is java.util.concurrent.ExecutionException:
java.lang.RuntimeException: There was an error in the forked process
[ERROR] org.apache.maven.surefire.testset.TestSetFailedException: java.lang.ArrayIndexOutOfBoundsException:
0; nested exception is java.lang.ArrayIndexOutOfBoundsException: 0
[ERROR] java.lang.ArrayIndexOutOfBoundsException: 0
[ERROR] at
[ERROR] at
[ERROR] at org.apache.maven.surefire.common.junit4.JUnit4StackTraceWriter.smartTrimmedStackTrace(
[ERROR] at org.apache.maven.surefire.booter.ForkingRunListener.encode(
[ERROR] at org.apache.maven.surefire.booter.ForkingRunListener.encode(
[ERROR] at org.apache.maven.surefire.booter.ForkingRunListener.toString(
[ERROR] at org.apache.maven.surefire.booter.ForkingRunListener.testError(
[ERROR] at org.apache.maven.surefire.common.junit4.JUnit4RunListener.testFailure(
[ERROR] at org.junit.runner.notification.RunNotifier$4.notifyListener(
[ERROR] at org.junit.runner.notification.RunNotifier$
[ERROR] at org.junit.runner.notification.RunNotifier.fireTestFailure(
[ERROR] at org.junit.internal.runners.model.EachTestNotifier.addFailure(
[ERROR] at org.junit.runners.ParentRunner.runLeaf(
[ERROR] at org.junit.runners.BlockJUnit4ClassRunner.runChild(
[ERROR] at org.junit.runners.BlockJUnit4ClassRunner.runChild(
[ERROR] at org.junit.runners.ParentRunner$
[ERROR] at org.junit.runners.ParentRunner$1.schedule(
[ERROR] at org.junit.runners.ParentRunner.runChildren(
[ERROR] at org.junit.runners.ParentRunner.access$000(
[ERROR] at org.junit.runners.ParentRunner$2.evaluate(
[ERROR] at
[ERROR] at org.apache.maven.surefire.junit4.JUnit4Provider.execute(
[ERROR] at org.apache.maven.surefire.junit4.JUnit4Provider.executeTestSet(
[ERROR] at org.apache.maven.surefire.junit4.JUnit4Provider.invoke(
[ERROR] at sun.reflect.NativeMethodAccessorImpl.invoke0(Native Method)
[ERROR] at sun.reflect.NativeMethodAccessorImpl.invoke(
[ERROR] at sun.reflect.DelegatingMethodAccessorImpl.invoke(
[ERROR] at java.lang.reflect.Method.invoke(
[ERROR] at org.apache.maven.surefire.util.ReflectionUtils.invokeMethodWithArray2(
[ERROR] at org.apache.maven.surefire.booter.ProviderFactory$ProviderProxy.invoke(
[ERROR] at org.apache.maven.surefire.booter.ProviderFactory.invokeProvider(
[ERROR] at org.apache.maven.surefire.booter.ForkedBooter.runSuitesInProcess(
[ERROR] at org.apache.maven.surefire.booter.ForkedBooter.main(
[ERROR] -> [Help 2]
[ERROR] To see the full stack trace of the errors, re-run Maven with the -e switch.
[ERROR] Re-run Maven using the -X switch to enable full debug logging.
[ERROR] For more information about the errors and possible solutions, please read the following
[ERROR] [Help 1]
[ERROR] [Help 2]
[ERROR] After correcting the problems, you can resume the build with the command
[ERROR]   mvn <goals> -rf :ambari-web
Build step 'Execute shell' marked build as failure
Updating AMBARI-14277
Recording test results
Warning: you have no plugins providing access control for builds, so falling back to legacy
behavior of permitting any downstream builds to be triggered
Triggering a new build of Ambari-view
Finished: FAILURE
Page generated: Dec 11, 2015 7:04:24 PMREST APIJenkins ver. 1.609.3

This message was sent by Atlassian JIRA

View raw message