ambari-dev mailing list archives

Site index · List index
Message view « Date » · « Thread »
Top « Date » · « Thread »
From "Hudson (JIRA)" <j...@apache.org>
Subject [jira] [Commented] (AMBARI-14146) Some Views no longer compile because of npm repo issues
Date Wed, 02 Dec 2015 00:07:11 GMT

    [ https://issues.apache.org/jira/browse/AMBARI-14146?page=com.atlassian.jira.plugin.system.issuetabpanels:comment-tabpanel&focusedCommentId=15034926#comment-15034926
] 

Hudson commented on AMBARI-14146:
---------------------------------

FAILURE: Integrated in Ambari-branch-2.1 #979 (See [https://builds.apache.org/job/Ambari-branch-2.1/979/])
AMBARI-14146. Some Views no longer compile because of npm repo issues. (yusaku: [http://git-wip-us.apache.org/repos/asf?p=ambari.git&a=commit&h=bafdd65af83fa621f110601b0a913ab8c4b117c4])
* contrib/views/files/pom.xml
* contrib/views/pig/pom.xml
* contrib/views/capacity-scheduler/pom.xml


> Some Views no longer compile because of npm repo issues
> -------------------------------------------------------
>
>                 Key: AMBARI-14146
>                 URL: https://issues.apache.org/jira/browse/AMBARI-14146
>             Project: Ambari
>          Issue Type: Bug
>          Components: ambari-views
>    Affects Versions: 2.1.3
>            Reporter: Yusaku Sako
>            Assignee: Yusaku Sako
>            Priority: Critical
>             Fix For: 2.2.0, 2.1.2, 2.1.3
>
>         Attachments: AMBARI-14146.patch
>
>
> [INFO] Ambari Contrib Views .............................. SUCCESS [3.611s]
> [INFO] Ambari View Utils ................................. SUCCESS [5.393s]
> [INFO] Files ............................................. FAILURE [11:46.546s]
> [INFO] Jobs .............................................. SKIPPED
> [INFO] Pig ............................................... SKIPPED
> [INFO] Slider ............................................ SKIPPED
> [INFO] Capacity Scheduler ................................ SKIPPED
> [INFO] Tez ............................................... SKIPPED
> [INFO] Storm_Monitoring .................................. SKIPPED
> [INFO] Hive .............................................. SKIPPED
> [INFO] ------------------------------------------------------------------------
> [INFO] BUILD FAILURE
> [INFO] ------------------------------------------------------------------------
> [INFO] Total time: 11:56.184s
> [INFO] Finished at: Tue Dec 01 17:23:21 UTC 2015
> [INFO] Final Memory: 49M/1962M
> [INFO] ------------------------------------------------------------------------
> [ERROR] Failed to execute goal com.github.eirslett:frontend-maven-plugin:0.0.16:npm (npm
install) on project files: Failed to run task: 'npm install --unsafe-perm --registry=http://registry.npmjs.eu
--color=false' failed. (error code 47) -> [Help 1]
> [ERROR] 
> [ERROR] To see the full stack trace of the errors, re-run Maven with the -e switch.
> [ERROR] Re-run Maven using the -X switch to enable full debug logging.
> [ERROR] 
> [ERROR] For more information about the errors and possible solutions, please read the
following articles:
> [ERROR] [Help 1] http://cwiki.apache.org/confluence/display/MAVEN/MojoFailureException
> [ERROR] 



--
This message was sent by Atlassian JIRA
(v6.3.4#6332)

Mime
View raw message