ambari-dev mailing list archives

Site index · List index
Message view « Date » · « Thread »
Top « Date » · « Thread »
From "Vitaly Brodetskyi (JIRA)" <j...@apache.org>
Subject [jira] [Created] (AMBARI-11692) ClusterDeadlockTest unit test fails
Date Thu, 04 Jun 2015 14:55:38 GMT
Vitaly Brodetskyi created AMBARI-11692:
------------------------------------------

             Summary: ClusterDeadlockTest unit test fails
                 Key: AMBARI-11692
                 URL: https://issues.apache.org/jira/browse/AMBARI-11692
             Project: Ambari
          Issue Type: Bug
          Components: ambari-server
    Affects Versions: 2.1.0
            Reporter: Vitaly Brodetskyi
            Assignee: Vitaly Brodetskyi
            Priority: Critical
             Fix For: 2.1.0


Fails on 2 ubuntu workstations

{noformat}

Tests in error:
  testDeadlockWhileRestartingComponents(org.apache.ambari.server.state.cluster.ClusterDeadlockTest):
test timed out after 75000 milliseconds

Tests run: 3016, Failures: 0, Errors: 1, Skipped: 21

[INFO] ------------------------------------------------------------------------
[INFO] Reactor Summary:
[INFO]
[INFO] Ambari Views ...................................... SUCCESS [4.863s]
[INFO] Ambari Server ..................................... FAILURE [1:49:50.358s]
[INFO] ------------------------------------------------------------------------
[INFO] BUILD FAILURE

{noformat}

{noformat}
java.lang.Exception: test timed out after 75000 milliseconds
	at java.lang.Object.wait(Native Method)
	at java.lang.Thread.join(Thread.java:1281)
	at java.lang.Thread.join(Thread.java:1355)
	at org.apache.ambari.server.state.cluster.ClusterDeadlockTest.testDeadlockWhileRestartingComponents(ClusterDeadlockTest.java:241)
	at sun.reflect.NativeMethodAccessorImpl.invoke0(Native Method)
	at sun.reflect.NativeMethodAccessorImpl.invoke(NativeMethodAccessorImpl.java:57)
	at sun.reflect.DelegatingMethodAccessorImpl.invoke(DelegatingMethodAccessorImpl.java:43)
	at org.junit.runners.model.FrameworkMethod$1.runReflectiveCall(FrameworkMethod.java:45)
	at org.junit.internal.runners.model.ReflectiveCallable.run(ReflectiveCallable.java:15)
	at org.junit.runners.model.FrameworkMethod.invokeExplosively(FrameworkMethod.java:42)
	at org.junit.internal.runners.statements.InvokeMethod.evaluate(InvokeMethod.java:20)
	at org.junit.internal.runners.statements.FailOnTimeout$StatementThread.run(FailOnTimeout.java:62)

	at org.apache.ambari.server.state.svccomphost.ServiceComponentHostImpl.getDesiredStateEntity(ServiceComponentHostImpl.java:1555)
	at org.apache.ambari.server.state.svccomphost.ServiceComponentHostImpl.isRestartRequired(ServiceComponentHostImpl.java:1478)
	at org.apache.ambari.server.state.ConfigHelper.calculateIsStaleConfigs(ConfigHelper.java:927)
	at org.apache.ambari.server.state.ConfigHelper.isStaleConfigs(ConfigHelper.java:376)
	at org.apache.ambari.server.state.cluster.ClusterImpl.getClusterHealthReport(ClusterImpl.java:2580)
{noformat}

Reproduced in trunk, last commit
{noformat}
commit a52eb51d1af0edc9273a947535a2a36886e625da
Author: Oleg Nechiporenko <onechiporenko@apache.org>
Date:   Thu May 28 18:02:28 2015 +0300

    AMBARI-11484. Configs: when doing override, it's hard to find config override (onechiporenko)

{noformat}




--
This message was sent by Atlassian JIRA
(v6.3.4#6332)

Mime
View raw message