ambari-dev mailing list archives

Site index · List index
Message view « Date » · « Thread »
Top « Date » · « Thread »
From "Mahadev konar (JIRA)" <j...@apache.org>
Subject [jira] [Commented] (AMBARI-11547) Bad relative path in the views pom resulting in build failure
Date Fri, 29 May 2015 19:51:17 GMT

    [ https://issues.apache.org/jira/browse/AMBARI-11547?page=com.atlassian.jira.plugin.system.issuetabpanels:comment-tabpanel&focusedCommentId=14565290#comment-14565290
] 

Mahadev konar commented on AMBARI-11547:
----------------------------------------

+1 

> Bad relative path in the views pom resulting in build failure
> -------------------------------------------------------------
>
>                 Key: AMBARI-11547
>                 URL: https://issues.apache.org/jira/browse/AMBARI-11547
>             Project: Ambari
>          Issue Type: Bug
>          Components: contrib
>    Affects Versions: 2.1.0
>            Reporter: Sumit Mohanty
>            Assignee: Sumit Mohanty
>            Priority: Critical
>             Fix For: 2.1.0
>
>         Attachments: AMBARI-11547.patch
>
>
> {noformat}
> [INFO] ------------------------------------------------------------------------
> [INFO] Reactor Summary:
> [INFO] 
> [INFO] Apache Ambari Project POM ......................... SUCCESS [2.061s]
> [INFO] Ambari Web ........................................ SUCCESS [30.878s]
> [INFO] Ambari Views ...................................... SUCCESS [1.973s]
> [INFO] Ambari Admin View ................................. SUCCESS [53.557s]
> [INFO] Ambari View Utils ................................. FAILURE [3.265s]
> [INFO] Files ............................................. SKIPPED
> [INFO] Pig ............................................... SKIPPED
> [INFO] Slider ............................................ SKIPPED
> [INFO] Capacity Scheduler ................................ SKIPPED
> [INFO] Hive .............................................. SKIPPED
> [INFO] Tez ............................................... SKIPPED
> [INFO] Ambari Metrics Common ............................. SKIPPED
> [INFO] Ambari Server ..................................... SKIPPED
> [INFO] Ambari Agent ...................................... SKIPPED
> [INFO] Ambari Client ..................................... SKIPPED
> [INFO] Ambari Shell ...................................... SKIPPED
> [INFO] ------------------------------------------------------------------------
> [INFO] BUILD FAILURE
> [INFO] ------------------------------------------------------------------------
> [INFO] Total time: 1:33.038s
> [INFO] Finished at: Fri May 29 19:12:22 UTC 2015
> [INFO] Final Memory: 46M/1962M
> [INFO] ------------------------------------------------------------------------
> [ERROR] Failed to execute goal org.vafer:jdeb:1.0.1:jdeb (default-cli) on project ambari-views-utils:
Failed to create debian package /grid/0/jenkins/workspace/Ambari-2.1.0-ubuntu12/hdp-BUILDS/ambari/contrib/views/utils/target/ambari-views-utils_0.0.1~SNAPSHOT_all.deb:
"/grid/0/jenkins/workspace/Ambari-2.1.0-ubuntu12/hdp-BUILDS/ambari/contrib/views/utils/../../ambari-project/src/main/package/deb/control"
is not a valid 'control' directory) -> [Help 1]
> {noformat}



--
This message was sent by Atlassian JIRA
(v6.3.4#6332)

Mime
View raw message