ambari-dev mailing list archives

Site index · List index
Message view « Date » · « Thread »
Top « Date » · « Thread »
From Dmitro Lysnichenko <dlysniche...@hortonworks.com>
Subject Re: Build Error - Any Ideas
Date Thu, 26 Mar 2015 14:17:38 GMT
Hi

Try something like

mvn clean package rpm:rpm -pl 
ambari-agent,ambari-views,ambari-web,ambari-server,ambari-admin,ambari-metrics/ambari-metrics-common

-DskipTests -Dfindbugs.skip -Drat.ignoreErrors -Dpython.ver="python >= 
2.6" -Preplaceurl -Dstack.distribution=HDP

On 26/03/2015 04:14 PM, Scott Creeley wrote:
> Hi Everyone,
> Been a few months and I haven't build latest 2.0.0 trunk yet, did something change or
anyone else run into this?
>
>
> [INFO] BUILD FAILURE
> [INFO] ------------------------------------------------------------------------
> [INFO] Total time: 1:06.240s
> [INFO] Finished at: Thu Mar 26 08:59:33 GMT-05:00 2015
> [INFO] Final Memory: 41M/1262M
> [INFO] ------------------------------------------------------------------------
> [ERROR] Failed to execute goal on project ambari-server: Could not resolve dependencies
for project org.apache.ambari:ambari-server:jar:2.0.0-1: Could not find artifact org.apache.ambari:ambari-metrics-common:jar:2.0.0-1
in oss.sonatype.org (https://oss.sonatype.org/content/groups/staging) -> [Help 1]
> [ERROR]
>
>
> I can run previous builds fine...so I'm only affected on 2.0.0
>
> thanks,
> Scott


Mime
View raw message