ambari-dev mailing list archives

Site index · List index
Message view « Date » · « Thread »
Top « Date » · « Thread »
From "Yusaku Sako (JIRA)" <j...@apache.org>
Subject [jira] [Created] (AMBARI-7505) Unit test failures for stack advisor
Date Fri, 26 Sep 2014 00:21:35 GMT
Yusaku Sako created AMBARI-7505:
-----------------------------------

             Summary: Unit test failures for stack advisor
                 Key: AMBARI-7505
                 URL: https://issues.apache.org/jira/browse/AMBARI-7505
             Project: Ambari
          Issue Type: Bug
          Components: ambari-server
    Affects Versions: 1.7.0
            Reporter: Yusaku Sako
             Fix For: 1.7.0


Unit tests for ambari-server are failing:

----------------------------------------------------------------------
Failed tests:
ERROR: test_getClusterData_noHostsWithoutHBase (test_stack_advisor.TestHDP206StackAdvisor)
----------------------------------------------------------------------
Traceback (most recent call last):
  File "/home/jenkins/jenkins-slave/workspace/Ambari-trunk-Commit/ambari-server/src/test/python/stacks/2.0.6/common/test_stack_advisor.py",
line 373, in test_getClusterData_noHostsWithoutHBase
    result = self.stackAdvisor.getClusterData(servicesList, hosts, components)
AttributeError: 'HDP206StackAdvisor' object has no attribute 'getClusterData'

ERROR: test_getClusterData_withHBaseAnd48gbRam (test_stack_advisor.TestHDP206StackAdvisor)
----------------------------------------------------------------------
Traceback (most recent call last):
  File "/home/jenkins/jenkins-slave/workspace/Ambari-trunk-Commit/ambari-server/src/test/python/stacks/2.0.6/common/test_stack_advisor.py",
line 320, in test_getClusterData_withHBaseAnd48gbRam
    result = self.stackAdvisor.getClusterData(servicesList, hosts, components)
AttributeError: 'HDP206StackAdvisor' object has no attribute 'getClusterData'

ERROR: test_getClusterData_withHBaseAnd6gbRam (test_stack_advisor.TestHDP206StackAdvisor)
----------------------------------------------------------------------
Traceback (most recent call last):
  File "/home/jenkins/jenkins-slave/workspace/Ambari-trunk-Commit/ambari-server/src/test/python/stacks/2.0.6/common/test_stack_advisor.py",
line 278, in test_getClusterData_withHBaseAnd6gbRam
    result = self.stackAdvisor.getClusterData(servicesList, hosts, components)
AttributeError: 'HDP206StackAdvisor' object has no attribute 'getClusterData'

----------------------------------------------------------------------
Total run:620
Total errors:3
Total failures:0



--
This message was sent by Atlassian JIRA
(v6.3.4#6332)

Mime
View raw message