ambari-dev mailing list archives

Site index · List index
Message view « Date » · « Thread »
Top « Date » · « Thread »
From "Yusaku Sako (JIRA)" <j...@apache.org>
Subject [jira] [Comment Edited] (AMBARI-7120) Current trunk won't build
Date Wed, 03 Sep 2014 16:29:52 GMT

    [ https://issues.apache.org/jira/browse/AMBARI-7120?page=com.atlassian.jira.plugin.system.issuetabpanels:comment-tabpanel&focusedCommentId=14120037#comment-14120037
] 

Yusaku Sako edited comment on AMBARI-7120 at 9/3/14 4:29 PM:
-------------------------------------------------------------

The problem went away temporarily, but another build issue is occurring due to the same gifsicle
module problem on the Jobs view now.
Since we are not really using it, the new patch removes the dependency to avoid this problem
altogether.


was (Author: u39kun):
The problem went away temporarily, but another build issue is occurring due to the same gifsicle
module problem.
Since we are not really using it, the new patch removes the dependency to avoid this problem
altogether.

> Current trunk won't build
> -------------------------
>
>                 Key: AMBARI-7120
>                 URL: https://issues.apache.org/jira/browse/AMBARI-7120
>             Project: Ambari
>          Issue Type: Bug
>          Components: ambari-admin
>    Affects Versions: 1.7.0
>            Reporter: Erin A Boyd
>            Assignee: Yusaku Sako
>            Priority: Blocker
>             Fix For: 1.7.0
>
>         Attachments: AMBARI-7120.patch
>
>
> 20:14:40] gulp-size: total 16.55 kB
> [20:14:40] Finished 'styles' after 413 ms
> [20:14:40] Finished 'views' after 221 ms
> [INFO] ------------------------------------------------------------------------
> [INFO] Reactor Summary:
> [INFO] 
> [INFO] Ambari Main ....................................... SUCCESS [6.546s]
> [INFO] Apache Ambari Project POM ......................... SUCCESS [1.470s]
> [INFO] Ambari Web ........................................ SUCCESS [1:32.755s]
> [INFO] Ambari Views ...................................... SUCCESS [13.268s]
> [INFO] Ambari Admin View ................................. FAILURE [1:49.415s]
> [INFO] Ambari Server ..................................... SKIPPED
> [INFO] Ambari Agent ...................................... SKIPPED
> [INFO] Ambari Client ..................................... SKIPPED
> [INFO] Ambari Python Client .............................. SKIPPED
> [INFO] Ambari Groovy Client .............................. SKIPPED
> [INFO] Ambari Shell ...................................... SKIPPED
> [INFO] Ambari Python Shell ............................... SKIPPED
> [INFO] Ambari Groovy Shell ............................... SKIPPED
> [INFO] ------------------------------------------------------------------------
> [INFO] BUILD FAILURE
> [INFO] ------------------------------------------------------------------------
> [INFO] Total time: 3:45.124s
> [INFO] Finished at: Mon Sep 01 20:14:40 EDT 2014
> [INFO] Final Memory: 24M/57M
> [INFO] ------------------------------------------------------------------------
> [ERROR] Failed to execute goal org.codehaus.mojo:exec-maven-plugin:1.3.2:exec (Gulp build)
on project ambari-admin: Command execution failed. Process exited with an error: 1 (Exit value:
1) -> [Help 1]
> org.apache.maven.lifecycle.LifecycleExecutionException: Failed to execute goal org.codehaus.mojo:exec-maven-plugin:1.3.2:exec
(Gulp build) on project ambari-admin: Command execution failed.
> Hide full text



--
This message was sent by Atlassian JIRA
(v6.3.4#6332)

Mime
View raw message