ambari-dev mailing list archives

Site index · List index
Message view « Date » · « Thread »
Top « Date » · « Thread »
From "Tom Beerbower (JIRA)" <j...@apache.org>
Subject [jira] [Created] (AMBARI-5741) Build is broken with views build not working.
Date Mon, 12 May 2014 19:15:19 GMT
Tom Beerbower created AMBARI-5741:
-------------------------------------

             Summary: Build is broken with views build not working.
                 Key: AMBARI-5741
                 URL: https://issues.apache.org/jira/browse/AMBARI-5741
             Project: Ambari
          Issue Type: Task
            Reporter: Tom Beerbower
            Assignee: Tom Beerbower
             Fix For: 1.6.0


[INFO] ------------------------------------------------------------------------
[INFO] Reactor Summary:
[INFO] 
[INFO] Ambari Main ....................................... SUCCESS [39.867s]
[INFO] Apache Ambari Project POM ......................... SUCCESS [0.333s]
[INFO] Ambari Web ........................................ SUCCESS [48.549s]
[INFO] Ambari Views ...................................... SUCCESS [18.688s]
[INFO] Ambari Contrib Views .............................. FAILURE [6.170s]
[INFO] Files ............................................. SKIPPED
[INFO] Pig ............................................... SKIPPED
[INFO] Ambari Server ..................................... SKIPPED
[INFO] Ambari Agent ...................................... SKIPPED
[INFO] Ambari Client ..................................... SKIPPED
[INFO] ------------------------------------------------------------------------
[INFO] BUILD FAILURE
[INFO] ------------------------------------------------------------------------
[INFO] Total time: 1:54.323s
[INFO] Finished at: Mon May 12 11:13:26 PDT 2014
[INFO] Final Memory: 20M/382M
[INFO] ------------------------------------------------------------------------
[ERROR] Failed to execute goal org.codehaus.mojo:rpm-maven-plugin:2.1-alpha-4:rpm (default-cli)
on project ambari-contrib-views: The parameters 'sourceEncoding', 'group' for goal org.codehaus.mojo:rpm-maven-plugin:2.1-alpha-4:rpm
are missing or invalid -> [Help 1]
org.apache.maven.lifecycle.LifecycleExecutionException: Failed to execute goal org.codehaus.mojo:rpm-maven-plugin:2.1-alpha-4:rpm
(default-cli) on project ambari-contrib-views: The parameters 'sourceEncoding', 'group' for
goal org.codehaus.mojo:rpm-maven-plugin:2.1-alpha-4:rpm are missing or invalid
	at org.apache.maven.lifecycle.internal.MojoExecutor.execute(MojoExecutor.java:221)
	at org.apache.maven.lifecycle.internal.MojoExecutor.execute(MojoExecutor.java:153)
	at org.apache.maven.lifecycle.internal.MojoExecutor.execute(MojoExecutor.java:145)
	at org.apache.maven.lifecycle.internal.LifecycleModuleBuilder.buildProject(LifecycleModuleBuilder.java:84)
	at org.apache.maven.lifecycle.internal.LifecycleModuleBuilder.buildProject(LifecycleModuleBuilder.java:59)
	at org.apache.maven.lifecycle.internal.LifecycleStarter.singleThreadedBuild(LifecycleStarter.java:183)
	at org.apache.maven.lifecycle.internal.LifecycleStarter.execute(LifecycleStarter.java:161)
	at org.apache.maven.DefaultMaven.doExecute(DefaultMaven.java:319)
	at org.apache.maven.DefaultMaven.execute(DefaultMaven.java:156)
	at org.apache.maven.cli.MavenCli.execute(MavenCli.java:537)
	at org.apache.maven.cli.MavenCli.doMain(MavenCli.java:196)
	at org.apache.maven.cli.MavenCli.main(MavenCli.java:141)
	at sun.reflect.NativeMethodAccessorImpl.invoke0(Native Method)
	at sun.reflect.NativeMethodAccessorImpl.invoke(NativeMethodAccessorImpl.java:39)
	at sun.reflect.DelegatingMethodAccessorImpl.invoke(DelegatingMethodAccessorImpl.java:25)
	at java.lang.reflect.Method.invoke(Method.java:597)
	at org.codehaus.plexus.classworlds.launcher.Launcher.launchEnhanced(Launcher.java:290)
	at org.codehaus.plexus.classworlds.launcher.Launcher.launch(Launcher.java:230)
	at org.codehaus.plexus.classworlds.launcher.Launcher.mainWithExitCode(Launcher.java:409)
	at org.codehaus.plexus.classworlds.launcher.Launcher.main(Launcher.java:352)
Caused by: org.apache.maven.plugin.PluginParameterException: The parameters 'sourceEncoding',
'group' for goal org.codehaus.mojo:rpm-maven-plugin:2.1-alpha-4:rpm are missing or invalid
	at org.apache.maven.plugin.internal.DefaultMavenPluginManager.populatePluginFields(DefaultMavenPluginManager.java:576)
	at org.apache.maven.plugin.internal.DefaultMavenPluginManager.getConfiguredMojo(DefaultMavenPluginManager.java:529)
	at org.apache.maven.plugin.DefaultBuildPluginManager.executeMojo(DefaultBuildPluginManager.java:92)
	at org.apache.maven.lifecycle.internal.MojoExecutor.execute(MojoExecutor.java:209)
	... 19 more
[ERROR] 



--
This message was sent by Atlassian JIRA
(v6.2#6252)

Mime
View raw message