ambari-dev mailing list archives

Site index · List index
Message view « Date » · « Thread »
Top « Date » · « Thread »
From "Andrew Onischuk (JIRA)" <j...@apache.org>
Subject [jira] [Created] (AMBARI-5448) HDFS test_service_check.TestServiceCheck failed
Date Fri, 11 Apr 2014 18:06:16 GMT
Andrew Onischuk created AMBARI-5448:
---------------------------------------

             Summary: HDFS test_service_check.TestServiceCheck failed
                 Key: AMBARI-5448
                 URL: https://issues.apache.org/jira/browse/AMBARI-5448
             Project: Ambari
          Issue Type: Bug
            Reporter: Andrew Onischuk
            Assignee: Andrew Onischuk
             Fix For: 1.6.0


Unit test failed

    
    
    Failed tests:
    FAIL: test_service_check_default (test_service_check.TestServiceCheck)
    ----------------------------------------------------------------------
    Traceback (most recent call last):
      File "/grid/0/workspace/AMBARI-1.6.0-UT-Dev/label/centos6-UT-8/hdp-BUILDS/ambari/ambari-common/src/test/python/mock/mock.py",
line 1199, in patched
        return func(*args, **keywargs)
      File "/grid/0/workspace/AMBARI-1.6.0-UT-Dev/label/centos6-UT-8/hdp-BUILDS/ambari/ambari-server/src/test/python/stacks/1.3.2/HDFS/test_service_check.py",
line 34, in test_service_check_default
        self.assert_service_check()
      File "/grid/0/workspace/AMBARI-1.6.0-UT-Dev/label/centos6-UT-8/hdp-BUILDS/ambari/ambari-server/src/test/python/stacks/1.3.2/HDFS/test_service_check.py",
line 61, in assert_service_check
        user = 'ambari-qa',
      File "/grid/0/workspace/AMBARI-1.6.0-UT-Dev/label/centos6-UT-8/hdp-BUILDS/ambari/ambari-server/src/test/python/stacks/utils/RMFTestCase.py",
line 166, in assertResourceCalled
        self.assertEquals(name, resource.name)
    AssertionError: 'fs -mkdir /tmp ; hadoop fs -chmod -R 777 /tmp' != 'fs -mkdir /tmp ; hadoop
fs -chmod 777 /tmp'
    
    FAIL: test_service_check_secured (test_service_check.TestServiceCheck)
    ----------------------------------------------------------------------
    Traceback (most recent call last):
      File "/grid/0/workspace/AMBARI-1.6.0-UT-Dev/label/centos6-UT-8/hdp-BUILDS/ambari/ambari-common/src/test/python/mock/mock.py",
line 1199, in patched
        return func(*args, **keywargs)
      File "/grid/0/workspace/AMBARI-1.6.0-UT-Dev/label/centos6-UT-8/hdp-BUILDS/ambari/ambari-server/src/test/python/stacks/1.3.2/HDFS/test_service_check.py",
line 44, in test_service_check_secured
        self.assert_service_check()
      File "/grid/0/workspace/AMBARI-1.6.0-UT-Dev/label/centos6-UT-8/hdp-BUILDS/ambari/ambari-server/src/test/python/stacks/1.3.2/HDFS/test_service_check.py",
line 61, in assert_service_check
        user = 'ambari-qa',
      File "/grid/0/workspace/AMBARI-1.6.0-UT-Dev/label/centos6-UT-8/hdp-BUILDS/ambari/ambari-server/src/test/python/stacks/utils/RMFTestCase.py",
line 166, in assertResourceCalled
        self.assertEquals(name, resource.name)
    AssertionError: 'fs -mkdir /tmp ; hadoop fs -chmod -R 777 /tmp' != 'fs -mkdir /tmp ; hadoop
fs -chmod 777 /tmp'
    
    FAIL: test_service_check_default (test_service_check.TestServiceCheck)
    ----------------------------------------------------------------------
    Traceback (most recent call last):
      File "/grid/0/workspace/AMBARI-1.6.0-UT-Dev/label/centos6-UT-8/hdp-BUILDS/ambari/ambari-common/src/test/python/mock/mock.py",
line 1199, in patched
        return func(*args, **keywargs)
      File "/grid/0/workspace/AMBARI-1.6.0-UT-Dev/label/centos6-UT-8/hdp-BUILDS/ambari/ambari-server/src/test/python/stacks/2.0.6/HDFS/test_service_check.py",
line 34, in test_service_check_default
        self.assert_service_check()
      File "/grid/0/workspace/AMBARI-1.6.0-UT-Dev/label/centos6-UT-8/hdp-BUILDS/ambari/ambari-server/src/test/python/stacks/2.0.6/HDFS/test_service_check.py",
line 61, in assert_service_check
        user = 'ambari-qa',
      File "/grid/0/workspace/AMBARI-1.6.0-UT-Dev/label/centos6-UT-8/hdp-BUILDS/ambari/ambari-server/src/test/python/stacks/utils/RMFTestCase.py",
line 166, in assertResourceCalled
        self.assertEquals(name, resource.name)
    AssertionError: 'fs -mkdir /tmp ; hadoop fs -chmod -R 777 /tmp' != 'fs -mkdir /tmp ; hadoop
fs -chmod 777 /tmp'
    
    FAIL: test_service_check_secured (test_service_check.TestServiceCheck)
    ----------------------------------------------------------------------
    Traceback (most recent call last):
      File "/grid/0/workspace/AMBARI-1.6.0-UT-Dev/label/centos6-UT-8/hdp-BUILDS/ambari/ambari-common/src/test/python/mock/mock.py",
line 1199, in patched
        return func(*args, **keywargs)
      File "/grid/0/workspace/AMBARI-1.6.0-UT-Dev/label/centos6-UT-8/hdp-BUILDS/ambari/ambari-server/src/test/python/stacks/2.0.6/HDFS/test_service_check.py",
line 44, in test_service_check_secured
        self.assert_service_check()
      File "/grid/0/workspace/AMBARI-1.6.0-UT-Dev/label/centos6-UT-8/hdp-BUILDS/ambari/ambari-server/src/test/python/stacks/2.0.6/HDFS/test_service_check.py",
line 61, in assert_service_check
        user = 'ambari-qa',
      File "/grid/0/workspace/AMBARI-1.6.0-UT-Dev/label/centos6-UT-8/hdp-BUILDS/ambari/ambari-server/src/test/python/stacks/utils/RMFTestCase.py",
line 166, in assertResourceCalled
        self.assertEquals(name, resource.name)
    AssertionError: 'fs -mkdir /tmp ; hadoop fs -chmod -R 777 /tmp' != 'fs -mkdir /tmp ; hadoop
fs -chmod 777 /tmp'
    





--
This message was sent by Atlassian JIRA
(v6.2#6252)

Mime
View raw message