ambari-dev mailing list archives

Site index · List index
Message view « Date » · « Thread »
Top « Date » · « Thread »
From "Andrew Onischuk (JIRA)" <j...@apache.org>
Subject [jira] [Updated] (AMBARI-4502) unit test failure in ambari-agent resource unit tests
Date Mon, 03 Feb 2014 12:34:09 GMT

     [ https://issues.apache.org/jira/browse/AMBARI-4502?page=com.atlassian.jira.plugin.system.issuetabpanels:all-tabpanel
]

Andrew Onischuk updated AMBARI-4502:
------------------------------------

    Attachment: AMBARI-4502.patch

> unit test failure in ambari-agent resource unit tests
> -----------------------------------------------------
>
>                 Key: AMBARI-4502
>                 URL: https://issues.apache.org/jira/browse/AMBARI-4502
>             Project: Ambari
>          Issue Type: Bug
>            Reporter: Andrew Onischuk
>            Assignee: Andrew Onischuk
>             Fix For: 1.5.0
>
>         Attachments: AMBARI-4502.patch
>
>
> {noformat}
> OK
> ----------------------------------------------------------------------
> Failed tests:
> ERROR: test_configure_default (test_hbase_client.TestHBaseClient)
> ----------------------------------------------------------------------
> Traceback (most recent call last):
>   File "/Users/smohanty/enlistments/asf-ambari/ambari-server/src/test/python/stacks/1.3.2/HBASE/test_hbase_client.py",
line 119, in test_configure_default
>     mode = 420,
>   File "/Users/smohanty/enlistments/asf-ambari/ambari-server/src/test/python/stacks/utils/RMFTestCase.py",
line 120, in assertResourceCalled
>     resource = RMFTestCase.env.resource_list.pop(0)
> IndexError: pop from empty list
> ERROR: test_configure_secured (test_hbase_client.TestHBaseClient)
> ----------------------------------------------------------------------
> Traceback (most recent call last):
>   File "/Users/smohanty/enlistments/asf-ambari/ambari-server/src/test/python/stacks/1.3.2/HBASE/test_hbase_client.py",
line 72, in test_configure_secured
>     mode = 420,
>   File "/Users/smohanty/enlistments/asf-ambari/ambari-server/src/test/python/stacks/utils/RMFTestCase.py",
line 120, in assertResourceCalled
>     resource = RMFTestCase.env.resource_list.pop(0)
> IndexError: pop from empty list
> ERROR: test_configure_default (test_hbase_regionserver.TestHbaseRegionServer)
> ----------------------------------------------------------------------
> Traceback (most recent call last):
>   File "/Users/smohanty/enlistments/asf-ambari/ambari-server/src/test/python/stacks/1.3.2/HBASE/test_hbase_regionserver.py",
line 32, in test_configure_default
>     self.assert_configure_default()
>   File "/Users/smohanty/enlistments/asf-ambari/ambari-server/src/test/python/stacks/1.3.2/HBASE/test_hbase_regionserver.py",
line 148, in assert_configure_default
>     mode = 420,
>   File "/Users/smohanty/enlistments/asf-ambari/ambari-server/src/test/python/stacks/utils/RMFTestCase.py",
line 120, in assertResourceCalled
>     resource = RMFTestCase.env.resource_list.pop(0)
> IndexError: pop from empty list
> ERROR: test_configure_secured (test_hbase_regionserver.TestHbaseRegionServer)
> ----------------------------------------------------------------------
> Traceback (most recent call last):
>   File "/Users/smohanty/enlistments/asf-ambari/ambari-server/src/test/python/stacks/1.3.2/HBASE/test_hbase_regionserver.py",
line 69, in test_configure_secured
>     self.assert_configure_secured()
>   File "/Users/smohanty/enlistments/asf-ambari/ambari-server/src/test/python/stacks/1.3.2/HBASE/test_hbase_regionserver.py",
line 205, in assert_configure_secured
>     mode = 420,
>   File "/Users/smohanty/enlistments/asf-ambari/ambari-server/src/test/python/stacks/utils/RMFTestCase.py",
line 120, in assertResourceCalled
>     resource = RMFTestCase.env.resource_list.pop(0)
> IndexError: pop from empty list
> ERROR: test_configure_default (test_hbase_master.TestHBaseMaster)
> ----------------------------------------------------------------------
> Traceback (most recent call last):
>   File "/Users/smohanty/enlistments/asf-ambari/ambari-server/src/test/python/stacks/1.3.2/HBASE/test_hbase_master.py",
line 31, in test_configure_default
>     self.assert_configure_default()
>   File "/Users/smohanty/enlistments/asf-ambari/ambari-server/src/test/python/stacks/1.3.2/HBASE/test_hbase_master.py",
line 177, in assert_configure_default
>     mode = 420,
>   File "/Users/smohanty/enlistments/asf-ambari/ambari-server/src/test/python/stacks/utils/RMFTestCase.py",
line 120, in assertResourceCalled
>     resource = RMFTestCase.env.resource_list.pop(0)
> IndexError: pop from empty list
> ERROR: test_configure_secured (test_hbase_master.TestHBaseMaster)
> ----------------------------------------------------------------------
> Traceback (most recent call last):
>   File "/Users/smohanty/enlistments/asf-ambari/ambari-server/src/test/python/stacks/1.3.2/HBASE/test_hbase_master.py",
line 85, in test_configure_secured
>     self.assert_configure_secured()
>   File "/Users/smohanty/enlistments/asf-ambari/ambari-server/src/test/python/stacks/1.3.2/HBASE/test_hbase_master.py",
line 233, in assert_configure_secured
>     mode = 420,
>   File "/Users/smohanty/enlistments/asf-ambari/ambari-server/src/test/python/stacks/utils/RMFTestCase.py",
line 120, in assertResourceCalled
>     resource = RMFTestCase.env.resource_list.pop(0)
> IndexError: pop from empty list
> ERROR: test_configure_default (test_hbase_client.TestHBaseClient)
> ----------------------------------------------------------------------
> Traceback (most recent call last):
>   File "/Users/smohanty/enlistments/asf-ambari/ambari-server/src/test/python/stacks/2.0.6/HBASE/test_hbase_client.py",
line 119, in test_configure_default
>     mode = 420,
>   File "/Users/smohanty/enlistments/asf-ambari/ambari-server/src/test/python/stacks/utils/RMFTestCase.py",
line 120, in assertResourceCalled
>     resource = RMFTestCase.env.resource_list.pop(0)
> IndexError: pop from empty list
> ERROR: test_configure_secured (test_hbase_client.TestHBaseClient)
> ----------------------------------------------------------------------
> Traceback (most recent call last):
>   File "/Users/smohanty/enlistments/asf-ambari/ambari-server/src/test/python/stacks/2.0.6/HBASE/test_hbase_client.py",
line 72, in test_configure_secured
>     mode = 420,
>   File "/Users/smohanty/enlistments/asf-ambari/ambari-server/src/test/python/stacks/utils/RMFTestCase.py",
line 120, in assertResourceCalled
>     resource = RMFTestCase.env.resource_list.pop(0)
> IndexError: pop from empty list
> ERROR: test_configure_default (test_hbase_master.TestHBaseMaster)
> ----------------------------------------------------------------------
> Traceback (most recent call last):
>   File "/Users/smohanty/enlistments/asf-ambari/ambari-server/src/test/python/stacks/2.0.6/HBASE/test_hbase_master.py",
line 31, in test_configure_default
>     self.assert_configure_default()
>   File "/Users/smohanty/enlistments/asf-ambari/ambari-server/src/test/python/stacks/2.0.6/HBASE/test_hbase_master.py",
line 177, in assert_configure_default
>     mode = 420,
>   File "/Users/smohanty/enlistments/asf-ambari/ambari-server/src/test/python/stacks/utils/RMFTestCase.py",
line 120, in assertResourceCalled
>     resource = RMFTestCase.env.resource_list.pop(0)
> IndexError: pop from empty list
> ERROR: test_configure_secured (test_hbase_master.TestHBaseMaster)
> ----------------------------------------------------------------------
> Traceback (most recent call last):
>   File "/Users/smohanty/enlistments/asf-ambari/ambari-server/src/test/python/stacks/2.0.6/HBASE/test_hbase_master.py",
line 85, in test_configure_secured
>     self.assert_configure_secured()
>   File "/Users/smohanty/enlistments/asf-ambari/ambari-server/src/test/python/stacks/2.0.6/HBASE/test_hbase_master.py",
line 233, in assert_configure_secured
>     mode = 420,
>   File "/Users/smohanty/enlistments/asf-ambari/ambari-server/src/test/python/stacks/utils/RMFTestCase.py",
line 120, in assertResourceCalled
>     resource = RMFTestCase.env.resource_list.pop(0)
> IndexError: pop from empty list
> ERROR: test_configure_default (test_hbase_regionserver.TestHbaseRegionServer)
> ----------------------------------------------------------------------
> Traceback (most recent call last):
>   File "/Users/smohanty/enlistments/asf-ambari/ambari-server/src/test/python/stacks/2.0.6/HBASE/test_hbase_regionserver.py",
line 31, in test_configure_default
>     self.assert_configure_default()
>   File "/Users/smohanty/enlistments/asf-ambari/ambari-server/src/test/python/stacks/2.0.6/HBASE/test_hbase_regionserver.py",
line 147, in assert_configure_default
>     mode = 420,
>   File "/Users/smohanty/enlistments/asf-ambari/ambari-server/src/test/python/stacks/utils/RMFTestCase.py",
line 120, in assertResourceCalled
>     resource = RMFTestCase.env.resource_list.pop(0)
> IndexError: pop from empty list
> ERROR: test_configure_secured (test_hbase_regionserver.TestHbaseRegionServer)
> ----------------------------------------------------------------------
> Traceback (most recent call last):
>   File "/Users/smohanty/enlistments/asf-ambari/ambari-server/src/test/python/stacks/2.0.6/HBASE/test_hbase_regionserver.py",
line 68, in test_configure_secured
>     self.assert_configure_secured()
>   File "/Users/smohanty/enlistments/asf-ambari/ambari-server/src/test/python/stacks/2.0.6/HBASE/test_hbase_regionserver.py",
line 203, in assert_configure_secured
>     mode = 420,
>   File "/Users/smohanty/enlistments/asf-ambari/ambari-server/src/test/python/stacks/utils/RMFTestCase.py",
line 120, in assertResourceCalled
>     resource = RMFTestCase.env.resource_list.pop(0)
> IndexError: pop from empty list
> FAIL: test_start_default (test_hbase_regionserver.TestHbaseRegionServer)
> ----------------------------------------------------------------------
> Traceback (most recent call last):
>   File "/Users/smohanty/enlistments/asf-ambari/ambari-server/src/test/python/stacks/1.3.2/HBASE/test_hbase_regionserver.py",
line 42, in test_start_default
>     self.assert_configure_default()
>   File "/Users/smohanty/enlistments/asf-ambari/ambari-server/src/test/python/stacks/1.3.2/HBASE/test_hbase_regionserver.py",
line 148, in assert_configure_default
>     mode = 420,
>   File "/Users/smohanty/enlistments/asf-ambari/ambari-server/src/test/python/stacks/utils/RMFTestCase.py",
line 121, in assertResourceCalled
>     self.assertEquals(resource_type, resource.__class__.__name__)
> AssertionError: 'File' != 'Execute'
> FAIL: test_start_secured (test_hbase_regionserver.TestHbaseRegionServer)
> ----------------------------------------------------------------------
> Traceback (most recent call last):
>   File "/Users/smohanty/enlistments/asf-ambari/ambari-server/src/test/python/stacks/1.3.2/HBASE/test_hbase_regionserver.py",
line 79, in test_start_secured
>     self.assert_configure_secured()
>   File "/Users/smohanty/enlistments/asf-ambari/ambari-server/src/test/python/stacks/1.3.2/HBASE/test_hbase_regionserver.py",
line 205, in assert_configure_secured
>     mode = 420,
>   File "/Users/smohanty/enlistments/asf-ambari/ambari-server/src/test/python/stacks/utils/RMFTestCase.py",
line 121, in assertResourceCalled
>     self.assertEquals(resource_type, resource.__class__.__name__)
> AssertionError: 'File' != 'Execute'
> FAIL: test_start_default (test_hbase_master.TestHBaseMaster)
> ----------------------------------------------------------------------
> Traceback (most recent call last):
>   File "/Users/smohanty/enlistments/asf-ambari/ambari-server/src/test/python/stacks/1.3.2/HBASE/test_hbase_master.py",
line 41, in test_start_default
>     self.assert_configure_default()
>   File "/Users/smohanty/enlistments/asf-ambari/ambari-server/src/test/python/stacks/1.3.2/HBASE/test_hbase_master.py",
line 177, in assert_configure_default
>     mode = 420,
>   File "/Users/smohanty/enlistments/asf-ambari/ambari-server/src/test/python/stacks/utils/RMFTestCase.py",
line 121, in assertResourceCalled
>     self.assertEquals(resource_type, resource.__class__.__name__)
> AssertionError: 'File' != 'Execute'
> FAIL: test_start_secured (test_hbase_master.TestHBaseMaster)
> ----------------------------------------------------------------------
> Traceback (most recent call last):
>   File "/Users/smohanty/enlistments/asf-ambari/ambari-server/src/test/python/stacks/1.3.2/HBASE/test_hbase_master.py",
line 95, in test_start_secured
>     self.assert_configure_secured()
>   File "/Users/smohanty/enlistments/asf-ambari/ambari-server/src/test/python/stacks/1.3.2/HBASE/test_hbase_master.py",
line 233, in assert_configure_secured
>     mode = 420,
>   File "/Users/smohanty/enlistments/asf-ambari/ambari-server/src/test/python/stacks/utils/RMFTestCase.py",
line 121, in assertResourceCalled
>     self.assertEquals(resource_type, resource.__class__.__name__)
> AssertionError: 'File' != 'Execute'
> FAIL: test_hook_default (test_before_start.TestHookBeforeStart)
> ----------------------------------------------------------------------
> Traceback (most recent call last):
>   File "/Users/smohanty/enlistments/asf-ambari/ambari-server/src/test/python/stacks/1.3.2/hooks/before-START/test_before_start.py",
line 100, in test_hook_default
>     mode = 420,
>   File "/Users/smohanty/enlistments/asf-ambari/ambari-server/src/test/python/stacks/utils/RMFTestCase.py",
line 121, in assertResourceCalled
>     self.assertEquals(resource_type, resource.__class__.__name__)
> AssertionError: 'File' != 'Execute'
> FAIL: test_configure_default (test_zookeeper_client.TestZookeeperClient)
> ----------------------------------------------------------------------
> Traceback (most recent call last):
>   File "/Users/smohanty/enlistments/asf-ambari/ambari-server/src/test/python/stacks/1.3.2/ZOOKEEPER/test_zookeeper_client.py",
line 69, in test_configure_default
>     mode = 420,
>   File "/Users/smohanty/enlistments/asf-ambari/ambari-server/src/test/python/stacks/utils/RMFTestCase.py",
line 122, in assertResourceCalled
>     self.assertEquals(name, resource.name)
> AssertionError: '/etc/zookeeper/conf/log4j.properties' != '/etc/zookeeper/conf/zoo_sample.cfg'
> FAIL: test_configure_secured (test_zookeeper_client.TestZookeeperClient)
> ----------------------------------------------------------------------
> Traceback (most recent call last):
>   File "/Users/smohanty/enlistments/asf-ambari/ambari-server/src/test/python/stacks/1.3.2/ZOOKEEPER/test_zookeeper_client.py",
line 123, in test_configure_secured
>     mode = 420,
>   File "/Users/smohanty/enlistments/asf-ambari/ambari-server/src/test/python/stacks/utils/RMFTestCase.py",
line 122, in assertResourceCalled
>     self.assertEquals(name, resource.name)
> AssertionError: '/etc/zookeeper/conf/log4j.properties' != '/etc/zookeeper/conf/zookeeper_client_jaas.conf'
> FAIL: test_configure_default (test_zookeeper_server.TestZookeeperServer)
> ----------------------------------------------------------------------
> Traceback (most recent call last):
>   File "/Users/smohanty/enlistments/asf-ambari/ambari-server/src/test/python/stacks/1.3.2/ZOOKEEPER/test_zookeeper_server.py",
line 32, in test_configure_default
>     self.assert_configure_default()
>   File "/Users/smohanty/enlistments/asf-ambari/ambari-server/src/test/python/stacks/1.3.2/ZOOKEEPER/test_zookeeper_server.py",
line 144, in assert_configure_default
>     mode = 420,
>   File "/Users/smohanty/enlistments/asf-ambari/ambari-server/src/test/python/stacks/utils/RMFTestCase.py",
line 122, in assertResourceCalled
>     self.assertEquals(name, resource.name)
> AssertionError: '/etc/zookeeper/conf/log4j.properties' != '/etc/zookeeper/conf/zoo_sample.cfg'
> FAIL: test_configure_secured (test_zookeeper_server.TestZookeeperServer)
> ----------------------------------------------------------------------
> Traceback (most recent call last):
>   File "/Users/smohanty/enlistments/asf-ambari/ambari-server/src/test/python/stacks/1.3.2/ZOOKEEPER/test_zookeeper_server.py",
line 69, in test_configure_secured
>     self.assert_configure_secured()
>   File "/Users/smohanty/enlistments/asf-ambari/ambari-server/src/test/python/stacks/1.3.2/ZOOKEEPER/test_zookeeper_server.py",
line 195, in assert_configure_secured
>     mode = 420,
>   File "/Users/smohanty/enlistments/asf-ambari/ambari-server/src/test/python/stacks/utils/RMFTestCase.py",
line 122, in assertResourceCalled
>     self.assertEquals(name, resource.name)
> AssertionError: '/etc/zookeeper/conf/log4j.properties' != '/etc/zookeeper/conf/zookeeper_jaas.conf'
> FAIL: test_start_default (test_zookeeper_server.TestZookeeperServer)
> ----------------------------------------------------------------------
> Traceback (most recent call last):
>   File "/Users/smohanty/enlistments/asf-ambari/ambari-server/src/test/python/stacks/1.3.2/ZOOKEEPER/test_zookeeper_server.py",
line 42, in test_start_default
>     self.assert_configure_default()
>   File "/Users/smohanty/enlistments/asf-ambari/ambari-server/src/test/python/stacks/1.3.2/ZOOKEEPER/test_zookeeper_server.py",
line 144, in assert_configure_default
>     mode = 420,
>   File "/Users/smohanty/enlistments/asf-ambari/ambari-server/src/test/python/stacks/utils/RMFTestCase.py",
line 122, in assertResourceCalled
>     self.assertEquals(name, resource.name)
> AssertionError: '/etc/zookeeper/conf/log4j.properties' != '/etc/zookeeper/conf/zoo_sample.cfg'
> FAIL: test_start_secured (test_zookeeper_server.TestZookeeperServer)
> ----------------------------------------------------------------------
> Traceback (most recent call last):
>   File "/Users/smohanty/enlistments/asf-ambari/ambari-server/src/test/python/stacks/1.3.2/ZOOKEEPER/test_zookeeper_server.py",
line 79, in test_start_secured
>     self.assert_configure_secured()
>   File "/Users/smohanty/enlistments/asf-ambari/ambari-server/src/test/python/stacks/1.3.2/ZOOKEEPER/test_zookeeper_server.py",
line 195, in assert_configure_secured
>     mode = 420,
>   File "/Users/smohanty/enlistments/asf-ambari/ambari-server/src/test/python/stacks/utils/RMFTestCase.py",
line 122, in assertResourceCalled
>     self.assertEquals(name, resource.name)
> AssertionError: '/etc/zookeeper/conf/log4j.properties' != '/etc/zookeeper/conf/zookeeper_jaas.conf'
> FAIL: test_start_default (test_hbase_master.TestHBaseMaster)
> ----------------------------------------------------------------------
> Traceback (most recent call last):
>   File "/Users/smohanty/enlistments/asf-ambari/ambari-server/src/test/python/stacks/2.0.6/HBASE/test_hbase_master.py",
line 41, in test_start_default
>     self.assert_configure_default()
>   File "/Users/smohanty/enlistments/asf-ambari/ambari-server/src/test/python/stacks/2.0.6/HBASE/test_hbase_master.py",
line 177, in assert_configure_default
>     mode = 420,
>   File "/Users/smohanty/enlistments/asf-ambari/ambari-server/src/test/python/stacks/utils/RMFTestCase.py",
line 121, in assertResourceCalled
>     self.assertEquals(resource_type, resource.__class__.__name__)
> AssertionError: 'File' != 'Execute'
> FAIL: test_start_secured (test_hbase_master.TestHBaseMaster)
> ----------------------------------------------------------------------
> Traceback (most recent call last):
>   File "/Users/smohanty/enlistments/asf-ambari/ambari-server/src/test/python/stacks/2.0.6/HBASE/test_hbase_master.py",
line 95, in test_start_secured
>     self.assert_configure_secured()
>   File "/Users/smohanty/enlistments/asf-ambari/ambari-server/src/test/python/stacks/2.0.6/HBASE/test_hbase_master.py",
line 233, in assert_configure_secured
>     mode = 420,
>   File "/Users/smohanty/enlistments/asf-ambari/ambari-server/src/test/python/stacks/utils/RMFTestCase.py",
line 121, in assertResourceCalled
>     self.assertEquals(resource_type, resource.__class__.__name__)
> AssertionError: 'File' != 'Execute'
> FAIL: test_start_default (test_hbase_regionserver.TestHbaseRegionServer)
> ----------------------------------------------------------------------
> Traceback (most recent call last):
>   File "/Users/smohanty/enlistments/asf-ambari/ambari-server/src/test/python/stacks/2.0.6/HBASE/test_hbase_regionserver.py",
line 41, in test_start_default
>     self.assert_configure_default()
>   File "/Users/smohanty/enlistments/asf-ambari/ambari-server/src/test/python/stacks/2.0.6/HBASE/test_hbase_regionserver.py",
line 147, in assert_configure_default
>     mode = 420,
>   File "/Users/smohanty/enlistments/asf-ambari/ambari-server/src/test/python/stacks/utils/RMFTestCase.py",
line 121, in assertResourceCalled
>     self.assertEquals(resource_type, resource.__class__.__name__)
> AssertionError: 'File' != 'Execute'
> FAIL: test_start_secured (test_hbase_regionserver.TestHbaseRegionServer)
> ----------------------------------------------------------------------
> Traceback (most recent call last):
>   File "/Users/smohanty/enlistments/asf-ambari/ambari-server/src/test/python/stacks/2.0.6/HBASE/test_hbase_regionserver.py",
line 78, in test_start_secured
>     self.assert_configure_secured()
>   File "/Users/smohanty/enlistments/asf-ambari/ambari-server/src/test/python/stacks/2.0.6/HBASE/test_hbase_regionserver.py",
line 203, in assert_configure_secured
>     mode = 420,
>   File "/Users/smohanty/enlistments/asf-ambari/ambari-server/src/test/python/stacks/utils/RMFTestCase.py",
line 121, in assertResourceCalled
>     self.assertEquals(resource_type, resource.__class__.__name__)
> AssertionError: 'File' != 'Execute'
> FAIL: test_configure_default (test_before_start.TestHookBeforeStart)
> ----------------------------------------------------------------------
> Traceback (most recent call last):
>   File "/Users/smohanty/enlistments/asf-ambari/ambari-server/src/test/python/stacks/2.0.6/hooks/before-START/test_before_start.py",
line 105, in test_configure_default
>     mode = 420,
>   File "/Users/smohanty/enlistments/asf-ambari/ambari-server/src/test/python/stacks/utils/RMFTestCase.py",
line 121, in assertResourceCalled
>     self.assertEquals(resource_type, resource.__class__.__name__)
> AssertionError: 'File' != 'Execute'
> FAIL: test_configure_default (test_zookeeper_server.TestZookeeperServer)
> ----------------------------------------------------------------------
> Traceback (most recent call last):
>   File "/Users/smohanty/enlistments/asf-ambari/ambari-server/src/test/python/stacks/2.0.6/ZOOKEEPER/test_zookeeper_server.py",
line 31, in test_configure_default
>     self.assert_configure_default()
>   File "/Users/smohanty/enlistments/asf-ambari/ambari-server/src/test/python/stacks/2.0.6/ZOOKEEPER/test_zookeeper_server.py",
line 141, in assert_configure_default
>     mode = 420,
>   File "/Users/smohanty/enlistments/asf-ambari/ambari-server/src/test/python/stacks/utils/RMFTestCase.py",
line 122, in assertResourceCalled
>     self.assertEquals(name, resource.name)
> AssertionError: '/etc/zookeeper/conf/log4j.properties' != '/etc/zookeeper/conf/zoo_sample.cfg'
> FAIL: test_configure_secured (test_zookeeper_server.TestZookeeperServer)
> ----------------------------------------------------------------------
> Traceback (most recent call last):
>   File "/Users/smohanty/enlistments/asf-ambari/ambari-server/src/test/python/stacks/2.0.6/ZOOKEEPER/test_zookeeper_server.py",
line 67, in test_configure_secured
>     self.assert_configure_secured()
>   File "/Users/smohanty/enlistments/asf-ambari/ambari-server/src/test/python/stacks/2.0.6/ZOOKEEPER/test_zookeeper_server.py",
line 191, in assert_configure_secured
>     mode = 420,
>   File "/Users/smohanty/enlistments/asf-ambari/ambari-server/src/test/python/stacks/utils/RMFTestCase.py",
line 122, in assertResourceCalled
>     self.assertEquals(name, resource.name)
> AssertionError: '/etc/zookeeper/conf/log4j.properties' != '/etc/zookeeper/conf/zookeeper_jaas.conf'
> FAIL: test_start_default (test_zookeeper_server.TestZookeeperServer)
> ----------------------------------------------------------------------
> Traceback (most recent call last):
>   File "/Users/smohanty/enlistments/asf-ambari/ambari-server/src/test/python/stacks/2.0.6/ZOOKEEPER/test_zookeeper_server.py",
line 41, in test_start_default
>     self.assert_configure_default()
>   File "/Users/smohanty/enlistments/asf-ambari/ambari-server/src/test/python/stacks/2.0.6/ZOOKEEPER/test_zookeeper_server.py",
line 141, in assert_configure_default
>     mode = 420,
>   File "/Users/smohanty/enlistments/asf-ambari/ambari-server/src/test/python/stacks/utils/RMFTestCase.py",
line 122, in assertResourceCalled
>     self.assertEquals(name, resource.name)
> AssertionError: '/etc/zookeeper/conf/log4j.properties' != '/etc/zookeeper/conf/zoo_sample.cfg'
> FAIL: test_start_secured (test_zookeeper_server.TestZookeeperServer)
> ----------------------------------------------------------------------
> Traceback (most recent call last):
>   File "/Users/smohanty/enlistments/asf-ambari/ambari-server/src/test/python/stacks/2.0.6/ZOOKEEPER/test_zookeeper_server.py",
line 77, in test_start_secured
>     self.assert_configure_secured()
>   File "/Users/smohanty/enlistments/asf-ambari/ambari-server/src/test/python/stacks/2.0.6/ZOOKEEPER/test_zookeeper_server.py",
line 191, in assert_configure_secured
>     mode = 420,
>   File "/Users/smohanty/enlistments/asf-ambari/ambari-server/src/test/python/stacks/utils/RMFTestCase.py",
line 122, in assertResourceCalled
>     self.assertEquals(name, resource.name)
> AssertionError: '/etc/zookeeper/conf/log4j.properties' != '/etc/zookeeper/conf/zookeeper_jaas.conf'
> FAIL: test_configure_default (test_zookeeper_client.TestZookeeperClient)
> ----------------------------------------------------------------------
> Traceback (most recent call last):
>   File "/Users/smohanty/enlistments/asf-ambari/ambari-server/src/test/python/stacks/2.0.6/ZOOKEEPER/test_zookeeper_client.py",
line 70, in test_configure_default
>     mode = 420,
>   File "/Users/smohanty/enlistments/asf-ambari/ambari-server/src/test/python/stacks/utils/RMFTestCase.py",
line 122, in assertResourceCalled
>     self.assertEquals(name, resource.name)
> AssertionError: '/etc/zookeeper/conf/log4j.properties' != '/etc/zookeeper/conf/zoo_sample.cfg'
> FAIL: test_configure_secured (test_zookeeper_client.TestZookeeperClient)
> ----------------------------------------------------------------------
> Traceback (most recent call last):
>   File "/Users/smohanty/enlistments/asf-ambari/ambari-server/src/test/python/stacks/2.0.6/ZOOKEEPER/test_zookeeper_client.py",
line 124, in test_configure_secured
>     mode = 420,
>   File "/Users/smohanty/enlistments/asf-ambari/ambari-server/src/test/python/stacks/utils/RMFTestCase.py",
line 122, in assertResourceCalled
>     self.assertEquals(name, resource.name)
> AssertionError: '/etc/zookeeper/conf/log4j.properties' != '/etc/zookeeper/conf/zookeeper_client_jaas.conf'
> ----------------------------------------------------------------------
> {noformat}



--
This message was sent by Atlassian JIRA
(v6.1.5#6160)

Mime
View raw message