allura-dev mailing list archives

Site index · List index
Message view « Date » · « Thread »
Top « Date » · « Thread »
From Apache Jenkins Server <jenk...@builds.apache.org>
Subject Build failed in Jenkins: Allura #1088
Date Thu, 25 Aug 2016 21:24:42 GMT
See <https://builds.apache.org/job/Allura/1088/>

------------------------------------------
[...truncated 1998 lines...]
├── broccoli-kitchen-sink-helpers@0.2.9 (mkdirp@0.5.1, glob@5.0.15)
├── connect@3.4.1 (utils-merge@1.0.0, parseurl@1.3.1, debug@2.2.0, finalhandler@0.4.1)
├── quick-temp@0.1.5 (mktemp@0.3.5, rimraf@2.2.8, underscore.string@2.3.3)
└── handlebars@4.0.5 (async@1.5.2, source-map@0.4.4, optimist@0.6.1, uglify-js@2.7.3)

broccoli-timepiece@0.3.0 node_modules/broccoli-timepiece
├── rimraf@2.2.8
├── chalk@0.5.1 (ansi-styles@1.1.0, escape-string-regexp@1.0.5, supports-color@0.2.0,
strip-ansi@0.3.0, has-ansi@0.1.0)
├── broccoli-kitchen-sink-helpers@0.2.9 (glob@5.0.15, mkdirp@0.5.1)
└── broccoli@0.13.6 (promise-map-series@0.2.3, broccoli-slow-trees@1.1.0, copy-dereference@1.0.0,
mime@1.3.4, commander@2.9.0, connect@3.4.1, rsvp@3.2.1, findup-sync@0.1.3, tiny-lr@0.1.7,
handlebars@2.0.0)

eslint@1.10.3 node_modules/eslint
├── escape-string-regexp@1.0.5
├── path-is-absolute@1.0.0
├── path-is-inside@1.0.1
├── object-assign@4.1.0
├── xml-escape@1.0.0
├── strip-json-comments@1.0.4
├── estraverse-fb@1.3.1
├── globals@8.18.0
├── estraverse@4.2.0
├── text-table@0.2.0
├── esutils@2.0.2
├── user-home@2.0.0 (os-homedir@1.0.1)
├── debug@2.2.0 (ms@0.7.1)
├── chalk@1.1.3 (supports-color@2.0.0, ansi-styles@2.2.1, strip-ansi@3.0.1,
has-ansi@2.0.0)
├── minimatch@3.0.3 (brace-expansion@1.1.6)
├── json-stable-stringify@1.0.1 (jsonify@0.0.0)
├── is-resolvable@1.0.0 (tryit@1.0.2)
├── glob@5.0.15 (inherits@2.0.1, once@1.3.3, inflight@1.0.5)
├── mkdirp@0.5.1 (minimist@0.0.8)
├── shelljs@0.5.3
├── lodash.merge@3.3.2 (lodash._arrayeach@3.0.0, lodash._arraycopy@3.0.0, lodash._getnative@3.9.1,
lodash.istypedarray@3.0.6, lodash.isarray@3.0.4, lodash.isarguments@3.1.0, lodash.keys@3.1.2,
lodash.keysin@3.0.8, lodash.toplainobject@3.0.0, lodash._createassigner@3.1.1, lodash.isplainobject@3.2.0)
├── lodash.omit@3.1.0 (lodash._arraymap@3.0.0, lodash._pickbyarray@3.0.2, lodash._bindcallback@3.0.1,
lodash.restparam@3.6.1, lodash._baseflatten@3.1.4, lodash._pickbycallback@3.0.0, lodash._basedifference@3.0.3,
lodash.keysin@3.0.8)
├── lodash.clonedeep@3.0.2 (lodash._bindcallback@3.0.1, lodash._baseclone@3.3.0)
├── espree@2.2.5
├── doctrine@0.7.2 (isarray@0.0.1, esutils@1.1.6)
├── optionator@0.6.0 (fast-levenshtein@1.0.7, type-check@0.3.2, deep-is@0.1.3,
levn@0.2.5, wordwrap@0.0.3, prelude-ls@1.1.2)
├── is-my-json-valid@2.13.1 (jsonpointer@2.0.0, generate-function@2.0.0, xtend@4.0.1,
generate-object-property@1.2.0)
├── concat-stream@1.5.1 (inherits@2.0.1, typedarray@0.0.6, readable-stream@2.0.6)
├── js-yaml@3.4.5 (esprima@2.7.3, argparse@1.0.7)
├── file-entry-cache@1.3.1 (flat-cache@1.2.1)
├── inquirer@0.11.4 (ansi-escapes@1.4.0, strip-ansi@3.0.1, ansi-regex@2.0.0,
figures@1.7.0, through@2.3.8, cli-width@1.1.1, run-async@0.1.0, string-width@1.0.2, cli-cursor@1.0.2,
readline2@1.0.1, rx-lite@3.1.2, lodash@3.10.1)
├── handlebars@4.0.5 (async@1.5.2, optimist@0.6.1, source-map@0.4.4, uglify-js@2.7.3)
└── escope@3.6.0 (esrecurse@4.1.0, es6-weak-map@2.0.1, es6-map@0.1.4)

babel-eslint@5.0.4 node_modules/babel-eslint
├── acorn-to-esprima@2.0.8
├── lodash.assign@3.2.0 (lodash._baseassign@3.2.0, lodash._createassigner@3.1.1,
lodash.keys@3.1.2)
├── lodash.pick@3.1.0 (lodash._pickbyarray@3.0.2, lodash._bindcallback@3.0.1,
lodash.restparam@3.6.1, lodash._baseflatten@3.1.4, lodash._pickbycallback@3.0.0)
├── babel-types@6.14.0 (to-fast-properties@1.0.2, esutils@2.0.2, lodash@4.15.0,
babel-runtime@6.11.6)
├── babel-traverse@6.14.0 (babel-messages@6.8.0, globals@8.18.0, debug@2.2.0,
invariant@2.2.1, babel-code-frame@6.11.0, lodash@4.15.0, babel-runtime@6.11.6)
└── babylon@6.9.1 (babel-runtime@6.11.6)
Not running tests for virtualenv-1.9.1, since it isn't set up
<DummyProcess(Thread-1, started daemon 139743516653312)> running `nosetests  --with-xunitmp
--cover-package=alluratest --processes=4 --process-timeout=360` in AlluraTest

<DummyProcess(Thread-2, started daemon 139743508260608)> running `nosetests allura/tests/
--with-xunitmp --cover-package=allura --processes=4 --process-timeout=360` in Allura

<DummyProcess(Thread-4, started daemon 139743491475200)> running `nosetests  --with-xunitmp
--cover-package=forgeactivity --processes=4 --process-timeout=360` in ForgeActivity

<DummyProcess(Thread-3, started daemon 139743499867904)> running `nosetests  --with-xunitmp
--cover-package=forgeblog --processes=4 --process-timeout=360` in ForgeBlog

...................
----------------------------------------------------------------------
Ran 19 tests in 8.444s

OK
finished `nosetests  --with-xunitmp --cover-package=forgeactivity --processes=4 --process-timeout=360`
in ForgeActivity
<DummyProcess(Thread-4, started daemon 139743491475200)> running `nosetests  --with-xunitmp
--cover-package=forgechat --processes=4 --process-timeout=360` in ForgeChat

..
----------------------------------------------------------------------
Ran 2 tests in 2.704s

OK
finished `nosetests  --with-xunitmp --cover-package=forgechat --processes=4 --process-timeout=360`
in ForgeChat
<DummyProcess(Thread-4, started daemon 139743491475200)> running `nosetests  --with-xunitmp
--cover-package=forgediscussion --processes=4 --process-timeout=360` in ForgeDiscussion

................................................SSS.
----------------------------------------------------------------------
Ran 52 tests in 18.141s

OK (SKIP=3)
finished `nosetests  --with-xunitmp --cover-package=forgeblog --processes=4 --process-timeout=360`
in ForgeBlog
<DummyProcess(Thread-3, started daemon 139743499867904)> running `nosetests  --with-xunitmp
--cover-package=forgegit ` in ForgeGit

....No config file found, using default configuration
.
----------------------------------------------------------------------
Ran 5 tests in 25.741s

OK
finished `nosetests  --with-xunitmp --cover-package=alluratest --processes=4 --process-timeout=360`
in AlluraTest
<DummyProcess(Thread-1, started daemon 139743516653312)> running `nosetests  --with-xunitmp
--cover-package=forgeimporters --processes=4 --process-timeout=360` in ForgeImporters

.................................................S.....................................................SSSS..SS..........S.
----------------------------------------------------------------------
Ran 123 tests in 24.194s

OK (SKIP=8)
finished `nosetests  --with-xunitmp --cover-package=forgeimporters --processes=4 --process-timeout=360`
in ForgeImporters
<DummyProcess(Thread-1, started daemon 139743516653312)> running `nosetests  --with-xunitmp
--cover-package=forgelink --processes=4 --process-timeout=360` in ForgeLink

.................
----------------------------------------------------------------------
Ran 17 tests in 6.767s

OK
finished `nosetests  --with-xunitmp --cover-package=forgelink --processes=4 --process-timeout=360`
in ForgeLink
<DummyProcess(Thread-1, started daemon 139743516653312)> running `nosetests  --with-xunitmp
--cover-package=forgesvn ` in ForgeSVN

..................................................................
----------------------------------------------------------------------
Ran 66 tests in 46.214s

OK
finished `nosetests  --with-xunitmp --cover-package=forgediscussion --processes=4 --process-timeout=360`
in ForgeDiscussion
<DummyProcess(Thread-4, started daemon 139743491475200)> running `nosetests  --with-xunitmp
--cover-package=forgeshorturl --processes=4 --process-timeout=360` in ForgeShortUrl

...........
----------------------------------------------------------------------
Ran 11 tests in 5.316s

OK
finished `nosetests  --with-xunitmp --cover-package=forgeshorturl --processes=4 --process-timeout=360`
in ForgeShortUrl
<DummyProcess(Thread-4, started daemon 139743491475200)> running `nosetests  --with-xunitmp
--cover-package=forgetracker --processes=4 --process-timeout=360` in ForgeTracker

.................................................................................................................................................................................................
----------------------------------------------------------------------
Ran 193 tests in 97.188s

OK
finished `nosetests  --with-xunitmp --cover-package=forgetracker --processes=4 --process-timeout=360`
in ForgeTracker
<DummyProcess(Thread-4, started daemon 139743491475200)> running `nosetests  --with-xunitmp
--cover-package=forgeuserstats --processes=4 --process-timeout=360` in ForgeUserStats

............
----------------------------------------------------------------------
Ran 12 tests in 9.865s

OK
finished `nosetests  --with-xunitmp --cover-package=forgeuserstats --processes=4 --process-timeout=360`
in ForgeUserStats
<DummyProcess(Thread-4, started daemon 139743491475200)> running `nosetests  --with-xunitmp
--cover-package=forgewiki --processes=4 --process-timeout=360` in ForgeWiki

............................................................................................................................................................................................................................................................................................S....................................................................................................................................................................................................................................................................SSSSSSSSSSS.................................................................................................................................................F........S.....................................................................F...............................................................................................................................................................................................................................................................................................
======================================================================
FAIL: allura.tests.test_helpers.test_render_any_markup_formatting
----------------------------------------------------------------------
Traceback (most recent call last):
  File "<https://builds.apache.org/job/Allura/ws/.allura-venv/local/lib/python2.7/site-packages/nose-1.3.7-py2.7.egg/nose/case.py",>
line 197, in runTest
    self.test(*self.arg)
  File "<https://builds.apache.org/job/Allura/ws/Allura/allura/tests/test_helpers.py",>
line 253, in test_render_any_markup_formatting
    '<div class="markdown_content"><h3 id="foo">foo</h3>\n'
AssertionError: Markup(u'<div class="markdown_content"><h3 id="foo">foo</h3>\n<div
class="codehilite"><pre><span></span><span class="nt">&lt;script&gt;</span>alert(1)<span
class="nt">&lt;/script&gt;</span> bar\n</pre></div>\n\n</div>')
!= '<div class="markdown_content"><h3 id="foo">foo</h3>\n<div class="codehilite"><pre><span
class="nt">&lt;script&gt;</span>alert(1)<span class="nt">&lt;/script&gt;</span>
bar\n</pre></div>\n\n</div>'

======================================================================
FAIL: allura.tests.test_globals.test_markdown_autolink
----------------------------------------------------------------------
Traceback (most recent call last):
  File "<https://builds.apache.org/job/Allura/ws/.allura-venv/local/lib/python2.7/site-packages/nose-1.3.7-py2.7.egg/nose/case.py",>
line 197, in runTest
    self.test(*self.arg)
  File "<https://builds.apache.org/job/Allura/ws/Allura/allura/tests/test_globals.py",>
line 468, in test_markdown_autolink
    g.markdown.convert('    :::text\n'
AssertionError: '<pre>preformatted http://domain.net\n</pre>' not found in literal(u'<div
class="markdown_content"><div class="codehilite"><pre><span></span>preformatted
http://domain.net\n</pre></div>\n\n</div>')

----------------------------------------------------------------------
Ran 1068 tests in 191.291s

FAILED (SKIP=13, failures=2)
finished `nosetests allura/tests/ --with-xunitmp --cover-package=allura --processes=4 --process-timeout=360`
in Allura
<DummyProcess(Thread-2, started daemon 139743508260608)> running `npm run lint-es6`
in .


> allura@0.0.0 lint-es6 <https://builds.apache.org/job/Allura/ws/>
> eslint -c .eslintrc-es6  --ignore-path .eslintignore-es6 Allura/allura/public/**/*.es6.js
|| true

finished `npm run lint-es6` in .
..........................................................................................
----------------------------------------------------------------------
Ran 90 tests in 141.312s

OK
finished `nosetests  --with-xunitmp --cover-package=forgesvn ` in ForgeSVN
...........................................................S........
----------------------------------------------------------------------
Ran 68 tests in 29.108s

OK (SKIP=1)
finished `nosetests  --with-xunitmp --cover-package=forgewiki --processes=4 --process-timeout=360`
in ForgeWiki
......................F......................................F...........................................................................
======================================================================
FAIL: forgegit.tests.functional.test_controllers.TestFork.test_merge_request_edit
----------------------------------------------------------------------
Traceback (most recent call last):
  File "<https://builds.apache.org/job/Allura/ws/.allura-venv/local/lib/python2.7/site-packages/nose-1.3.7-py2.7.egg/nose/case.py",>
line 197, in runTest
    self.test(*self.arg)
  File "<https://builds.apache.org/job/Allura/ws/ForgeGit/forgegit/tests/functional/test_controllers.py",>
line 779, in test_merge_request_edit
    """.strip())
  File "<https://builds.apache.org/job/Allura/ws/.allura-venv/local/lib/python2.7/site-packages/datadiff/tools.py",>
line 34, in assert_equal
    raise AssertionError(msg)
AssertionError: 
--- a
+++ b
@@ -10,7 +10,7 @@
 </li>
 </ul>
 <p>Diff:</p>
-<div class="codehilite"><pre><span></span><span class="gd">---
old</span>
+<div class="codehilite"><pre><span class="gd">--- old</span>
 <span class="gi">+++ new</span>
 <span class="gu">@@ -1 +1 @@</span>
 <span class="gd">-description</span>
-------------------- >> begin captured stdout << ---------------------
Running setup_app() from allura.websetup

--------------------- >> end captured stdout << ----------------------

======================================================================
FAIL: Test that `index.*` files are viewable in code browser
----------------------------------------------------------------------
Traceback (most recent call last):
  File "<https://builds.apache.org/job/Allura/ws/.allura-venv/local/lib/python2.7/site-packages/nose-1.3.7-py2.7.egg/nose/case.py",>
line 197, in runTest
    self.test(*self.arg)
  File "<https://builds.apache.org/job/Allura/ws/ForgeGit/forgegit/tests/functional/test_controllers.py",>
line 334, in test_index_files
    '<span class="nt">&lt;/h1&gt;</span>') in content, content
AssertionError: <div class="clip grid-19 codebrowser">
<h3>
        2 lines (1 with data), 20 Bytes
      </h3>
<table class="codehilitetable"><tr><td class="linenos"><div class="linenodiv"><pre>1</pre></div></td><td
class="code"><div class="codehilite"><pre><div id="l1" class="code_block"><span
class="p">&lt;</span><span class="nt">h1</span><span class="p">&gt;</span>index.html<span
class="p">&lt;/</span><span class="nt">h1</span><span class="p">&gt;</span>
</div></pre></div>
</td></tr></table>
</div>
-------------------- >> begin captured stdout << ---------------------
Running setup_app() from allura.websetup

--------------------- >> end captured stdout << ----------------------

----------------------------------------------------------------------
Ran 137 tests in 226.349s

FAILED (failures=2)
finished `nosetests  --with-xunitmp --cover-package=forgegit ` in ForgeGit
Running setup_app() from allura.websetup
/p/test/wiki/_discuss/thread/375a94d6/ 200 OK
{"sidebar": 1, "jinja": 1, "markdown": 4, "ming": 105}
Build step 'Execute shell' marked build as failure
Recording plot data
Skipping Cobertura coverage report as build was not SUCCESS or better ...
Recording test results

Mime
View raw message