allura-dev mailing list archives

Site index · List index
Message view « Date » · « Thread »
Top « Date » · « Thread »
From Apache Jenkins Server <jenk...@builds.apache.org>
Subject Build failed in Jenkins: Allura #898
Date Thu, 17 Sep 2015 19:39:32 GMT
See <https://builds.apache.org/job/Allura/898/changes>

Changes:

[hseewald] [#7955] tooltip titles on our custom buttons

[hseewald] [#7955] update simplemde to 1.7.0

[hseewald] [#7955] sync our code with 1.7.0; add <hr> button

[hseewald] [#7955] make code sections more apparent; links go blue

[hseewald] [#7955] button to insert a table

[hseewald] [#7955] update spellChecker comment

[hseewald] [#7955] Integration with SimpleMDE preview customization.

[hseewald] [#7955] in preview mode, de-emphasize other buttons even more

[hseewald] [#7955] pass through options to CodeMirror's markdown and gfm modes

[hseewald] [#7955] style section headers preceding lines

[hseewald] [#7955] contextual code button

[hseewald] [#7955] new version of SimpleMDE / CodeMirror

[hseewald] [#7955] fix for cursor position after removing `` with no selection

[hseewald] [#7955] hide Reply/link/etc column when editing a post

[hseewald] [#7955] JS event handling cleanup for post widget

[hseewald] [#7955] preserve focus on editor after unindenting

[hseewald] [#7955] update simplemde again

[hseewald] [#7955] table example aligns (almost) visually, not exact same number of chars
(which didn't matter anyway)

------------------------------------------
[...truncated 1521 lines...]
    warning: no previously-included files matching '*' found under directory 'docs/_build/_sources'
    warning: no files found matching '*.txt' under directory 'tests'
  Running setup.py install for testfixtures
    
  Running setup.py install for pylint
    changing mode of build/scripts-2.7/pylint from 644 to 755
    changing mode of build/scripts-2.7/pylint-gui from 644 to 755
    changing mode of build/scripts-2.7/symilar from 644 to 755
    changing mode of build/scripts-2.7/epylint from 644 to 755
    changing mode of build/scripts-2.7/pyreverse from 644 to 755
    
    warning: no files found matching '*.html' under directory 'doc'
    changing mode of <https://builds.apache.org/job/Allura/ws/.allura-venv/bin/pylint>
to 755
    changing mode of <https://builds.apache.org/job/Allura/ws/.allura-venv/bin/pyreverse>
to 755
    changing mode of <https://builds.apache.org/job/Allura/ws/.allura-venv/bin/epylint>
to 755
    changing mode of <https://builds.apache.org/job/Allura/ws/.allura-venv/bin/symilar>
to 755
    changing mode of <https://builds.apache.org/job/Allura/ws/.allura-venv/bin/pylint-gui>
to 755
    Installing pylint script to <https://builds.apache.org/job/Allura/ws/.allura-venv/bin>
    Installing epylint script to <https://builds.apache.org/job/Allura/ws/.allura-venv/bin>
    Installing pyreverse script to <https://builds.apache.org/job/Allura/ws/.allura-venv/bin>
    Installing pylint-gui script to <https://builds.apache.org/job/Allura/ws/.allura-venv/bin>
    Installing symilar script to <https://builds.apache.org/job/Allura/ws/.allura-venv/bin>
  Running setup.py install for astroid
    
  Running setup.py install for logilab-common
    changing mode of build/scripts-2.7/pytest from 644 to 755
    Skipping installation of <https://builds.apache.org/job/Allura/ws/.allura-venv/lib/python2.7/site-packages/logilab/__init__.py>
(namespace package)
    
    warning: no files found matching '*.py' under directory 'test/input'
    warning: no files found matching '*' under directory 'doc/html'
    Installing <https://builds.apache.org/job/Allura/ws/.allura-venv/lib/python2.7/site-packages/logilab_common-1.0.2-py2.7-nspkg.pth>
    changing mode of <https://builds.apache.org/job/Allura/ws/.allura-venv/bin/pytest>
to 755
  Running setup.py install for q
    
  Running setup.py install for WebError
    paster_plugins not set in setup(), but WebError.egg-info/paster_plugins.txt exists
    
  Running setup.py develop for sphinx-argparse
    
    Creating <https://builds.apache.org/job/Allura/ws/.allura-venv/lib/python2.7/site-packages/sphinx-argparse.egg-link>
(link to .)
    Adding sphinx-argparse 0.1.15 to easy-install.pth file
    
    Installed <https://builds.apache.org/job/Allura/ws/.allura-venv/src/sphinx-argparse>
  Running setup.py install for sphinx-rtd-theme
    
  Running setup.py install for sphinxcontrib-programoutput
    
    warning: no files found matching '*.txt' under directory 'tests'
    Skipping installation of <https://builds.apache.org/job/Allura/ws/.allura-venv/lib/python2.7/site-packages/sphinxcontrib/__init__.py>
(namespace package)
    Installing <https://builds.apache.org/job/Allura/ws/.allura-venv/lib/python2.7/site-packages/sphinxcontrib_programoutput-0.8-py2.7-nspkg.pth>
  Running setup.py install for sphinx
    
    warning: no files found matching 'TODO'
    no previously-included directories found matching 'doc/_build'
    Installing sphinx-apidoc script to <https://builds.apache.org/job/Allura/ws/.allura-venv/bin>
    Installing sphinx-build script to <https://builds.apache.org/job/Allura/ws/.allura-venv/bin>
    Installing sphinx-quickstart script to <https://builds.apache.org/job/Allura/ws/.allura-venv/bin>
    Installing sphinx-autogen script to <https://builds.apache.org/job/Allura/ws/.allura-venv/bin>
  Running setup.py install for snowballstemmer
    
    warning: no files found matching '*.py' under directory 'src'
  Running setup.py install for alabaster
    
    warning: no files found matching 'README.md'
    warning: no previously-included files matching '.*.swp' found under directory 'alabaster'
Successfully installed ActivityStream BeautifulSoup beautifulsoup4 Beaker chardet colander
Creoleparser decorator docutils EasyWidgets faulthandler feedparser FormEncode Genshi html5lib
httplib2 iso8601 Jinja2 Markdown Ming oauth2 Paste PasteDeploy PasteScript Pillow poster Pygments
pymongo Pypeline pysolr python-dateutil python-magic python-oembed pytz requests oauthlib
requests-oauthlib setproctitle six textile translationstring TimerMiddleware TurboGears2 WebOb
Babel Mako MarkupSafe Pylons simplejson Tempita Routes WebFlash WebHelpers GitPython async
gitdb smmap datadiff ipython mock nose pyflakes WebTest testfixtures pylint astroid logilab-common
q WebError sphinx-argparse sphinx-rtd-theme sphinxcontrib-programoutput sphinx snowballstemmer
alabaster
Cleaning up...
Downloading/unpacking pep8
  Storing download in cache at /tmp/python-pip-cache/https%3A%2F%2Fpypi.python.org%2Fpackages%2Fsource%2Fp%2Fpep8%2Fpep8-1.6.2.tar.gz
  Running setup.py egg_info for package pep8
    
    warning: no previously-included files matching '*.pyc' found under directory 'docs'
    warning: no previously-included files matching '*.pyo' found under directory 'docs'
    warning: no previously-included files matching '*.pyc' found under directory 'testsuite'
    warning: no previously-included files matching '*.pyo' found under directory 'testsuite'
    no previously-included directories found matching 'docs/_build'
Requirement already satisfied (use --upgrade to upgrade): pyflakes in ./.allura-venv/lib/python2.7/site-packages
Downloading/unpacking coverage
  Storing download in cache at /tmp/python-pip-cache/https%3A%2F%2Fpypi.python.org%2Fpackages%2Fsource%2Fc%2Fcoverage%2Fcoverage-4.0b3.tar.gz
  Running setup.py egg_info for package coverage
    
Downloading/unpacking nose-xunitmp
  Downloading nose_xunitmp-0.3.2.tar.gz
  Storing download in cache at /tmp/python-pip-cache/https%3A%2F%2Fpypi.python.org%2Fpackages%2Fsource%2Fn%2Fnose_xunitmp%2Fnose_xunitmp-0.3.2.tar.gz
  Running setup.py egg_info for package nose-xunitmp
    
Requirement already satisfied (use --upgrade to upgrade): nose in ./.allura-venv/lib/python2.7/site-packages
(from nose-xunitmp)
Installing collected packages: pep8, coverage, nose-xunitmp
  Running setup.py install for pep8
    
    warning: no previously-included files matching '*.pyc' found under directory 'docs'
    warning: no previously-included files matching '*.pyo' found under directory 'docs'
    warning: no previously-included files matching '*.pyc' found under directory 'testsuite'
    warning: no previously-included files matching '*.pyo' found under directory 'testsuite'
    no previously-included directories found matching 'docs/_build'
    Installing pep8 script to <https://builds.apache.org/job/Allura/ws/.allura-venv/bin>
  Running setup.py install for coverage
    building 'coverage.tracer' extension
    x86_64-linux-gnu-gcc -pthread -fno-strict-aliasing -DNDEBUG -g -fwrapv -O2 -Wall -Wstrict-prototypes
-fPIC -I/usr/include/python2.7 -c coverage/ctracer/datastack.c -o build/temp.linux-x86_64-2.7/coverage/ctracer/datastack.o
    x86_64-linux-gnu-gcc -pthread -fno-strict-aliasing -DNDEBUG -g -fwrapv -O2 -Wall -Wstrict-prototypes
-fPIC -I/usr/include/python2.7 -c coverage/ctracer/filedisp.c -o build/temp.linux-x86_64-2.7/coverage/ctracer/filedisp.o
    x86_64-linux-gnu-gcc -pthread -fno-strict-aliasing -DNDEBUG -g -fwrapv -O2 -Wall -Wstrict-prototypes
-fPIC -I/usr/include/python2.7 -c coverage/ctracer/module.c -o build/temp.linux-x86_64-2.7/coverage/ctracer/module.o
    x86_64-linux-gnu-gcc -pthread -fno-strict-aliasing -DNDEBUG -g -fwrapv -O2 -Wall -Wstrict-prototypes
-fPIC -I/usr/include/python2.7 -c coverage/ctracer/tracer.c -o build/temp.linux-x86_64-2.7/coverage/ctracer/tracer.o
    x86_64-linux-gnu-gcc -pthread -shared -Wl,-O1 -Wl,-Bsymbolic-functions -Wl,-Bsymbolic-functions
-Wl,-z,relro -fno-strict-aliasing -DNDEBUG -g -fwrapv -O2 -Wall -Wstrict-prototypes -D_FORTIFY_SOURCE=2
-g -fstack-protector --param=ssp-buffer-size=4 -Wformat -Werror=format-security build/temp.linux-x86_64-2.7/coverage/ctracer/datastack.o
build/temp.linux-x86_64-2.7/coverage/ctracer/filedisp.o build/temp.linux-x86_64-2.7/coverage/ctracer/module.o
build/temp.linux-x86_64-2.7/coverage/ctracer/tracer.o -o build/lib.linux-x86_64-2.7/coverage/tracer.so
    
    Installing coverage2 script to <https://builds.apache.org/job/Allura/ws/.allura-venv/bin>
    Installing coverage-2.7 script to <https://builds.apache.org/job/Allura/ws/.allura-venv/bin>
    Installing coverage script to <https://builds.apache.org/job/Allura/ws/.allura-venv/bin>
  Running setup.py install for nose-xunitmp
    
Successfully installed pep8 coverage nose-xunitmp
Cleaning up...
# setting up Allura dependencies
warning: no files found matching 'allura/public/favicon.ico'
# setting up AlluraTest dependencies
# setting up ForgeActivity dependencies
# setting up ForgeBlog dependencies
# setting up ForgeChat dependencies
# setting up ForgeDiscussion dependencies
# setting up ForgeGit dependencies
# setting up ForgeImporters dependencies
# setting up ForgeLink dependencies
# setting up ForgeShortUrl dependencies
# setting up ForgeSVN dependencies
# setting up ForgeTracker dependencies
# setting up ForgeUserStats dependencies
# setting up ForgeWiki dependencies
Not running tests for virtualenv-1.9.1, since it isn't set up
<DummyProcess(Thread-2, started daemon 139860674377472)> running nosetests  --with-xunitmp
--cover-package=alluratest --processes=4 --process-timeout=360 {'cwd': 'AlluraTest'}
<DummyProcess(Thread-1, started daemon 139860682770176)> running nosetests allura/tests/
--with-xunitmp --cover-package=allura --processes=4 --process-timeout=360 {'cwd': 'Allura'}
<DummyProcess(Thread-3, started daemon 139860665984768)> running nosetests  --with-xunitmp
--cover-package=forgeactivity --processes=4 --process-timeout=360 {'cwd': 'ForgeActivity'}
<DummyProcess(Thread-4, started daemon 139860657592064)> running nosetests  --with-xunitmp
--cover-package=forgeblog --processes=4 --process-timeout=360 {'cwd': 'ForgeBlog'}
..................
----------------------------------------------------------------------
Ran 18 tests in 13.082s

OK
finished nosetests  --with-xunitmp --cover-package=forgeactivity --processes=4 --process-timeout=360
{'cwd': 'ForgeActivity'}
<DummyProcess(Thread-3, started daemon 139860665984768)> running nosetests  --with-xunitmp
--cover-package=forgechat --processes=4 --process-timeout=360 {'cwd': 'ForgeChat'}
.
----------------------------------------------------------------------
Ran 1 test in 3.278s

OK
finished nosetests  --with-xunitmp --cover-package=forgechat --processes=4 --process-timeout=360
{'cwd': 'ForgeChat'}
<DummyProcess(Thread-3, started daemon 139860665984768)> running nosetests  --with-xunitmp
--cover-package=forgediscussion --processes=4 --process-timeout=360 {'cwd': 'ForgeDiscussion'}
........................................SSS..
----------------------------------------------------------------------
Ran 45 tests in 26.369s

OK (SKIP=3)
finished nosetests  --with-xunitmp --cover-package=forgeblog --processes=4 --process-timeout=360
{'cwd': 'ForgeBlog'}
<DummyProcess(Thread-4, started daemon 139860657592064)> running nosetests  --with-xunitmp
--cover-package=forgegit  {'cwd': 'ForgeGit'}
....No config file found, using default configuration
.
----------------------------------------------------------------------
Ran 5 tests in 26.768s

OK
finished nosetests  --with-xunitmp --cover-package=alluratest --processes=4 --process-timeout=360
{'cwd': 'AlluraTest'}
<DummyProcess(Thread-2, started daemon 139860674377472)> running nosetests  --with-xunitmp
--cover-package=forgeimporters --processes=4 --process-timeout=360 {'cwd': 'ForgeImporters'}
...F............................................................
======================================================================
FAIL: forgediscussion.tests.functional.test_forum.TestForum.test_anonymous_post
----------------------------------------------------------------------
Traceback (most recent call last):
  File "<https://builds.apache.org/job/Allura/ws/.allura-venv/local/lib/python2.7/site-packages/nose/case.py",>
line 197, in runTest
    self.test(*self.arg)
  File "<https://builds.apache.org/job/Allura/ws/.allura-venv/local/lib/python2.7/site-packages/mock.py",>
line 1201, in patched
    return func(*args, **keywargs)
  File "<https://builds.apache.org/job/Allura/ws/ForgeDiscussion/forgediscussion/tests/functional/test_forum.py",>
line 497, in test_anonymous_post
    assert '<a href="" class="reply_post btn" style="display:none">' in r
AssertionError: 
-------------------- >> begin captured stdout << ---------------------
Running setup_app() from allura.websetup

--------------------- >> end captured stdout << ----------------------

----------------------------------------------------------------------
Ran 64 tests in 60.170s

FAILED (failures=1)
finished nosetests  --with-xunitmp --cover-package=forgediscussion --processes=4 --process-timeout=360
{'cwd': 'ForgeDiscussion'}
<DummyProcess(Thread-3, started daemon 139860665984768)> running nosetests  --with-xunitmp
--cover-package=forgelink --processes=4 --process-timeout=360 {'cwd': 'ForgeLink'}
.......................................S................S............................................S.....................S..................................S.........SSSS..SS..........S.
----------------------------------------------------------------------
Ran 188 tests in 56.646s

OK (SKIP=12)
finished nosetests  --with-xunitmp --cover-package=forgeimporters --processes=4 --process-timeout=360
{'cwd': 'ForgeImporters'}
<DummyProcess(Thread-2, started daemon 139860674377472)> running nosetests  --with-xunitmp
--cover-package=forgesvn  {'cwd': 'ForgeSVN'}
.................
----------------------------------------------------------------------
Ran 17 tests in 10.453s

OK
finished nosetests  --with-xunitmp --cover-package=forgelink --processes=4 --process-timeout=360
{'cwd': 'ForgeLink'}
<DummyProcess(Thread-3, started daemon 139860665984768)> running nosetests  --with-xunitmp
--cover-package=forgeshorturl --processes=4 --process-timeout=360 {'cwd': 'ForgeShortUrl'}
...........
----------------------------------------------------------------------
Ran 11 tests in 7.777s

OK
finished nosetests  --with-xunitmp --cover-package=forgeshorturl --processes=4 --process-timeout=360
{'cwd': 'ForgeShortUrl'}
<DummyProcess(Thread-3, started daemon 139860665984768)> running nosetests  --with-xunitmp
--cover-package=forgetracker --processes=4 --process-timeout=360 {'cwd': 'ForgeTracker'}
...............................................................................................................................................................................................
----------------------------------------------------------------------
Ran 191 tests in 135.323s

OK
finished nosetests  --with-xunitmp --cover-package=forgetracker --processes=4 --process-timeout=360
{'cwd': 'ForgeTracker'}
<DummyProcess(Thread-3, started daemon 139860665984768)> running nosetests  --with-xunitmp
--cover-package=forgeuserstats --processes=4 --process-timeout=360 {'cwd': 'ForgeUserStats'}
............
----------------------------------------------------------------------
Ran 12 tests in 14.900s

OK
finished nosetests  --with-xunitmp --cover-package=forgeuserstats --processes=4 --process-timeout=360
{'cwd': 'ForgeUserStats'}
<DummyProcess(Thread-3, started daemon 139860665984768)> running nosetests  --with-xunitmp
--cover-package=forgewiki --processes=4 --process-timeout=360 {'cwd': 'ForgeWiki'}
.......................................................S........
----------------------------------------------------------------------
Ran 64 tests in 41.933s

OK (SKIP=1)
finished nosetests  --with-xunitmp --cover-package=forgewiki --processes=4 --process-timeout=360
{'cwd': 'ForgeWiki'}
.................................................................................................................................................................................................................................................................S..................................................................................................................................................................................................................................................................S.......................................................................................SSSSSSSSSSS................................................................................................................................................................................................................................................................................................................................................................
----------------------------------------------------------------------
Ran 967 tests in 289.308s

OK (SKIP=13)
finished nosetests allura/tests/ --with-xunitmp --cover-package=allura --processes=4 --process-timeout=360
{'cwd': 'Allura'}
..........................................................................................
----------------------------------------------------------------------
Ran 90 tests in 218.093s

OK
finished nosetests  --with-xunitmp --cover-package=forgesvn  {'cwd': 'ForgeSVN'}
......................................................................................................................................
----------------------------------------------------------------------
Ran 134 tests in 333.514s

OK
finished nosetests  --with-xunitmp --cover-package=forgegit  {'cwd': 'ForgeGit'}
Running setup_app() from allura.websetup
/p/test/wiki/_discuss/thread/67efe428/ 200 OK
{"sidebar": 1, "jinja": 1, "markdown": 4, "ming": 107}
Build step 'Execute shell' marked build as failure
Recording plot data
Skipping Cobertura coverage report as build was not SUCCESS or better ...
Recording test results

Mime
View raw message