airavata-dev mailing list archives

Site index · List index
Message view « Date » · « Thread »
Top « Date » · « Thread »
From Apache Jenkins Server <jenk...@builds.apache.org>
Subject Build failed in Jenkins: airavata-dev » airavata-sharing-registry-stubs #757
Date Sat, 15 Oct 2016 06:56:26 GMT
See <https://builds.apache.org/job/airavata-dev/org.apache.airavata$airavata-sharing-registry-stubs/757/>

------------------------------------------
[INFO]                                                                         
[INFO] ------------------------------------------------------------------------
[INFO] Building airavata-sharing-registry-stubs 0.17-SNAPSHOT
[INFO] ------------------------------------------------------------------------
[INFO] Downloading: https://repo.maven.apache.org/maven2/org/apache/maven/plugins/maven-compiler-plugin/3.5.1/maven-compiler-plugin-3.5.1.pom
[INFO] Downloaded: https://repo.maven.apache.org/maven2/org/apache/maven/plugins/maven-compiler-plugin/3.5.1/maven-compiler-plugin-3.5.1.pom
(10 KB at 1415.3 KB/sec)
[INFO] Downloading: https://repo.maven.apache.org/maven2/org/apache/maven/plugins/maven-plugins/28/maven-plugins-28.pom
[INFO] Downloaded: https://repo.maven.apache.org/maven2/org/apache/maven/plugins/maven-plugins/28/maven-plugins-28.pom
(12 KB at 1958.2 KB/sec)
[INFO] Downloading: https://repo.maven.apache.org/maven2/org/apache/maven/maven-parent/27/maven-parent-27.pom
[INFO] Downloaded: https://repo.maven.apache.org/maven2/org/apache/maven/maven-parent/27/maven-parent-27.pom
(40 KB at 4969.4 KB/sec)
[INFO] Downloading: https://repo.maven.apache.org/maven2/org/apache/apache/17/apache-17.pom
[INFO] Downloaded: https://repo.maven.apache.org/maven2/org/apache/apache/17/apache-17.pom
(16 KB at 2240.0 KB/sec)
[INFO] Downloading: https://repo.maven.apache.org/maven2/org/apache/maven/plugins/maven-compiler-plugin/3.5.1/maven-compiler-plugin-3.5.1.jar
[INFO] Downloaded: https://repo.maven.apache.org/maven2/org/apache/maven/plugins/maven-compiler-plugin/3.5.1/maven-compiler-plugin-3.5.1.jar
(50 KB at 6130.7 KB/sec)
[INFO] 
[INFO] --- maven-clean-plugin:2.5:clean (default-clean) @ airavata-sharing-registry-stubs
---
[INFO] 
[INFO] --- maven-resources-plugin:2.5:copy-resources (copy-resources) @ airavata-sharing-registry-stubs
---
[debug] execute contextualize
[INFO] Using 'UTF-8' encoding to copy filtered resources.
[INFO] skip non existing resourceDirectory <https://builds.apache.org/job/airavata-dev/org.apache.airavata$airavata-sharing-registry-stubs/ws/src/main/assembly/dist>
[INFO] 
[INFO] --- gitdescribe-maven-plugin:3.0:gitdescribe (git-describe) @ airavata-sharing-registry-stubs
---
[INFO] Setting Git Describe: airavata-0.16-261-g6718761
[INFO] 
[INFO] --- templating-maven-plugin:1.0.0:filter-sources (filtering-java-templates) @ airavata-sharing-registry-stubs
---
[INFO] Request to add '<https://builds.apache.org/job/airavata-dev/org.apache.airavata$airavata-sharing-registry-stubs/ws/src/main/java-templates'>
folder. Not added since it does not exist.
[INFO] 
[INFO] --- replacer:1.5.3:replace (default) @ airavata-sharing-registry-stubs ---
[INFO] Replacement run on 17 files.
[INFO] 
[INFO] --- maven-remote-resources-plugin:1.5:process (default) @ airavata-sharing-registry-stubs
---
[INFO] 
[INFO] --- maven-resources-plugin:2.5:resources (default-resources) @ airavata-sharing-registry-stubs
---
[debug] execute contextualize
[INFO] Using 'UTF-8' encoding to copy filtered resources.
[INFO] skip non existing resourceDirectory <https://builds.apache.org/job/airavata-dev/org.apache.airavata$airavata-sharing-registry-stubs/ws/src/main/resources>
[INFO] Copying 3 resources
[INFO] 
[INFO] --- maven-compiler-plugin:3.5.1:compile (default-compile) @ airavata-sharing-registry-stubs
---
[INFO] Downloading: https://repo.maven.apache.org/maven2/org/apache/maven/shared/maven-shared-utils/3.0.0/maven-shared-utils-3.0.0.pom
[INFO] Downloaded: https://repo.maven.apache.org/maven2/org/apache/maven/shared/maven-shared-utils/3.0.0/maven-shared-utils-3.0.0.pom
(6 KB at 779.0 KB/sec)
[INFO] Downloading: https://repo.maven.apache.org/maven2/org/apache/maven/shared/maven-shared-components/21/maven-shared-components-21.pom
[INFO] Downloaded: https://repo.maven.apache.org/maven2/org/apache/maven/shared/maven-shared-components/21/maven-shared-components-21.pom
(5 KB at 712.5 KB/sec)
[INFO] Downloading: https://repo.maven.apache.org/maven2/org/apache/maven/maven-parent/25/maven-parent-25.pom
[INFO] Downloaded: https://repo.maven.apache.org/maven2/org/apache/maven/maven-parent/25/maven-parent-25.pom
(37 KB at 4570.3 KB/sec)
[INFO] Downloading: https://repo.maven.apache.org/maven2/org/apache/apache/15/apache-15.pom
[INFO] Downloaded: https://repo.maven.apache.org/maven2/org/apache/apache/15/apache-15.pom
(15 KB at 2125.6 KB/sec)
[INFO] Downloading: https://repo.maven.apache.org/maven2/commons-io/commons-io/2.4/commons-io-2.4.pom
[INFO] Downloaded: https://repo.maven.apache.org/maven2/commons-io/commons-io/2.4/commons-io-2.4.pom
(10 KB at 1654.6 KB/sec)
[INFO] Downloading: https://repo.maven.apache.org/maven2/org/apache/commons/commons-parent/25/commons-parent-25.pom
[INFO] Downloaded: https://repo.maven.apache.org/maven2/org/apache/commons/commons-parent/25/commons-parent-25.pom
(48 KB at 5241.3 KB/sec)
[INFO] Downloading: https://repo.maven.apache.org/maven2/org/codehaus/plexus/plexus-compiler-api/2.7/plexus-compiler-api-2.7.pom
[INFO] Downloaded: https://repo.maven.apache.org/maven2/org/codehaus/plexus/plexus-compiler-api/2.7/plexus-compiler-api-2.7.pom
(891 B at 145.0 KB/sec)
[INFO] Downloading: https://repo.maven.apache.org/maven2/org/codehaus/plexus/plexus-compiler/2.7/plexus-compiler-2.7.pom
[INFO] Downloaded: https://repo.maven.apache.org/maven2/org/codehaus/plexus/plexus-compiler/2.7/plexus-compiler-2.7.pom
(5 KB at 602.3 KB/sec)
[INFO] Downloading: https://repo.maven.apache.org/maven2/org/codehaus/plexus/plexus-components/4.0/plexus-components-4.0.pom
[INFO] Downloaded: https://repo.maven.apache.org/maven2/org/codehaus/plexus/plexus-components/4.0/plexus-components-4.0.pom
(3 KB at 432.5 KB/sec)
[INFO] Downloading: https://repo.maven.apache.org/maven2/org/codehaus/plexus/plexus/4.0/plexus-4.0.pom
[INFO] Downloaded: https://repo.maven.apache.org/maven2/org/codehaus/plexus/plexus/4.0/plexus-4.0.pom
(21 KB at 2999.4 KB/sec)
[INFO] Downloading: https://repo.maven.apache.org/maven2/org/codehaus/plexus/plexus-compiler-manager/2.7/plexus-compiler-manager-2.7.pom
[INFO] Downloaded: https://repo.maven.apache.org/maven2/org/codehaus/plexus/plexus-compiler-manager/2.7/plexus-compiler-manager-2.7.pom
(711 B at 138.9 KB/sec)
[INFO] Downloading: https://repo.maven.apache.org/maven2/org/codehaus/plexus/plexus-compiler-javac/2.7/plexus-compiler-javac-2.7.pom
[INFO] Downloaded: https://repo.maven.apache.org/maven2/org/codehaus/plexus/plexus-compiler-javac/2.7/plexus-compiler-javac-2.7.pom
(792 B at 154.7 KB/sec)
[INFO] Downloading: https://repo.maven.apache.org/maven2/org/codehaus/plexus/plexus-compilers/2.7/plexus-compilers-2.7.pom
[INFO] Downloaded: https://repo.maven.apache.org/maven2/org/codehaus/plexus/plexus-compilers/2.7/plexus-compilers-2.7.pom
(2 KB at 224.9 KB/sec)
[INFO] Downloading: https://repo.maven.apache.org/maven2/org/apache/maven/maven-artifact/3.0/maven-artifact-3.0.jar
[INFO] Downloading: https://repo.maven.apache.org/maven2/org/codehaus/plexus/plexus-utils/2.0.4/plexus-utils-2.0.4.jar
[INFO] Downloading: https://repo.maven.apache.org/maven2/org/codehaus/plexus/plexus-interpolation/1.14/plexus-interpolation-1.14.jar
[INFO] Downloading: https://repo.maven.apache.org/maven2/org/apache/maven/shared/maven-shared-utils/3.0.0/maven-shared-utils-3.0.0.jar
[INFO] Downloading: https://repo.maven.apache.org/maven2/commons-io/commons-io/2.4/commons-io-2.4.jar
[INFO] Downloaded: https://repo.maven.apache.org/maven2/org/apache/maven/maven-artifact/3.0/maven-artifact-3.0.jar
(51 KB at 3899.3 KB/sec)
[INFO] Downloading: https://repo.maven.apache.org/maven2/org/codehaus/plexus/plexus-compiler-api/2.7/plexus-compiler-api-2.7.jar
[INFO] Downloaded: https://repo.maven.apache.org/maven2/org/codehaus/plexus/plexus-interpolation/1.14/plexus-interpolation-1.14.jar
(60 KB at 2485.0 KB/sec)
[INFO] Downloading: https://repo.maven.apache.org/maven2/org/codehaus/plexus/plexus-compiler-manager/2.7/plexus-compiler-manager-2.7.jar
[INFO] Downloaded: https://repo.maven.apache.org/maven2/org/codehaus/plexus/plexus-compiler-api/2.7/plexus-compiler-api-2.7.jar
(26 KB at 1091.1 KB/sec)
[INFO] Downloading: https://repo.maven.apache.org/maven2/org/codehaus/plexus/plexus-compiler-javac/2.7/plexus-compiler-javac-2.7.jar
[INFO] Downloaded: https://repo.maven.apache.org/maven2/org/codehaus/plexus/plexus-utils/2.0.4/plexus-utils-2.0.4.jar
(217 KB at 8343.5 KB/sec)
[INFO] Downloaded: https://repo.maven.apache.org/maven2/commons-io/commons-io/2.4/commons-io-2.4.jar
(181 KB at 7232.0 KB/sec)
[INFO] Downloaded: https://repo.maven.apache.org/maven2/org/codehaus/plexus/plexus-compiler-javac/2.7/plexus-compiler-javac-2.7.jar
(20 KB at 613.9 KB/sec)
[INFO] Downloaded: https://repo.maven.apache.org/maven2/org/apache/maven/shared/maven-shared-utils/3.0.0/maven-shared-utils-3.0.0.jar
(152 KB at 4443.5 KB/sec)
[INFO] Downloaded: https://repo.maven.apache.org/maven2/org/codehaus/plexus/plexus-compiler-manager/2.7/plexus-compiler-manager-2.7.jar
(5 KB at 130.6 KB/sec)
[INFO] Changes detected - recompiling the module!
[INFO] Compiling 17 source files to <https://builds.apache.org/job/airavata-dev/org.apache.airavata$airavata-sharing-registry-stubs/ws/target/classes>
[INFO] -------------------------------------------------------------
[ERROR] COMPILATION ERROR : 
[INFO] -------------------------------------------------------------
[ERROR] <https://builds.apache.org/job/airavata-dev/org.apache.airavata$airavata-sharing-registry-stubs/ws/src/main/java/org/apache/airavata/sharing/registry/models/UserGroup.java>:[84,10]
cannot find symbol
  symbol:   class GroupCardinality
  location: class org.apache.airavata.sharing.registry.models.UserGroup
[ERROR] <https://builds.apache.org/job/airavata-dev/org.apache.airavata$airavata-sharing-registry-stubs/ws/src/main/java/org/apache/airavata/sharing/registry/models/UserGroup.java>:[419,10]
cannot find symbol
  symbol:   class GroupCardinality
  location: class org.apache.airavata.sharing.registry.models.UserGroup
[ERROR] <https://builds.apache.org/job/airavata-dev/org.apache.airavata$airavata-sharing-registry-stubs/ws/src/main/java/org/apache/airavata/sharing/registry/models/UserGroup.java>:[427,40]
cannot find symbol
  symbol:   class GroupCardinality
  location: class org.apache.airavata.sharing.registry.models.UserGroup
[ERROR] <https://builds.apache.org/job/airavata-dev/org.apache.airavata$airavata-sharing-registry-stubs/ws/src/main/java/org/apache/airavata/sharing/registry/models/UserGroup.java>:[199,93]
cannot find symbol
  symbol:   class GroupCardinality
  location: class org.apache.airavata.sharing.registry.models.UserGroup
[ERROR] <https://builds.apache.org/job/airavata-dev/org.apache.airavata$airavata-sharing-registry-stubs/ws/src/main/java/org/apache/airavata/sharing/registry/models/UserGroup.java>:[547,30]
cannot find symbol
  symbol:   class GroupCardinality
  location: class org.apache.airavata.sharing.registry.models.UserGroup
[ERROR] <https://builds.apache.org/job/airavata-dev/org.apache.airavata$airavata-sharing-registry-stubs/ws/src/main/java/org/apache/airavata/sharing/registry/models/UserGroup.java>:[1075,84]
cannot find symbol
  symbol:   class GroupCardinality
  location: package org.apache.airavata.sharing.registry.models
[ERROR] <https://builds.apache.org/job/airavata-dev/org.apache.airavata$airavata-sharing-registry-stubs/ws/src/main/java/org/apache/airavata/sharing/registry/models/UserGroup.java>:[1275,78]
cannot find symbol
  symbol:   class GroupCardinality
  location: package org.apache.airavata.sharing.registry.models
[INFO] 7 errors 
[INFO] -------------------------------------------------------------

Mime
View raw message