airavata-dev mailing list archives

Site index · List index
Message view « Date » · « Thread »
Top « Date » · « Thread »
From Apache Jenkins Server <jenk...@builds.apache.org>
Subject Build failed in Jenkins: airavata-dev #4
Date Tue, 23 Aug 2016 17:30:03 GMT
See <https://builds.apache.org/job/airavata-dev/4/>

------------------------------------------
[...truncated 756 lines...]
[INFO] Copying 3 resources
[INFO] 
[INFO] --- maven-compiler-plugin:3.1:testCompile (default-testCompile) @ airavata-security
---
[INFO] Changes detected - recompiling the module!
[INFO] Compiling 8 source files to <https://builds.apache.org/job/airavata-dev/ws/modules/security/target/test-classes>
[WARNING] <https://builds.apache.org/job/airavata-dev/ws/modules/security/src/test/java/org/apache/airavata/security/configurations/AuthenticatorConfigurationReaderTest.java>:
<https://builds.apache.org/job/airavata-dev/ws/modules/security/src/test/java/org/apache/airavata/security/configurations/AuthenticatorConfigurationReaderTest.java>
uses or overrides a deprecated API.
[WARNING] <https://builds.apache.org/job/airavata-dev/ws/modules/security/src/test/java/org/apache/airavata/security/configurations/AuthenticatorConfigurationReaderTest.java>:
Recompile with -Xlint:deprecation for details.
[INFO] 
[INFO] --- maven-surefire-plugin:2.18.1:test (default-test) @ airavata-security ---
[INFO] Surefire report directory: <https://builds.apache.org/job/airavata-dev/ws/modules/security/target/surefire-reports>

-------------------------------------------------------
 T E S T S
-------------------------------------------------------
Java HotSpot(TM) 64-Bit Server VM warning: Insufficient space for shared memory file:
   13471
Try using the -Djava.io.tmpdir= option to select an alternate temp location.
Running org.apache.airavata.security.userstore.LDAPUserStoreTest
Tests run: 1, Failures: 0, Errors: 0, Skipped: 1, Time elapsed: 0.003 sec - in org.apache.airavata.security.userstore.LDAPUserStoreTest
Running org.apache.airavata.security.userstore.SessionDBUserStoreTest
SLF4J: Class path contains multiple SLF4J bindings.
SLF4J: Found binding in [jar:file:/home/jenkins/jenkins-slave/maven-repositories/0/org/slf4j/slf4j-log4j12/1.7.10/slf4j-log4j12-1.7.10.jar!/org/slf4j/impl/StaticLoggerBinder.class]
SLF4J: Found binding in [jar:file:/home/jenkins/jenkins-slave/maven-repositories/0/org/slf4j/slf4j-simple/1.7.10/slf4j-simple-1.7.10.jar!/org/slf4j/impl/StaticLoggerBinder.class]
SLF4J: See http://www.slf4j.org/codes.html#multiple_bindings for an explanation.
SLF4J: Actual binding is of type [org.slf4j.impl.Log4jLoggerFactory]
log4j:WARN No appenders could be found for logger (org.apache.airavata.security.userstore.SessionDBUserStore).
log4j:WARN Please initialize the log4j system properly.
log4j:WARN See http://logging.apache.org/log4j/1.2/faq.html#noconfig for more info.
Tests run: 2, Failures: 0, Errors: 0, Skipped: 0, Time elapsed: 2.971 sec - in org.apache.airavata.security.userstore.SessionDBUserStoreTest
Running org.apache.airavata.security.userstore.JDBCUserStoreTest
Tests run: 1, Failures: 0, Errors: 0, Skipped: 0, Time elapsed: 1.321 sec - in org.apache.airavata.security.userstore.JDBCUserStoreTest
Running org.apache.airavata.security.configurations.AuthenticatorConfigurationReaderTest
<https://builds.apache.org/job/airavata-dev/ws/modules/security/target/test-classes/.>
<https://builds.apache.org/job/airavata-dev/ws/modules/security/target/test-classes/.>
Tests run: 2, Failures: 0, Errors: 0, Skipped: 0, Time elapsed: 0.014 sec - in org.apache.airavata.security.configurations.AuthenticatorConfigurationReaderTest

Results :

Tests run: 6, Failures: 0, Errors: 0, Skipped: 1

[JENKINS] Recording test results
[INFO] 
[INFO] --- maven-jar-plugin:2.5:jar (default-jar) @ airavata-security ---
[INFO] Building jar: <https://builds.apache.org/job/airavata-dev/ws/modules/security/target/airavata-security-0.17-SNAPSHOT.jar>
[INFO] 
[INFO] --- maven-site-plugin:3.4:attach-descriptor (attach-descriptor) @ airavata-security
---
[INFO] 
[INFO] --- maven-install-plugin:2.5.2:install (default-install) @ airavata-security ---
[INFO] Installing <https://builds.apache.org/job/airavata-dev/ws/modules/security/target/airavata-security-0.17-SNAPSHOT.jar>
to /home/jenkins/jenkins-slave/maven-repositories/0/org/apache/airavata/airavata-security/0.17-SNAPSHOT/airavata-security-0.17-SNAPSHOT.jar
[INFO] Installing <https://builds.apache.org/job/airavata-dev/ws/modules/security/pom.xml>
to /home/jenkins/jenkins-slave/maven-repositories/0/org/apache/airavata/airavata-security/0.17-SNAPSHOT/airavata-security-0.17-SNAPSHOT.pom
[INFO]                                                                         
[INFO] ------------------------------------------------------------------------
[INFO] Building Airavata API Server 0.17-SNAPSHOT
[INFO] ------------------------------------------------------------------------
[INFO] Downloading: http://oauth.googlecode.com/svn/code/maven/org/apache/airavata/group-manager/0.17-SNAPSHOT/maven-metadata.xml
[INFO] Downloading: http://repository.apache.org/snapshots/org/apache/airavata/group-manager/0.17-SNAPSHOT/maven-metadata.xml
[INFO] Downloading: http://maven.wso2.org/nexus/content/groups/wso2-public/org/apache/airavata/group-manager/0.17-SNAPSHOT/maven-metadata.xml
[INFO] Downloading: http://repository.apache.org/snapshots/org/apache/airavata/group-manager/0.17-SNAPSHOT/group-manager-0.17-SNAPSHOT.pom
[INFO] Downloading: http://oauth.googlecode.com/svn/code/maven/org/apache/airavata/group-manager/0.17-SNAPSHOT/group-manager-0.17-SNAPSHOT.pom
[INFO] Downloading: http://maven.wso2.org/nexus/content/groups/wso2-public/org/apache/airavata/group-manager/0.17-SNAPSHOT/group-manager-0.17-SNAPSHOT.pom
[WARNING] The POM for org.apache.airavata:group-manager:jar:0.17-SNAPSHOT is missing, no dependency
information available
[INFO] Downloading: http://repo1.maven.org/maven2/org/apache/axis2/wso2/axis2/1.6.1.wso2v4/axis2-1.6.1.wso2v4.pom
[INFO] Downloading: http://oauth.googlecode.com/svn/code/maven/org/apache/axis2/wso2/axis2/1.6.1.wso2v4/axis2-1.6.1.wso2v4.pom
[INFO] Downloading: http://maven.wso2.org/nexus/content/groups/wso2-public/org/apache/axis2/wso2/axis2/1.6.1.wso2v4/axis2-1.6.1.wso2v4.pom
[INFO] Downloaded: http://maven.wso2.org/nexus/content/groups/wso2-public/org/apache/axis2/wso2/axis2/1.6.1.wso2v4/axis2-1.6.1.wso2v4.pom
(21 KB at 31.1 KB/sec)
[INFO] Downloading: http://repo1.maven.org/maven2/org/wso2/carbon/org.wso2.carbon.identity.entitlement.stub/4.2.1/org.wso2.carbon.identity.entitlement.stub-4.2.1.pom
[INFO] Downloading: http://oauth.googlecode.com/svn/code/maven/org/wso2/carbon/org.wso2.carbon.identity.entitlement.stub/4.2.1/org.wso2.carbon.identity.entitlement.stub-4.2.1.pom
[INFO] Downloading: http://maven.wso2.org/nexus/content/groups/wso2-public/org/wso2/carbon/org.wso2.carbon.identity.entitlement.stub/4.2.1/org.wso2.carbon.identity.entitlement.stub-4.2.1.pom
[INFO] Downloaded: http://maven.wso2.org/nexus/content/groups/wso2-public/org/wso2/carbon/org.wso2.carbon.identity.entitlement.stub/4.2.1/org.wso2.carbon.identity.entitlement.stub-4.2.1.pom
(7 KB at 14.2 KB/sec)
[INFO] Downloading: http://repo1.maven.org/maven2/org/eclipse/osgi/org.eclipse.osgi.services/3.3.0.v20110513/org.eclipse.osgi.services-3.3.0.v20110513.pom
[INFO] Downloading: http://oauth.googlecode.com/svn/code/maven/org/eclipse/osgi/org.eclipse.osgi.services/3.3.0.v20110513/org.eclipse.osgi.services-3.3.0.v20110513.pom
[INFO] Downloading: http://maven.wso2.org/nexus/content/groups/wso2-public/org/eclipse/osgi/org.eclipse.osgi.services/3.3.0.v20110513/org.eclipse.osgi.services-3.3.0.v20110513.pom
[INFO] Downloaded: http://maven.wso2.org/nexus/content/groups/wso2-public/org/eclipse/osgi/org.eclipse.osgi.services/3.3.0.v20110513/org.eclipse.osgi.services-3.3.0.v20110513.pom
(0 B at 0.0 KB/sec)
[INFO] Downloading: http://repo1.maven.org/maven2/org/eclipse/osgi/org.eclipse.osgi/3.7.1.R37x_v20110808-1106/org.eclipse.osgi-3.7.1.R37x_v20110808-1106.pom
[INFO] Downloading: http://oauth.googlecode.com/svn/code/maven/org/eclipse/osgi/org.eclipse.osgi/3.7.1.R37x_v20110808-1106/org.eclipse.osgi-3.7.1.R37x_v20110808-1106.pom
[INFO] Downloading: http://maven.wso2.org/nexus/content/groups/wso2-public/org/eclipse/osgi/org.eclipse.osgi/3.7.1.R37x_v20110808-1106/org.eclipse.osgi-3.7.1.R37x_v20110808-1106.pom
[INFO] Downloaded: http://maven.wso2.org/nexus/content/groups/wso2-public/org/eclipse/osgi/org.eclipse.osgi/3.7.1.R37x_v20110808-1106/org.eclipse.osgi-3.7.1.R37x_v20110808-1106.pom
(0 B at 0.0 KB/sec)
[INFO] Downloading: http://repo1.maven.org/maven2/org/apache/axis2/wso2/axis2/1.6.1.wso2v5/axis2-1.6.1.wso2v5.pom
[INFO] Downloading: http://oauth.googlecode.com/svn/code/maven/org/apache/axis2/wso2/axis2/1.6.1.wso2v5/axis2-1.6.1.wso2v5.pom
[INFO] Downloading: http://maven.wso2.org/nexus/content/groups/wso2-public/org/apache/axis2/wso2/axis2/1.6.1.wso2v5/axis2-1.6.1.wso2v5.pom
[INFO] Downloaded: http://maven.wso2.org/nexus/content/groups/wso2-public/org/apache/axis2/wso2/axis2/1.6.1.wso2v5/axis2-1.6.1.wso2v5.pom
(21 KB at 31.3 KB/sec)
[INFO] Downloading: http://repo1.maven.org/maven2/org/apache/oltu/oauth2/org.apache.oltu.oauth2.client/1.0.0/org.apache.oltu.oauth2.client-1.0.0.pom
[INFO] Downloaded: http://repo1.maven.org/maven2/org/apache/oltu/oauth2/org.apache.oltu.oauth2.client/1.0.0/org.apache.oltu.oauth2.client-1.0.0.pom
(3 KB at 197.6 KB/sec)
[INFO] Downloading: http://repo1.maven.org/maven2/org/apache/oltu/oauth2/org.apache.oltu.oauth2.parent/1.0.0/org.apache.oltu.oauth2.parent-1.0.0.pom
[INFO] Downloaded: http://repo1.maven.org/maven2/org/apache/oltu/oauth2/org.apache.oltu.oauth2.parent/1.0.0/org.apache.oltu.oauth2.parent-1.0.0.pom
(5 KB at 245.8 KB/sec)
[INFO] Downloading: http://repo1.maven.org/maven2/org/apache/oltu/org.apache.oltu.parent/2/org.apache.oltu.parent-2.pom
[INFO] Downloaded: http://repo1.maven.org/maven2/org/apache/oltu/org.apache.oltu.parent/2/org.apache.oltu.parent-2.pom
(32 KB at 2101.1 KB/sec)
[INFO] Downloading: http://repo1.maven.org/maven2/org/apache/oltu/oauth2/org.apache.oltu.oauth2.common/1.0.0/org.apache.oltu.oauth2.common-1.0.0.pom
[INFO] Downloaded: http://repo1.maven.org/maven2/org/apache/oltu/oauth2/org.apache.oltu.oauth2.common/1.0.0/org.apache.oltu.oauth2.common-1.0.0.pom
(3 KB at 208.2 KB/sec)
[INFO] Downloading: http://repo1.maven.org/maven2/org/json/json/20131018/json-20131018.pom
[INFO] Downloaded: http://repo1.maven.org/maven2/org/json/json/20131018/json-20131018.pom
(5 KB at 116.9 KB/sec)
[INFO] Downloading: http://repository.apache.org/snapshots/org/apache/airavata/group-manager/0.17-SNAPSHOT/group-manager-0.17-SNAPSHOT.jar
[INFO] Downloading: http://oauth.googlecode.com/svn/code/maven/org/apache/airavata/group-manager/0.17-SNAPSHOT/group-manager-0.17-SNAPSHOT.jar
[INFO] Downloading: http://maven.wso2.org/nexus/content/groups/wso2-public/org/apache/airavata/group-manager/0.17-SNAPSHOT/group-manager-0.17-SNAPSHOT.jar
[INFO] Downloading: http://repo1.maven.org/maven2/org/apache/axis2/wso2/axis2/1.6.1.wso2v4/axis2-1.6.1.wso2v4.jar
[INFO] Downloading: http://repo1.maven.org/maven2/org/wso2/carbon/org.wso2.carbon.identity.entitlement.stub/4.2.1/org.wso2.carbon.identity.entitlement.stub-4.2.1.jar
[INFO] Downloading: http://repo1.maven.org/maven2/org/apache/oltu/oauth2/org.apache.oltu.oauth2.common/1.0.0/org.apache.oltu.oauth2.common-1.0.0.jar
[INFO] Downloading: http://repo1.maven.org/maven2/org/apache/oltu/oauth2/org.apache.oltu.oauth2.client/1.0.0/org.apache.oltu.oauth2.client-1.0.0.jar
[INFO] Downloading: http://repo1.maven.org/maven2/org/json/json/20131018/json-20131018.jar
[INFO] Downloaded: http://repo1.maven.org/maven2/org/apache/oltu/oauth2/org.apache.oltu.oauth2.client/1.0.0/org.apache.oltu.oauth2.client-1.0.0.jar
(31 KB at 661.5 KB/sec)
[INFO] Downloaded: http://repo1.maven.org/maven2/org/apache/oltu/oauth2/org.apache.oltu.oauth2.common/1.0.0/org.apache.oltu.oauth2.common-1.0.0.jar
(52 KB at 946.1 KB/sec)
[INFO] Downloaded: http://repo1.maven.org/maven2/org/json/json/20131018/json-20131018.jar
(64 KB at 1247.3 KB/sec)
[INFO] Downloading: http://oauth.googlecode.com/svn/code/maven/org/apache/axis2/wso2/axis2/1.6.1.wso2v4/axis2-1.6.1.wso2v4.jar
[INFO] Downloading: http://oauth.googlecode.com/svn/code/maven/org/wso2/carbon/org.wso2.carbon.identity.entitlement.stub/4.2.1/org.wso2.carbon.identity.entitlement.stub-4.2.1.jar
[INFO] Downloading: http://maven.wso2.org/nexus/content/groups/wso2-public/org/apache/axis2/wso2/axis2/1.6.1.wso2v4/axis2-1.6.1.wso2v4.jar
[INFO] Downloading: http://maven.wso2.org/nexus/content/groups/wso2-public/org/wso2/carbon/org.wso2.carbon.identity.entitlement.stub/4.2.1/org.wso2.carbon.identity.entitlement.stub-4.2.1.jar
[INFO] Downloaded: http://maven.wso2.org/nexus/content/groups/wso2-public/org/wso2/carbon/org.wso2.carbon.identity.entitlement.stub/4.2.1/org.wso2.carbon.identity.entitlement.stub-4.2.1.jar
(723 KB at 372.4 KB/sec)
[INFO] Downloaded: http://maven.wso2.org/nexus/content/groups/wso2-public/org/apache/axis2/wso2/axis2/1.6.1.wso2v4/axis2-1.6.1.wso2v4.jar
(8421 KB at 2334.4 KB/sec)
[INFO] ------------------------------------------------------------------------
[INFO] Reactor Summary:
[INFO] 
[INFO] Airavata ........................................... SUCCESS [  4.430 s]
[INFO] Airavata Configuration ............................. SUCCESS [  0.761 s]
[INFO] Airavata Server Configuration ...................... SUCCESS [  2.522 s]
[INFO] Airavata Client Configuration ...................... SUCCESS [  1.396 s]
[INFO] Airavata API ....................................... SUCCESS [  0.706 s]
[INFO] Airavata Data Models ............................... SUCCESS [  8.440 s]
[INFO] Airavata Generated Stubs Skeltons .................. SUCCESS [ 12.486 s]
[INFO] Airavata Model Utilities ........................... SUCCESS [  1.648 s]
[INFO] Airavata Commons ................................... SUCCESS [ 31.521 s]
[INFO] Airavata Credential Store .......................... SUCCESS [  0.762 s]
[INFO] Credential Store CPI Stubs ......................... SUCCESS [  2.449 s]
[INFO] Airavata Registry .................................. SUCCESS [  0.753 s]
[INFO] registry-server .................................... SUCCESS [  0.693 s]
[INFO] registry-api-stubs ................................. SUCCESS [  7.144 s]
[INFO] Airavata Orchestrator .............................. SUCCESS [  0.773 s]
[INFO] Airavata Orchestrator Client SDK ................... SUCCESS [  2.450 s]
[INFO] Airavata Messaging Framework ....................... SUCCESS [  0.935 s]
[INFO] Airavata Messaging Framework Core .................. SUCCESS [  2.598 s]
[INFO] Airavata Security Implementation ................... SUCCESS [  7.977 s]
[INFO] Airavata API Server ................................ FAILURE [  9.510 s]
[INFO] Airavata Client SDKS ............................... SKIPPED
[INFO] Airavata Client Samples ............................ SKIPPED
[INFO] Apache Airavata PHP SDK ............................ SKIPPED
[INFO] Airavata Client CPP SDK ............................ SKIPPED
[INFO] Airavata Client Python SDK ......................... SKIPPED
[INFO] Airavata Messaging Client .......................... SKIPPED
[INFO] Airavata Registry CPI .............................. SKIPPED
[INFO] Airavata Credential Store .......................... SKIPPED
[INFO] Airavata Registry Core ............................. SKIPPED
[INFO] Airavata GFac ...................................... SKIPPED
[INFO] Airavata Gfac Client SDK ........................... SKIPPED
[INFO] Airavata GFac Core ................................. SKIPPED
[INFO] Airavata GFac Implementation ....................... SKIPPED
[INFO] Airavata Gfac Service .............................. SKIPPED
[INFO] airavata-gfac-application-specific-handlers ........ SKIPPED
[INFO] Airavata Registry Tools ............................ SKIPPED
[INFO] JPA Class Data Generator ........................... SKIPPED
[INFO] registry-tool ...................................... SKIPPED
[INFO] registry-api-service ............................... SKIPPED
[INFO] Airavata Orchestrator Core ......................... SKIPPED
[INFO] Airavata Orchestrator Service ...................... SKIPPED
[INFO] Airavata Monitoring ................................ SKIPPED
[INFO] user-profile ....................................... SKIPPED
[INFO] user-profile-cpi ................................... SKIPPED
[INFO] user-profile-core .................................. SKIPPED
[INFO] Airavata Standalone Server ......................... SKIPPED
[INFO] Airavata Workflow .................................. SKIPPED
[INFO] Airavata Workflow Core ............................. SKIPPED
[INFO] Airavata Test Suite ................................ SKIPPED
[INFO] Multi-tenanted Airavata ............................ SKIPPED
[INFO] ------------------------------------------------------------------------
[INFO] BUILD FAILURE
[INFO] ------------------------------------------------------------------------
[INFO] Total time: 02:22 min
[INFO] Finished at: 2016-08-23T17:29:24+00:00
[INFO] Final Memory: 66M/887M
[INFO] ------------------------------------------------------------------------
[ERROR] Failed to execute goal on project airavata-api-server: Could not resolve dependencies
for project org.apache.airavata:airavata-api-server:jar:0.17-SNAPSHOT: Could not find artifact
org.apache.airavata:group-manager:jar:0.17-SNAPSHOT in Nexus (http://repository.apache.org/snapshots)
-> [Help 1]
[ERROR] 
[ERROR] To see the full stack trace of the errors, re-run Maven with the -e switch.
[ERROR] Re-run Maven using the -X switch to enable full debug logging.
[ERROR] 
[ERROR] For more information about the errors and possible solutions, please read the following
articles:
[ERROR] [Help 1] http://cwiki.apache.org/confluence/display/MAVEN/DependencyResolutionException
[ERROR] 
[ERROR] After correcting the problems, you can resume the build with the command
[ERROR]   mvn <goals> -rf :airavata-api-server
[JENKINS] Archiving <https://builds.apache.org/job/airavata-dev/ws/modules/gfac/gfac-impl/pom.xml>
to org.apache.airavata/airavata-gfac-impl/0.17-SNAPSHOT/airavata-gfac-impl-0.17-SNAPSHOT.pom
[JENKINS] Archiving <https://builds.apache.org/job/airavata-dev/ws/modules/gfac/gfac-core/pom.xml>
to org.apache.airavata/airavata-gfac-core/0.17-SNAPSHOT/airavata-gfac-core-0.17-SNAPSHOT.pom
[JENKINS] Archiving <https://builds.apache.org/job/airavata-dev/ws/modules/registry/registry-server/registry-api-stubs/pom.xml>
to org.apache.airavata/registry-api-stubs/0.17-SNAPSHOT/registry-api-stubs-0.17-SNAPSHOT.pom
[JENKINS] Archiving <https://builds.apache.org/job/airavata-dev/ws/modules/registry/registry-server/registry-api-stubs/target/registry-api-stubs-0.17-SNAPSHOT.jar>
to org.apache.airavata/registry-api-stubs/0.17-SNAPSHOT/registry-api-stubs-0.17-SNAPSHOT.jar
[JENKINS] Archiving <https://builds.apache.org/job/airavata-dev/ws/airavata-api/airavata-client-sdks/airavata-cpp-sdk/pom.xml>
to org.apache.airavata/apache-airavata-client-cpp-sdk/0.17-SNAPSHOT/apache-airavata-client-cpp-sdk-0.17-SNAPSHOT.pom
[JENKINS] Archiving <https://builds.apache.org/job/airavata-dev/ws/modules/registry/registry-tools/jpa-gen/pom.xml>
to org.apache.airavata/jpa-gen/0.17-SNAPSHOT/jpa-gen-0.17-SNAPSHOT.pom
[JENKINS] Archiving <https://builds.apache.org/job/airavata-dev/ws/modules/monitoring/pom.xml>
to org.apache.airavata/airavata-monitoring/0.17-SNAPSHOT/airavata-monitoring-0.17-SNAPSHOT.pom
[JENKINS] Archiving <https://builds.apache.org/job/airavata-dev/ws/modules/test-suite/multi-tenanted-airavata/pom.xml>
to org.apache.airavata/multi-tenanted-airavata/0.17-SNAPSHOT/multi-tenanted-airavata-0.17-SNAPSHOT.pom
[JENKINS] Archiving <https://builds.apache.org/job/airavata-dev/ws/modules/gfac/pom.xml>
to org.apache.airavata/airavata-gfac/0.17-SNAPSHOT/airavata-gfac-0.17-SNAPSHOT.pom
[JENKINS] Archiving <https://builds.apache.org/job/airavata-dev/ws/modules/orchestrator/orchestrator-service/pom.xml>
to org.apache.airavata/airavata-orchestrator-service/0.17-SNAPSHOT/airavata-orchestrator-service-0.17-SNAPSHOT.pom
[JENKINS] Archiving <https://builds.apache.org/job/airavata-dev/ws/pom.xml> to org.apache.airavata/airavata/0.17-SNAPSHOT/airavata-0.17-SNAPSHOT.pom
No artifacts from airavata-dev » Airavata #3 to compare, so performing full copy of artifacts
[JENKINS] Archiving <https://builds.apache.org/job/airavata-dev/ws/modules/registry/registry-server/pom.xml>
to org.apache.airavata/registry-server/0.17-SNAPSHOT/registry-server-0.17-SNAPSHOT.pom
[JENKINS] Archiving <https://builds.apache.org/job/airavata-dev/ws/modules/registry/pom.xml>
to org.apache.airavata/registry/0.17-SNAPSHOT/registry-0.17-SNAPSHOT.pom
[JENKINS] Archiving <https://builds.apache.org/job/airavata-dev/ws/airavata-api/pom.xml>
to org.apache.airavata/airavata-api/0.17-SNAPSHOT/airavata-api-0.17-SNAPSHOT.pom
No artifacts from airavata-dev » Airavata API #3 to compare, so performing full copy of artifacts
[JENKINS] Archiving <https://builds.apache.org/job/airavata-dev/ws/modules/messaging/client/pom.xml>
to org.apache.airavata/airavata-messaging-client/0.17-SNAPSHOT/airavata-messaging-client-0.17-SNAPSHOT.pom
[JENKINS] Archiving <https://builds.apache.org/job/airavata-dev/ws/airavata-api/airavata-model-utils/pom.xml>
to org.apache.airavata/airavata-model-utils/0.17-SNAPSHOT/airavata-model-utils-0.17-SNAPSHOT.pom
[JENKINS] Archiving <https://builds.apache.org/job/airavata-dev/ws/airavata-api/airavata-model-utils/target/airavata-model-utils-0.17-SNAPSHOT.jar>
to org.apache.airavata/airavata-model-utils/0.17-SNAPSHOT/airavata-model-utils-0.17-SNAPSHOT.jar
No artifacts from airavata-dev » Airavata Model Utilities #3 to compare, so performing full
copy of artifacts
[JENKINS] Archiving <https://builds.apache.org/job/airavata-dev/ws/airavata-api/airavata-client-sdks/java-client-samples/pom.xml>
to org.apache.airavata/airavata-client-samples/0.17-SNAPSHOT/airavata-client-samples-0.17-SNAPSHOT.pom
[JENKINS] Archiving <https://builds.apache.org/job/airavata-dev/ws/modules/registry/registry-tools/pom.xml>
to org.apache.airavata/airavata-registry-tools/0.17-SNAPSHOT/airavata-registry-tools-0.17-SNAPSHOT.pom
[JENKINS] Archiving <https://builds.apache.org/job/airavata-dev/ws/airavata-api/airavata-api-server/pom.xml>
to org.apache.airavata/airavata-api-server/0.17-SNAPSHOT/airavata-api-server-0.17-SNAPSHOT.pom
[JENKINS] Archiving <https://builds.apache.org/job/airavata-dev/ws/modules/orchestrator/orchestrator-core/pom.xml>
to org.apache.airavata/airavata-orchestrator-core/0.17-SNAPSHOT/airavata-orchestrator-core-0.17-SNAPSHOT.pom
[JENKINS] Archiving <https://builds.apache.org/job/airavata-dev/ws/modules/messaging/core/pom.xml>
to org.apache.airavata/airavata-messaging-core/0.17-SNAPSHOT/airavata-messaging-core-0.17-SNAPSHOT.pom
[JENKINS] Archiving <https://builds.apache.org/job/airavata-dev/ws/modules/messaging/core/target/airavata-messaging-core-0.17-SNAPSHOT.jar>
to org.apache.airavata/airavata-messaging-core/0.17-SNAPSHOT/airavata-messaging-core-0.17-SNAPSHOT.jar
[JENKINS] Archiving <https://builds.apache.org/job/airavata-dev/ws/modules/gfac/gfac-application-specific-handlers/pom.xml>
to org.apache.airavata/airavata-gfac-application-specific-handlers/0.17-SNAPSHOT/airavata-gfac-application-specific-handlers-0.17-SNAPSHOT.pom
[JENKINS] Archiving <https://builds.apache.org/job/airavata-dev/ws/airavata-api/airavata-client-sdks/airavata-python-sdk/pom.xml>
to org.apache.airavata/apache-airavata-client-python-sdk/0.17-SNAPSHOT/apache-airavata-client-python-sdk-0.17-SNAPSHOT.pom
[JENKINS] Archiving <https://builds.apache.org/job/airavata-dev/ws/airavata-api/airavata-api-stubs/pom.xml>
to org.apache.airavata/airavata-api-stubs/0.17-SNAPSHOT/airavata-api-stubs-0.17-SNAPSHOT.pom
[JENKINS] Archiving <https://builds.apache.org/job/airavata-dev/ws/airavata-api/airavata-api-stubs/target/airavata-api-stubs-0.17-SNAPSHOT.jar>
to org.apache.airavata/airavata-api-stubs/0.17-SNAPSHOT/airavata-api-stubs-0.17-SNAPSHOT.jar
No artifacts from airavata-dev » Airavata Generated Stubs Skeltons #3 to compare, so performing
full copy of artifacts
[JENKINS] Archiving <https://builds.apache.org/job/airavata-dev/ws/modules/credential-store/credential-store-stubs/pom.xml>
to org.apache.airavata/airavata-credential-store-stubs/0.17-SNAPSHOT/airavata-credential-store-stubs-0.17-SNAPSHOT.pom
[JENKINS] Archiving <https://builds.apache.org/job/airavata-dev/ws/modules/credential-store/credential-store-stubs/target/airavata-credential-store-stubs-0.17-SNAPSHOT.jar>
to org.apache.airavata/airavata-credential-store-stubs/0.17-SNAPSHOT/airavata-credential-store-stubs-0.17-SNAPSHOT.jar
[JENKINS] Archiving <https://builds.apache.org/job/airavata-dev/ws/airavata-api/airavata-client-sdks/airavata-php-sdk/pom.xml>
to org.apache.airavata/apache-airavata-client-php-sdk/0.17-SNAPSHOT/apache-airavata-client-php-sdk-0.17-SNAPSHOT.pom
[JENKINS] Archiving <https://builds.apache.org/job/airavata-dev/ws/modules/workflow/workflow-core/pom.xml>
to org.apache.airavata/airavata-workflow-core/0.17-SNAPSHOT/airavata-workflow-core-0.17-SNAPSHOT.pom
[JENKINS] Archiving <https://builds.apache.org/job/airavata-dev/ws/modules/registry/registry-cpi/pom.xml>
to org.apache.airavata/airavata-registry-cpi/0.17-SNAPSHOT/airavata-registry-cpi-0.17-SNAPSHOT.pom
[JENKINS] Archiving <https://builds.apache.org/job/airavata-dev/ws/modules/configuration/pom.xml>
to org.apache.airavata/airavata-configuration/0.17-SNAPSHOT/airavata-configuration-0.17-SNAPSHOT.pom
No artifacts from airavata-dev » Airavata Configuration #3 to compare, so performing full
copy of artifacts
[JENKINS] Archiving <https://builds.apache.org/job/airavata-dev/ws/modules/commons/pom.xml>
to org.apache.airavata/airavata-commons/0.17-SNAPSHOT/airavata-commons-0.17-SNAPSHOT.pom
[JENKINS] Archiving <https://builds.apache.org/job/airavata-dev/ws/modules/commons/target/airavata-commons-0.17-SNAPSHOT.jar>
to org.apache.airavata/airavata-commons/0.17-SNAPSHOT/airavata-commons-0.17-SNAPSHOT.jar
[JENKINS] Archiving <https://builds.apache.org/job/airavata-dev/ws/modules/credential-store/credential-store-service/pom.xml>
to org.apache.airavata/airavata-credential-store/0.17-SNAPSHOT/airavata-credential-store-0.17-SNAPSHOT.pom
[JENKINS] Archiving <https://builds.apache.org/job/airavata-dev/ws/modules/registry/registry-core/pom.xml>
to org.apache.airavata/airavata-registry-core/0.17-SNAPSHOT/airavata-registry-core-0.17-SNAPSHOT.pom
[JENKINS] Archiving <https://builds.apache.org/job/airavata-dev/ws/modules/credential-store/pom.xml>
to org.apache.airavata/credential-store/0.17-SNAPSHOT/credential-store-0.17-SNAPSHOT.pom
[JENKINS] Archiving <https://builds.apache.org/job/airavata-dev/ws/modules/user-profile/pom.xml>
to org.apache.airavata/user-profile/0.17-SNAPSHOT/user-profile-0.17-SNAPSHOT.pom
[JENKINS] Archiving <https://builds.apache.org/job/airavata-dev/ws/modules/registry/registry-server/registry-api-service/pom.xml>
to org.apache.airavata/registry-api-service/0.17-SNAPSHOT/registry-api-service-0.17-SNAPSHOT.pom
[JENKINS] Archiving <https://builds.apache.org/job/airavata-dev/ws/modules/messaging/pom.xml>
to org.apache.airavata/messaging/0.17-SNAPSHOT/messaging-0.17-SNAPSHOT.pom
[JENKINS] Archiving <https://builds.apache.org/job/airavata-dev/ws/modules/registry/registry-tools/registry-tool/pom.xml>
to org.apache.airavata/registry-tool/0.17-SNAPSHOT/registry-tool-0.17-SNAPSHOT.pom
[JENKINS] Archiving <https://builds.apache.org/job/airavata-dev/ws/modules/gfac/gfac-client/pom.xml>
to org.apache.airavata/airavata-gfac-client/0.17-SNAPSHOT/airavata-gfac-client-0.17-SNAPSHOT.pom
[JENKINS] Archiving <https://builds.apache.org/job/airavata-dev/ws/modules/user-profile/user-profile-core/pom.xml>
to org.apache.airavata/user-profile-core/0.17-SNAPSHOT/user-profile-core-0.17-SNAPSHOT.pom
[JENKINS] Archiving <https://builds.apache.org/job/airavata-dev/ws/modules/configuration/server/pom.xml>
to org.apache.airavata/airavata-server-configuration/0.17-SNAPSHOT/airavata-server-configuration-0.17-SNAPSHOT.pom
[JENKINS] Archiving <https://builds.apache.org/job/airavata-dev/ws/modules/configuration/server/target/airavata-server-configuration-0.17-SNAPSHOT.jar>
to org.apache.airavata/airavata-server-configuration/0.17-SNAPSHOT/airavata-server-configuration-0.17-SNAPSHOT.jar
No artifacts from airavata-dev » Airavata Server Configuration #3 to compare, so performing
full copy of artifacts
[JENKINS] Archiving <https://builds.apache.org/job/airavata-dev/ws/modules/workflow/pom.xml>
to org.apache.airavata/workflow/0.17-SNAPSHOT/workflow-0.17-SNAPSHOT.pom
[JENKINS] Archiving <https://builds.apache.org/job/airavata-dev/ws/modules/configuration/client/pom.xml>
to org.apache.airavata/airavata-client-configuration/0.17-SNAPSHOT/airavata-client-configuration-0.17-SNAPSHOT.pom
[JENKINS] Archiving <https://builds.apache.org/job/airavata-dev/ws/modules/configuration/client/target/airavata-client-configuration-0.17-SNAPSHOT.jar>
to org.apache.airavata/airavata-client-configuration/0.17-SNAPSHOT/airavata-client-configuration-0.17-SNAPSHOT.jar
No artifacts from airavata-dev » Airavata Client Configuration #3 to compare, so performing
full copy of artifacts
[JENKINS] Archiving <https://builds.apache.org/job/airavata-dev/ws/modules/orchestrator/orchestrator-client/pom.xml>
to org.apache.airavata/airavata-orchestrator-client/0.17-SNAPSHOT/airavata-orchestrator-client-0.17-SNAPSHOT.pom
[JENKINS] Archiving <https://builds.apache.org/job/airavata-dev/ws/modules/orchestrator/orchestrator-client/target/airavata-orchestrator-client-0.17-SNAPSHOT.jar>
to org.apache.airavata/airavata-orchestrator-client/0.17-SNAPSHOT/airavata-orchestrator-client-0.17-SNAPSHOT.jar
[JENKINS] Archiving <https://builds.apache.org/job/airavata-dev/ws/modules/security/pom.xml>
to org.apache.airavata/airavata-security/0.17-SNAPSHOT/airavata-security-0.17-SNAPSHOT.pom
[JENKINS] Archiving <https://builds.apache.org/job/airavata-dev/ws/modules/security/target/airavata-security-0.17-SNAPSHOT.jar>
to org.apache.airavata/airavata-security/0.17-SNAPSHOT/airavata-security-0.17-SNAPSHOT.jar
[JENKINS] Archiving <https://builds.apache.org/job/airavata-dev/ws/airavata-api/airavata-data-models/pom.xml>
to org.apache.airavata/airavata-data-models/0.17-SNAPSHOT/airavata-data-models-0.17-SNAPSHOT.pom
[JENKINS] Archiving <https://builds.apache.org/job/airavata-dev/ws/airavata-api/airavata-data-models/target/airavata-data-models-0.17-SNAPSHOT.jar>
to org.apache.airavata/airavata-data-models/0.17-SNAPSHOT/airavata-data-models-0.17-SNAPSHOT.jar
No artifacts from airavata-dev » Airavata Data Models #3 to compare, so performing full copy
of artifacts
[JENKINS] Archiving <https://builds.apache.org/job/airavata-dev/ws/modules/orchestrator/pom.xml>
to org.apache.airavata/orchestrator/0.17-SNAPSHOT/orchestrator-0.17-SNAPSHOT.pom
[JENKINS] Archiving <https://builds.apache.org/job/airavata-dev/ws/modules/server/pom.xml>
to org.apache.airavata/airavata-standalone-server/0.17-SNAPSHOT/airavata-standalone-server-0.17-SNAPSHOT.pom
[JENKINS] Archiving <https://builds.apache.org/job/airavata-dev/ws/airavata-api/airavata-client-sdks/pom.xml>
to org.apache.airavata/airavata-client-sdks/0.17-SNAPSHOT/airavata-client-sdks-0.17-SNAPSHOT.pom
[JENKINS] Archiving <https://builds.apache.org/job/airavata-dev/ws/modules/user-profile/user-profile-cpi/pom.xml>
to org.apache.airavata/user-profile-cpi/0.17-SNAPSHOT/user-profile-cpi-0.17-SNAPSHOT.pom
[JENKINS] Archiving <https://builds.apache.org/job/airavata-dev/ws/modules/test-suite/pom.xml>
to org.apache.airavata/airavata-test-suite/0.17-SNAPSHOT/airavata-test-suite-0.17-SNAPSHOT.pom
[JENKINS] Archiving <https://builds.apache.org/job/airavata-dev/ws/modules/gfac/gfac-service/pom.xml>
to org.apache.airavata/airavata-gfac-service/0.17-SNAPSHOT/airavata-gfac-service-0.17-SNAPSHOT.pom
Sending e-mails to: dev@airavata.apache.org
channel stopped

Mime
View raw message