airavata-dev mailing list archives

Site index · List index
Message view « Date » · « Thread »
Top « Date » · « Thread »
From Apache Jenkins Server <jenk...@builds.apache.org>
Subject Build failed in Jenkins: Airavata » Airavata Generated Stubs Skeltons #1382
Date Sun, 31 May 2015 22:30:17 GMT
See <https://builds.apache.org/job/Airavata/org.apache.airavata$airavata-api-stubs/1382/>

------------------------------------------
[INFO]                                                                         
[INFO] ------------------------------------------------------------------------
[INFO] Building Airavata Generated Stubs Skeltons 0.16-SNAPSHOT
[INFO] ------------------------------------------------------------------------
[INFO] 
[INFO] --- maven-clean-plugin:2.5:clean (default-clean) @ airavata-api-stubs ---
[INFO] Deleting <https://builds.apache.org/job/Airavata/org.apache.airavata$airavata-api-stubs/ws/target>
[INFO] 
[INFO] --- maven-resources-plugin:2.5:copy-resources (copy-resources) @ airavata-api-stubs
---
[debug] execute contextualize
[INFO] Using 'UTF-8' encoding to copy filtered resources.
[INFO] skip non existing resourceDirectory <https://builds.apache.org/job/Airavata/org.apache.airavata$airavata-api-stubs/ws/src/main/assembly/dist>
[INFO] 
[INFO] --- maven-remote-resources-plugin:1.5:process (default) @ airavata-api-stubs ---
[INFO] 
[INFO] --- maven-resources-plugin:2.5:resources (default-resources) @ airavata-api-stubs ---
[debug] execute contextualize
[INFO] Using 'UTF-8' encoding to copy filtered resources.
[INFO] skip non existing resourceDirectory <https://builds.apache.org/job/Airavata/org.apache.airavata$airavata-api-stubs/ws/src/main/resources>
[INFO] Copying 3 resources
[INFO] 
[INFO] --- maven-compiler-plugin:3.1:compile (default-compile) @ airavata-api-stubs ---
[INFO] Changes detected - recompiling the module!
[INFO] Compiling 3 source files to <https://builds.apache.org/job/Airavata/org.apache.airavata$airavata-api-stubs/ws/target/classes>
[INFO] -------------------------------------------------------------
[WARNING] COMPILATION WARNING : 
[INFO] -------------------------------------------------------------
[WARNING] <https://builds.apache.org/job/Airavata/org.apache.airavata$airavata-api-stubs/ws/src/main/java/org/apache/airavata/api/Airavata.java>:
<https://builds.apache.org/job/Airavata/org.apache.airavata$airavata-api-stubs/ws/src/main/java/org/apache/airavata/api/Airavata.java>
uses unchecked or unsafe operations.
[WARNING] <https://builds.apache.org/job/Airavata/org.apache.airavata$airavata-api-stubs/ws/src/main/java/org/apache/airavata/api/Airavata.java>:
Recompile with -Xlint:unchecked for details.
[INFO] 2 warnings 
[INFO] -------------------------------------------------------------
[INFO] -------------------------------------------------------------
[ERROR] COMPILATION ERROR : 
[INFO] -------------------------------------------------------------
[ERROR] <https://builds.apache.org/job/Airavata/org.apache.airavata$airavata-api-stubs/ws/src/main/java/org/apache/airavata/api/Airavata.java>:[3107,186]
cannot find symbol
  symbol:   class ExperimentSearchFields
  location: package org.apache.airavata.model.workspace.experiment
[ERROR] <https://builds.apache.org/job/Airavata/org.apache.airavata$airavata-api-stubs/ws/src/main/java/org/apache/airavata/api/Airavata.java>:[3113,125]
cannot find symbol
  symbol:   class ExperimentSearchFields
  location: package org.apache.airavata.model.workspace.experiment
[ERROR] <https://builds.apache.org/job/Airavata/org.apache.airavata$airavata-api-stubs/ws/src/main/java/org/apache/airavata/api/Airavata.java>:[482,186]
cannot find symbol
  symbol:   class ExperimentSearchFields
  location: package org.apache.airavata.model.workspace.experiment
[ERROR] <https://builds.apache.org/job/Airavata/org.apache.airavata$airavata-api-stubs/ws/src/main/java/org/apache/airavata/api/Airavata.java>:[1878,120]
cannot find symbol
  symbol:   class ExperimentSearchFields
  location: package org.apache.airavata.model.workspace.experiment
[ERROR] <https://builds.apache.org/job/Airavata/org.apache.airavata$airavata-api-stubs/ws/src/main/java/org/apache/airavata/api/Airavata.java>:[7406,120]
cannot find symbol
  symbol:   class ExperimentSearchFields
  location: package org.apache.airavata.model.workspace.experiment
[ERROR] <https://builds.apache.org/job/Airavata/org.apache.airavata$airavata-api-stubs/ws/src/main/java/org/apache/airavata/api/Airavata.java>:[7416,65]
cannot find symbol
  symbol:   class ExperimentSearchFields
  location: package org.apache.airavata.model.workspace.experiment
[ERROR] <https://builds.apache.org/job/Airavata/org.apache.airavata$airavata-api-stubs/ws/src/main/java/org/apache/airavata/api/Airavata.java>:[7419,122]
cannot find symbol
  symbol:   class ExperimentSearchFields
  location: package org.apache.airavata.model.workspace.experiment
[ERROR] <https://builds.apache.org/job/Airavata/org.apache.airavata$airavata-api-stubs/ws/src/main/java/org/apache/airavata/api/Airavata.java>:[59276,62]
cannot find symbol
  symbol:   class ExperimentSearchFields
  location: package org.apache.airavata.model.workspace.experiment
[ERROR] <https://builds.apache.org/job/Airavata/org.apache.airavata$airavata-api-stubs/ws/src/main/java/org/apache/airavata/api/Airavata.java>:[59379,57]
cannot find symbol
  symbol:   class ExperimentSearchFields
  location: package org.apache.airavata.model.workspace.experiment
[ERROR] <https://builds.apache.org/job/Airavata/org.apache.airavata$airavata-api-stubs/ws/src/main/java/org/apache/airavata/api/Airavata.java>:[59490,76]
cannot find symbol
  symbol:   class ExperimentSearchFields
  location: package org.apache.airavata.model.workspace.experiment
[ERROR] <https://builds.apache.org/job/Airavata/org.apache.airavata$airavata-api-stubs/ws/src/main/java/org/apache/airavata/api/Airavata.java>:[59497,62]
cannot find symbol
  symbol:   class ExperimentSearchFields
  location: package org.apache.airavata.model.workspace.experiment
[ERROR] <https://builds.apache.org/job/Airavata/org.apache.airavata$airavata-api-stubs/ws/src/main/java/org/apache/airavata/api/Airavata.java>:[59501,96]
cannot find symbol
  symbol:   class ExperimentSearchFields
  location: package org.apache.airavata.model.workspace.experiment
[ERROR] <https://builds.apache.org/job/Airavata/org.apache.airavata$airavata-api-stubs/ws/src/main/java/org/apache/airavata/api/Airavata.java>:[59363,145]
cannot find symbol
  symbol:   class ExperimentSearchFields
  location: package org.apache.airavata.model.workspace.experiment
[ERROR] <https://builds.apache.org/job/Airavata/org.apache.airavata$airavata-api-stubs/ws/src/main/java/org/apache/airavata/api/Airavata.java>:[59405,59]
cannot find symbol
  symbol:   class ExperimentSearchFields
  location: package org.apache.airavata.model.workspace.experiment
[ERROR] <https://builds.apache.org/job/Airavata/org.apache.airavata$airavata-api-stubs/ws/src/main/java/org/apache/airavata/api/Airavata.java>:[59405,167]
cannot find symbol
  symbol:   class ExperimentSearchFields
  location: package org.apache.airavata.model.workspace.experiment
[ERROR] <https://builds.apache.org/job/Airavata/org.apache.airavata$airavata-api-stubs/ws/src/main/java/org/apache/airavata/api/Airavata.java>:[59406,70]
cannot find symbol
  symbol:   class ExperimentSearchFields
  location: package org.apache.airavata.model.workspace.experiment
[ERROR] <https://builds.apache.org/job/Airavata/org.apache.airavata$airavata-api-stubs/ws/src/main/java/org/apache/airavata/api/Airavata.java>:[59408,57]
cannot find symbol
  symbol:   class ExperimentSearchFields
  location: package org.apache.airavata.model.workspace.experiment
[ERROR] <https://builds.apache.org/job/Airavata/org.apache.airavata$airavata-api-stubs/ws/src/main/java/org/apache/airavata/api/Airavata.java>:[59411,57]
cannot find symbol
  symbol:   class ExperimentSearchFields
  location: package org.apache.airavata.model.workspace.experiment
[ERROR] <https://builds.apache.org/job/Airavata/org.apache.airavata$airavata-api-stubs/ws/src/main/java/org/apache/airavata/api/Airavata.java>:[59492,82]
cannot find symbol
  symbol:   class ExperimentSearchFields
  location: package org.apache.airavata.model.workspace.experiment
[ERROR] <https://builds.apache.org/job/Airavata/org.apache.airavata$airavata-api-stubs/ws/src/main/java/org/apache/airavata/api/Airavata.java>:[59589,73]
cannot find symbol
  symbol:   class ExperimentSearchFields
  location: package org.apache.airavata.model.workspace.experiment
[ERROR] <https://builds.apache.org/job/Airavata/org.apache.airavata$airavata-api-stubs/ws/src/main/java/org/apache/airavata/api/Airavata.java>:[59902,94]
cannot find symbol
  symbol:   class ExperimentSearchFields
  location: package org.apache.airavata.model.workspace.experiment
[ERROR] <https://builds.apache.org/job/Airavata/org.apache.airavata$airavata-api-stubs/ws/src/main/java/org/apache/airavata/api/Airavata.java>:[59905,67]
cannot find symbol
  symbol:   class ExperimentSearchFields
  location: package org.apache.airavata.model.workspace.experiment
[ERROR] <https://builds.apache.org/job/Airavata/org.apache.airavata$airavata-api-stubs/ws/src/main/java/org/apache/airavata/api/Airavata.java>:[59907,77]
cannot find symbol
  symbol:   class ExperimentSearchFields
  location: package org.apache.airavata.model.workspace.experiment
[ERROR] <https://builds.apache.org/job/Airavata/org.apache.airavata$airavata-api-stubs/ws/src/main/java/org/apache/airavata/api/Airavata.java>:[59969,74]
cannot find symbol
  symbol:   class ExperimentSearchFields
  location: package org.apache.airavata.model.workspace.experiment
[ERROR] <https://builds.apache.org/job/Airavata/org.apache.airavata$airavata-api-stubs/ws/src/main/java/org/apache/airavata/api/Airavata.java>:[60013,74]
cannot find symbol
  symbol:   class ExperimentSearchFields
  location: package org.apache.airavata.model.workspace.experiment
[ERROR] <https://builds.apache.org/job/Airavata/org.apache.airavata$airavata-api-stubs/ws/src/main/java/org/apache/airavata/api/Airavata.java>:[60037,88]
cannot find symbol
  symbol:   class ExperimentSearchFields
  location: package org.apache.airavata.model.workspace.experiment
[ERROR] <https://builds.apache.org/job/Airavata/org.apache.airavata$airavata-api-stubs/ws/src/main/java/org/apache/airavata/api/Airavata.java>:[60040,61]
cannot find symbol
  symbol:   class ExperimentSearchFields
  location: package org.apache.airavata.model.workspace.experiment
[ERROR] <https://builds.apache.org/job/Airavata/org.apache.airavata$airavata-api-stubs/ws/src/main/java/org/apache/airavata/api/Airavata.java>:[60042,71]
cannot find symbol
  symbol:   class ExperimentSearchFields
  location: package org.apache.airavata.model.workspace.experiment
[INFO] 28 errors 
[INFO] -------------------------------------------------------------

Mime
View raw message