airavata-dev mailing list archives

Site index · List index
Message view « Date » · « Thread »
Top « Date » · « Thread »
From Apache Jenkins Server <jenk...@builds.apache.org>
Subject Build failed in Jenkins: Apache Airavata #1192
Date Thu, 01 Aug 2013 10:08:34 GMT
See <https://builds.apache.org/job/Apache%20Airavata/1192/changes>

Changes:

[samindaw] updating integration test pom to use m2 repo hosted tomcat 7.0.35 version

------------------------------------------
[...truncated 4273 lines...]
Aug 01, 2013 10:07:01 AM org.apache.maven.cli.event.ExecutionEventLogger logReactorSummary
INFO: Airavata WS Monitor ............................... SUCCESS [3.018s]
Aug 01, 2013 10:07:01 AM org.apache.maven.cli.event.ExecutionEventLogger logReactorSummary
INFO: Airavata Workflow Execution Context ............... SUCCESS [6.017s]
Aug 01, 2013 10:07:01 AM org.apache.maven.cli.event.ExecutionEventLogger logReactorSummary
INFO: Airavata Client ................................... SUCCESS [11.530s]
Aug 01, 2013 10:07:01 AM org.apache.maven.cli.event.ExecutionEventLogger logReactorSummary
INFO: Airavata Workflow Tracking ........................ SUCCESS [6.359s]
Aug 01, 2013 10:07:01 AM org.apache.maven.cli.event.ExecutionEventLogger logReactorSummary
INFO: Airavata Credential Store ......................... SUCCESS [9.865s]
Aug 01, 2013 10:07:01 AM org.apache.maven.cli.event.ExecutionEventLogger logReactorSummary
INFO: Airavata GFac Core ................................ FAILURE [1:06.584s]
Aug 01, 2013 10:07:01 AM org.apache.maven.cli.event.ExecutionEventLogger logReactorSummary
INFO: Airavata Message Box .............................. SKIPPED
Aug 01, 2013 10:07:01 AM org.apache.maven.cli.event.ExecutionEventLogger logReactorSummary
INFO: Airavata Message Broker ........................... SKIPPED
Aug 01, 2013 10:07:01 AM org.apache.maven.cli.event.ExecutionEventLogger logReactorSummary
INFO: Airavata Workflow Component ....................... SKIPPED
Aug 01, 2013 10:07:01 AM org.apache.maven.cli.event.ExecutionEventLogger logReactorSummary
INFO: Airavata Workflow Component Node .................. SKIPPED
Aug 01, 2013 10:07:01 AM org.apache.maven.cli.event.ExecutionEventLogger logReactorSummary
INFO: Airavata JPA Registry ............................. SKIPPED
Aug 01, 2013 10:07:01 AM org.apache.maven.cli.event.ExecutionEventLogger logReactorSummary
INFO: Airavata REST ..................................... SKIPPED
Aug 01, 2013 10:07:01 AM org.apache.maven.cli.event.ExecutionEventLogger logReactorSummary
INFO: airavata-rest-mappings ............................ SKIPPED
Aug 01, 2013 10:07:01 AM org.apache.maven.cli.event.ExecutionEventLogger logReactorSummary
INFO: airavata-rest-client .............................. SKIPPED
Aug 01, 2013 10:07:01 AM org.apache.maven.cli.event.ExecutionEventLogger logReactorSummary
INFO: Airavata XBaya .................................... SKIPPED
Aug 01, 2013 10:07:01 AM org.apache.maven.cli.event.ExecutionEventLogger logReactorSummary
INFO: Airavata Registry Service ......................... SKIPPED
Aug 01, 2013 10:07:01 AM org.apache.maven.cli.event.ExecutionEventLogger logReactorSummary
INFO: Airavata Registry Test ............................ SKIPPED
Aug 01, 2013 10:07:01 AM org.apache.maven.cli.event.ExecutionEventLogger logReactorSummary
INFO: Airavata Security Implementation .................. SKIPPED
Aug 01, 2013 10:07:01 AM org.apache.maven.cli.event.ExecutionEventLogger logReactorSummary
INFO: airavata-rest-services ............................ SKIPPED
Aug 01, 2013 10:07:01 AM org.apache.maven.cli.event.ExecutionEventLogger logReactorSummary
INFO: airavata-rest-service-webapp ...................... SKIPPED
Aug 01, 2013 10:07:01 AM org.apache.maven.cli.event.ExecutionEventLogger logReactorSummary
INFO: Airavata Tools .................................... SKIPPED
Aug 01, 2013 10:07:01 AM org.apache.maven.cli.event.ExecutionEventLogger logReactorSummary
INFO: Airavata Phoebus Integration ...................... SKIPPED
Aug 01, 2013 10:07:01 AM org.apache.maven.cli.event.ExecutionEventLogger logReactorSummary
INFO: registry-tool ..................................... SKIPPED
Aug 01, 2013 10:07:01 AM org.apache.maven.cli.event.ExecutionEventLogger logReactorSummary
INFO: Simple Math Service ............................... SKIPPED
Aug 01, 2013 10:07:01 AM org.apache.maven.cli.event.ExecutionEventLogger logReactorSummary
INFO: Complex Math Service .............................. SKIPPED
Aug 01, 2013 10:07:01 AM org.apache.maven.cli.event.ExecutionEventLogger logReactorSummary
INFO: Levenshtein Distance Service ...................... SKIPPED
Aug 01, 2013 10:07:01 AM org.apache.maven.cli.event.ExecutionEventLogger logReactorSummary
INFO: Airavata Embedded Tomcat Implementation ........... SKIPPED
Aug 01, 2013 10:07:01 AM org.apache.maven.cli.event.ExecutionEventLogger logReactorSummary
INFO: Airavata Test Suite ............................... SKIPPED
Aug 01, 2013 10:07:01 AM org.apache.maven.cli.event.ExecutionEventLogger logReactorSummary
INFO: distribution ...................................... SKIPPED
Aug 01, 2013 10:07:01 AM org.apache.maven.cli.event.ExecutionEventLogger logReactorSummary
INFO: Samples - Airavata Client Samples ................. SKIPPED
Aug 01, 2013 10:07:01 AM org.apache.maven.cli.event.ExecutionEventLogger logReactorSummary
INFO: Samples - Workflow Create Application ............. SKIPPED
Aug 01, 2013 10:07:01 AM org.apache.maven.cli.event.ExecutionEventLogger logReactorSummary
INFO: Samples - Workflow Execution ...................... SKIPPED
Aug 01, 2013 10:07:01 AM org.apache.maven.cli.event.ExecutionEventLogger logReactorSummary
INFO: Airavata server distribution ...................... SKIPPED
Aug 01, 2013 10:07:01 AM org.apache.maven.cli.event.ExecutionEventLogger logReactorSummary
INFO: Airavata client distribution ...................... SKIPPED
Aug 01, 2013 10:07:01 AM org.apache.maven.cli.event.ExecutionEventLogger logReactorSummary
INFO: Airavata xbaya-gui distribution ................... SKIPPED
Aug 01, 2013 10:07:01 AM org.apache.maven.cli.event.ExecutionEventLogger logReactorSummary
INFO: Airavata release artifacts ........................ SKIPPED
Aug 01, 2013 10:07:01 AM org.apache.maven.cli.event.ExecutionEventLogger logReactorSummary
INFO: Airavata Integration Tests ........................ SKIPPED
Aug 01, 2013 10:07:01 AM org.apache.maven.cli.event.ExecutionEventLogger logResult
INFO: ------------------------------------------------------------------------
Aug 01, 2013 10:07:01 AM org.apache.maven.cli.event.ExecutionEventLogger logResult
INFO: BUILD FAILURE
Aug 01, 2013 10:07:01 AM org.apache.maven.cli.event.ExecutionEventLogger logStats
INFO: ------------------------------------------------------------------------
Aug 01, 2013 10:07:01 AM org.apache.maven.cli.event.ExecutionEventLogger logStats
INFO: Total time: 2:46.759s
Aug 01, 2013 10:07:01 AM org.apache.maven.cli.event.ExecutionEventLogger logStats
INFO: Finished at: Thu Aug 01 10:07:01 UTC 2013
Aug 01, 2013 10:07:01 AM org.apache.maven.cli.event.ExecutionEventLogger logStats
INFO: Final Memory: 46M/487M
Aug 01, 2013 10:07:01 AM org.apache.maven.cli.event.ExecutionEventLogger sessionEnded
INFO: ------------------------------------------------------------------------
[JENKINS] Archiving <https://builds.apache.org/job/Apache%20Airavata/ws/modules/distribution/release/pom.xml>
to /home/hudson/hudson/jobs/Apache Airavata/modules/org.apache.airavata$apache-airavata-release-artifacts/builds/2013-08-01_10-04-03/archive/org.apache.airavata/apache-airavata-release-artifacts/0.9-SNAPSHOT/apache-airavata-release-artifacts-0.9-SNAPSHOT.pom
[JENKINS] Archiving <https://builds.apache.org/job/Apache%20Airavata/ws/modules/commons/workflow-tracking/pom.xml>
to /home/hudson/hudson/jobs/Apache Airavata/modules/org.apache.airavata$airavata-workflow-tracking/builds/2013-08-01_10-03-59/archive/org.apache.airavata/airavata-workflow-tracking/0.9-SNAPSHOT/airavata-workflow-tracking-0.9-SNAPSHOT.pom
[JENKINS] Archiving <https://builds.apache.org/job/Apache%20Airavata/ws/modules/commons/workflow-tracking/target/airavata-workflow-tracking-0.9-SNAPSHOT.jar>
to /home/hudson/hudson/jobs/Apache Airavata/modules/org.apache.airavata$airavata-workflow-tracking/builds/2013-08-01_10-03-59/archive/org.apache.airavata/airavata-workflow-tracking/0.9-SNAPSHOT/airavata-workflow-tracking-0.9-SNAPSHOT.jar
[JENKINS] Archiving <https://builds.apache.org/job/Apache%20Airavata/ws/samples/complex-math-service/pom.xml>
to /home/hudson/hudson/jobs/Apache Airavata/modules/org.apache.airavata$airavata-complex-math-service/builds/2013-08-01_10-04-02/archive/org.apache.airavata/airavata-complex-math-service/0.9-SNAPSHOT/airavata-complex-math-service-0.9-SNAPSHOT.pom
[JENKINS] Archiving <https://builds.apache.org/job/Apache%20Airavata/ws/modules/distribution/pom.xml>
to /home/hudson/hudson/jobs/Apache Airavata/modules/org.apache.airavata$distribution/builds/2013-08-01_10-04-02/archive/org.apache.airavata/distribution/0.9-SNAPSHOT/distribution-0.9-SNAPSHOT.pom
[JENKINS] Archiving <https://builds.apache.org/job/Apache%20Airavata/ws/modules/workflow-model/workflow-model-component-node/pom.xml>
to /home/hudson/hudson/jobs/Apache Airavata/modules/org.apache.airavata$airavata-workflow-model-component-node/builds/2013-08-01_10-03-59/archive/org.apache.airavata/airavata-workflow-model-component-node/0.9-SNAPSHOT/airavata-workflow-model-component-node-0.9-SNAPSHOT.pom
[JENKINS] Archiving <https://builds.apache.org/job/Apache%20Airavata/ws/samples/simple-math-service/pom.xml>
to /home/hudson/hudson/jobs/Apache Airavata/modules/org.apache.airavata$airavata-simple-math-service/builds/2013-08-01_10-04-02/archive/org.apache.airavata/airavata-simple-math-service/0.9-SNAPSHOT/airavata-simple-math-service-0.9-SNAPSHOT.pom
[JENKINS] Archiving <https://builds.apache.org/job/Apache%20Airavata/ws/modules/server/pom.xml>
to /home/hudson/hudson/jobs/Apache Airavata/modules/org.apache.airavata$airavata-embedded-tomcat/builds/2013-08-01_10-04-02/archive/org.apache.airavata/airavata-embedded-tomcat/0.9-SNAPSHOT/airavata-embedded-tomcat-0.9-SNAPSHOT.pom
[JENKINS] Archiving <https://builds.apache.org/job/Apache%20Airavata/ws/modules/registry/registry-api/pom.xml>
to /home/hudson/hudson/jobs/Apache Airavata/modules/org.apache.airavata$airavata-registry-api/builds/2013-08-01_10-04-00/archive/org.apache.airavata/airavata-registry-api/0.9-SNAPSHOT/airavata-registry-api-0.9-SNAPSHOT.pom
[JENKINS] Archiving <https://builds.apache.org/job/Apache%20Airavata/ws/modules/registry/registry-api/target/airavata-registry-api-0.9-SNAPSHOT.jar>
to /home/hudson/hudson/jobs/Apache Airavata/modules/org.apache.airavata$airavata-registry-api/builds/2013-08-01_10-04-00/archive/org.apache.airavata/airavata-registry-api/0.9-SNAPSHOT/airavata-registry-api-0.9-SNAPSHOT.jar
[JENKINS] Archiving <https://builds.apache.org/job/Apache%20Airavata/ws/modules/ws-messenger/messagebox/pom.xml>
to /home/hudson/hudson/jobs/Apache Airavata/modules/org.apache.airavata$airavata-message-box/builds/2013-08-01_10-03-58/archive/org.apache.airavata/airavata-message-box/0.9-SNAPSHOT/airavata-message-box-0.9-SNAPSHOT.pom
[JENKINS] Archiving <https://builds.apache.org/job/Apache%20Airavata/ws/modules/security/pom.xml>
to /home/hudson/hudson/jobs/Apache Airavata/modules/org.apache.airavata$airavata-security/builds/2013-08-01_10-04-00/archive/org.apache.airavata/airavata-security/0.9-SNAPSHOT/airavata-security-0.9-SNAPSHOT.pom
[JENKINS] Archiving <https://builds.apache.org/job/Apache%20Airavata/ws/tools/phoebus-integration/pom.xml>
to /home/hudson/hudson/jobs/Apache Airavata/modules/org.apache.airavata$airavata-phoebus-integration/builds/2013-08-01_10-04-01/archive/org.apache.airavata/airavata-phoebus-integration/0.9-SNAPSHOT/airavata-phoebus-integration-0.9-SNAPSHOT.pom
[JENKINS] Archiving <https://builds.apache.org/job/Apache%20Airavata/ws/modules/gfac-core/pom.xml>
to /home/hudson/hudson/jobs/Apache Airavata/modules/org.apache.airavata$airavata-gfac-core/builds/2013-08-01_10-03-58/archive/org.apache.airavata/airavata-gfac-core/0.9-SNAPSHOT/airavata-gfac-core-0.9-SNAPSHOT.pom
[JENKINS] Archiving <https://builds.apache.org/job/Apache%20Airavata/ws/modules/distribution/airavata-server/pom.xml>
to /home/hudson/hudson/jobs/Apache Airavata/modules/org.apache.airavata$apache-airavata-server/builds/2013-08-01_10-04-02/archive/org.apache.airavata/apache-airavata-server/0.9-SNAPSHOT/apache-airavata-server-0.9-SNAPSHOT.pom
[JENKINS] Archiving <https://builds.apache.org/job/Apache%20Airavata/ws/modules/registry/airavata-registry-test/pom.xml>
to /home/hudson/hudson/jobs/Apache Airavata/modules/org.apache.airavata$airavata-registry-test/builds/2013-08-01_10-04-00/archive/org.apache.airavata/airavata-registry-test/0.9-SNAPSHOT/airavata-registry-test-0.9-SNAPSHOT.pom
[JENKINS] Archiving <https://builds.apache.org/job/Apache%20Airavata/ws/modules/workflow-model/workflow-model-component/pom.xml>
to /home/hudson/hudson/jobs/Apache Airavata/modules/org.apache.airavata$airavata-workflow-model-component/builds/2013-08-01_10-03-59/archive/org.apache.airavata/airavata-workflow-model-component/0.9-SNAPSHOT/airavata-workflow-model-component-0.9-SNAPSHOT.pom
[JENKINS] Archiving <https://builds.apache.org/job/Apache%20Airavata/ws/modules/xbaya-gui/pom.xml>
to /home/hudson/hudson/jobs/Apache Airavata/modules/org.apache.airavata$airavata-xbaya-gui/builds/2013-08-01_10-03-59/archive/org.apache.airavata/airavata-xbaya-gui/0.9-SNAPSHOT/airavata-xbaya-gui-0.9-SNAPSHOT.pom
[JENKINS] Archiving <https://builds.apache.org/job/Apache%20Airavata/ws/modules/commons/workflow-execution-context/pom.xml>
to /home/hudson/hudson/jobs/Apache Airavata/modules/org.apache.airavata$airavata-workflow-execution-context/builds/2013-08-01_10-04-00/archive/org.apache.airavata/airavata-workflow-execution-context/0.9-SNAPSHOT/airavata-workflow-execution-context-0.9-SNAPSHOT.pom
[JENKINS] Archiving <https://builds.apache.org/job/Apache%20Airavata/ws/modules/commons/workflow-execution-context/target/airavata-workflow-execution-context-0.9-SNAPSHOT.jar>
to /home/hudson/hudson/jobs/Apache Airavata/modules/org.apache.airavata$airavata-workflow-execution-context/builds/2013-08-01_10-04-00/archive/org.apache.airavata/airavata-workflow-execution-context/0.9-SNAPSHOT/airavata-workflow-execution-context-0.9-SNAPSHOT.jar
[JENKINS] Archiving <https://builds.apache.org/job/Apache%20Airavata/ws/modules/integration-tests/pom.xml>
to /home/hudson/hudson/jobs/Apache Airavata/modules/org.apache.airavata$integration-tests/builds/2013-08-01_10-04-03/archive/org.apache.airavata/integration-tests/0.9-SNAPSHOT/integration-tests-0.9-SNAPSHOT.pom
[JENKINS] Archiving <https://builds.apache.org/job/Apache%20Airavata/ws/samples/airavata-client/workflow-run/pom.xml>
to /home/hudson/hudson/jobs/Apache Airavata/modules/org.apache.airavata$samples-workflow-run/builds/2013-08-01_10-04-02/archive/org.apache.airavata/samples-workflow-run/0.9-SNAPSHOT/samples-workflow-run-0.9-SNAPSHOT.pom
[JENKINS] Archiving <https://builds.apache.org/job/Apache%20Airavata/ws/modules/commons/pom.xml>
to /home/hudson/hudson/jobs/Apache Airavata/modules/org.apache.airavata$commons/builds/2013-08-01_10-03-59/archive/org.apache.airavata/commons/0.9-SNAPSHOT/commons-0.9-SNAPSHOT.pom
[JENKINS] Archiving <https://builds.apache.org/job/Apache%20Airavata/ws/modules/ws-messenger/message-monitor/pom.xml>
to /home/hudson/hudson/jobs/Apache Airavata/modules/org.apache.airavata$airavata-message-monitor/builds/2013-08-01_10-03-59/archive/org.apache.airavata/airavata-message-monitor/0.9-SNAPSHOT/airavata-message-monitor-0.9-SNAPSHOT.pom
[JENKINS] Archiving <https://builds.apache.org/job/Apache%20Airavata/ws/modules/ws-messenger/message-monitor/target/airavata-message-monitor-0.9-SNAPSHOT.jar>
to /home/hudson/hudson/jobs/Apache Airavata/modules/org.apache.airavata$airavata-message-monitor/builds/2013-08-01_10-03-59/archive/org.apache.airavata/airavata-message-monitor/0.9-SNAPSHOT/airavata-message-monitor-0.9-SNAPSHOT.jar
[JENKINS] Archiving <https://builds.apache.org/job/Apache%20Airavata/ws/modules/registry/pom.xml>
to /home/hudson/hudson/jobs/Apache Airavata/modules/org.apache.airavata$registry/builds/2013-08-01_10-04-00/archive/org.apache.airavata/registry/0.9-SNAPSHOT/registry-0.9-SNAPSHOT.pom
[JENKINS] Archiving <https://builds.apache.org/job/Apache%20Airavata/ws/tools/registry-tool/pom.xml>
to /home/hudson/hudson/jobs/Apache Airavata/modules/org.apache.airavata$registry-tool/builds/2013-08-01_10-04-01/archive/org.apache.airavata/registry-tool/0.9-SNAPSHOT/registry-tool-0.9-SNAPSHOT.pom
[JENKINS] Archiving <https://builds.apache.org/job/Apache%20Airavata/ws/tools/pom.xml>
to /home/hudson/hudson/jobs/Apache Airavata/modules/org.apache.airavata$airavata-tools-parent/builds/2013-08-01_10-04-01/archive/org.apache.airavata/airavata-tools-parent/0.9-SNAPSHOT/airavata-tools-parent-0.9-SNAPSHOT.pom
[JENKINS] Archiving <https://builds.apache.org/job/Apache%20Airavata/ws/samples/airavata-client/pom.xml>
to /home/hudson/hudson/jobs/Apache Airavata/modules/org.apache.airavata$airavata-client-sample/builds/2013-08-01_10-04-02/archive/org.apache.airavata/airavata-client-sample/0.9-SNAPSHOT/airavata-client-sample-0.9-SNAPSHOT.pom
[JENKINS] Archiving <https://builds.apache.org/job/Apache%20Airavata/ws/modules/ws-messenger/pom.xml>
to /home/hudson/hudson/jobs/Apache Airavata/modules/org.apache.airavata$airavata-ws-messenger/builds/2013-08-01_10-03-58/archive/org.apache.airavata/airavata-ws-messenger/0.9-SNAPSHOT/airavata-ws-messenger-0.9-SNAPSHOT.pom
[JENKINS] Archiving <https://builds.apache.org/job/Apache%20Airavata/ws/modules/rest/service/pom.xml>
to /home/hudson/hudson/jobs/Apache Airavata/modules/org.apache.airavata$airavata-rest-services/builds/2013-08-01_10-04-01/archive/org.apache.airavata/airavata-rest-services/0.9-SNAPSHOT/airavata-rest-services-0.9-SNAPSHOT.pom
[JENKINS] Archiving <https://builds.apache.org/job/Apache%20Airavata/ws/modules/rest/webapp/pom.xml>
to /home/hudson/hudson/jobs/Apache Airavata/modules/org.apache.airavata$airavata-rest-service-webapp/builds/2013-08-01_10-04-01/archive/org.apache.airavata/airavata-rest-service-webapp/0.9-SNAPSHOT/airavata-rest-service-webapp-0.9-SNAPSHOT.pom
[JENKINS] Archiving <https://builds.apache.org/job/Apache%20Airavata/ws/samples/airavata-client/create-application/pom.xml>
to /home/hudson/hudson/jobs/Apache Airavata/modules/org.apache.airavata$samples-create-application/builds/2013-08-01_10-04-02/archive/org.apache.airavata/samples-create-application/0.9-SNAPSHOT/samples-create-application-0.9-SNAPSHOT.pom
[JENKINS] Archiving <https://builds.apache.org/job/Apache%20Airavata/ws/modules/distribution/airavata-client/pom.xml>
to /home/hudson/hudson/jobs/Apache Airavata/modules/org.apache.airavata$apache-airavata-client/builds/2013-08-01_10-04-03/archive/org.apache.airavata/apache-airavata-client/0.9-SNAPSHOT/apache-airavata-client-0.9-SNAPSHOT.pom
[JENKINS] Archiving <https://builds.apache.org/job/Apache%20Airavata/ws/modules/registry/airavata-jpa-registry/pom.xml>
to /home/hudson/hudson/jobs/Apache Airavata/modules/org.apache.airavata$airavata-jpa-registry/builds/2013-08-01_10-04-00/archive/org.apache.airavata/airavata-jpa-registry/0.9-SNAPSHOT/airavata-jpa-registry-0.9-SNAPSHOT.pom
[JENKINS] Archiving <https://builds.apache.org/job/Apache%20Airavata/ws/modules/commons/utils/pom.xml>
to /home/hudson/hudson/jobs/Apache Airavata/modules/org.apache.airavata$airavata-common-utils/builds/2013-08-01_10-04-00/archive/org.apache.airavata/airavata-common-utils/0.9-SNAPSHOT/airavata-common-utils-0.9-SNAPSHOT.pom
[JENKINS] Archiving <https://builds.apache.org/job/Apache%20Airavata/ws/modules/commons/utils/target/airavata-common-utils-0.9-SNAPSHOT.jar>
to /home/hudson/hudson/jobs/Apache Airavata/modules/org.apache.airavata$airavata-common-utils/builds/2013-08-01_10-04-00/archive/org.apache.airavata/airavata-common-utils/0.9-SNAPSHOT/airavata-common-utils-0.9-SNAPSHOT.jar
[JENKINS] Archiving <https://builds.apache.org/job/Apache%20Airavata/ws/samples/levenshtein-distance-service/pom.xml>
to /home/hudson/hudson/jobs/Apache Airavata/modules/org.apache.airavata$airavata-levenshtein-distance-service/builds/2013-08-01_10-04-02/archive/org.apache.airavata/airavata-levenshtein-distance-service/0.9-SNAPSHOT/airavata-levenshtein-distance-service-0.9-SNAPSHOT.pom
[JENKINS] Archiving <https://builds.apache.org/job/Apache%20Airavata/ws/modules/rest/pom.xml>
to /home/hudson/hudson/jobs/Apache Airavata/modules/org.apache.airavata$rest/builds/2013-08-01_10-04-01/archive/org.apache.airavata/rest/0.9-SNAPSHOT/rest-0.9-SNAPSHOT.pom
[JENKINS] Archiving <https://builds.apache.org/job/Apache%20Airavata/ws/modules/distribution/xbaya-gui/pom.xml>
to /home/hudson/hudson/jobs/Apache Airavata/modules/org.apache.airavata$apache-airavata-xbaya-gui/builds/2013-08-01_10-04-03/archive/org.apache.airavata/apache-airavata-xbaya-gui/0.9-SNAPSHOT/apache-airavata-xbaya-gui-0.9-SNAPSHOT.pom
[JENKINS] Archiving <https://builds.apache.org/job/Apache%20Airavata/ws/modules/airavata-client/pom.xml>
to /home/hudson/hudson/jobs/Apache Airavata/modules/org.apache.airavata$airavata-client-api/builds/2013-08-01_10-04-00/archive/org.apache.airavata/airavata-client-api/0.9-SNAPSHOT/airavata-client-api-0.9-SNAPSHOT.pom
[JENKINS] Archiving <https://builds.apache.org/job/Apache%20Airavata/ws/modules/airavata-client/target/airavata-client-api-0.9-SNAPSHOT.jar>
to /home/hudson/hudson/jobs/Apache Airavata/modules/org.apache.airavata$airavata-client-api/builds/2013-08-01_10-04-00/archive/org.apache.airavata/airavata-client-api/0.9-SNAPSHOT/airavata-client-api-0.9-SNAPSHOT.jar
[JENKINS] Archiving <https://builds.apache.org/job/Apache%20Airavata/ws/modules/ws-messenger/messagebroker/pom.xml>
to /home/hudson/hudson/jobs/Apache Airavata/modules/org.apache.airavata$airavata-message-broker/builds/2013-08-01_10-03-58/archive/org.apache.airavata/airavata-message-broker/0.9-SNAPSHOT/airavata-message-broker-0.9-SNAPSHOT.pom
[JENKINS] Archiving <https://builds.apache.org/job/Apache%20Airavata/ws/modules/commons/gfac-schema/pom.xml>
to /home/hudson/hudson/jobs/Apache Airavata/modules/org.apache.airavata$airavata-gfac-schema-utils/builds/2013-08-01_10-03-59/archive/org.apache.airavata/airavata-gfac-schema-utils/0.9-SNAPSHOT/airavata-gfac-schema-utils-0.9-SNAPSHOT.pom
[JENKINS] Archiving <https://builds.apache.org/job/Apache%20Airavata/ws/modules/commons/gfac-schema/target/airavata-gfac-schema-utils-0.9-SNAPSHOT.jar>
to /home/hudson/hudson/jobs/Apache Airavata/modules/org.apache.airavata$airavata-gfac-schema-utils/builds/2013-08-01_10-03-59/archive/org.apache.airavata/airavata-gfac-schema-utils/0.9-SNAPSHOT/airavata-gfac-schema-utils-0.9-SNAPSHOT.jar
[JENKINS] Archiving <https://builds.apache.org/job/Apache%20Airavata/ws/modules/rest/mappings/pom.xml>
to /home/hudson/hudson/jobs/Apache Airavata/modules/org.apache.airavata$airavata-rest-mappings/builds/2013-08-01_10-04-01/archive/org.apache.airavata/airavata-rest-mappings/0.9-SNAPSHOT/airavata-rest-mappings-0.9-SNAPSHOT.pom
[JENKINS] Archiving <https://builds.apache.org/job/Apache%20Airavata/ws/modules/workflow-model/pom.xml>
to /home/hudson/hudson/jobs/Apache Airavata/modules/org.apache.airavata$airavata-workflow-model-parent/builds/2013-08-01_10-03-59/archive/org.apache.airavata/airavata-workflow-model-parent/0.9-SNAPSHOT/airavata-workflow-model-parent-0.9-SNAPSHOT.pom
[JENKINS] Archiving <https://builds.apache.org/job/Apache%20Airavata/ws/modules/registry/airavata-registry-service/pom.xml>
to /home/hudson/hudson/jobs/Apache Airavata/modules/org.apache.airavata$airavata-registry-service/builds/2013-08-01_10-04-00/archive/org.apache.airavata/airavata-registry-service/0.9-SNAPSHOT/airavata-registry-service-0.9-SNAPSHOT.pom
[JENKINS] Archiving <https://builds.apache.org/job/Apache%20Airavata/ws/modules/rest/client/pom.xml>
to /home/hudson/hudson/jobs/Apache Airavata/modules/org.apache.airavata$airavata-rest-client/builds/2013-08-01_10-04-01/archive/org.apache.airavata/airavata-rest-client/0.9-SNAPSHOT/airavata-rest-client-0.9-SNAPSHOT.pom
[JENKINS] Archiving <https://builds.apache.org/job/Apache%20Airavata/ws/modules/credential-store/pom.xml>
to /home/hudson/hudson/jobs/Apache Airavata/modules/org.apache.airavata$airavata-credential-store/builds/2013-08-01_10-04-01/archive/org.apache.airavata/airavata-credential-store/0.9-SNAPSHOT/airavata-credential-store-0.9-SNAPSHOT.pom
[JENKINS] Archiving <https://builds.apache.org/job/Apache%20Airavata/ws/modules/credential-store/target/airavata-credential-store-0.9-SNAPSHOT.jar>
to /home/hudson/hudson/jobs/Apache Airavata/modules/org.apache.airavata$airavata-credential-store/builds/2013-08-01_10-04-01/archive/org.apache.airavata/airavata-credential-store/0.9-SNAPSHOT/airavata-credential-store-0.9-SNAPSHOT.jar
[JENKINS] Archiving <https://builds.apache.org/job/Apache%20Airavata/ws/modules/ws-messenger/client/pom.xml>
to /home/hudson/hudson/jobs/Apache Airavata/modules/org.apache.airavata$airavata-messenger-client/builds/2013-08-01_10-03-58/archive/org.apache.airavata/airavata-messenger-client/0.9-SNAPSHOT/airavata-messenger-client-0.9-SNAPSHOT.pom
[JENKINS] Archiving <https://builds.apache.org/job/Apache%20Airavata/ws/modules/ws-messenger/client/target/airavata-messenger-client-0.9-SNAPSHOT.jar>
to /home/hudson/hudson/jobs/Apache Airavata/modules/org.apache.airavata$airavata-messenger-client/builds/2013-08-01_10-03-58/archive/org.apache.airavata/airavata-messenger-client/0.9-SNAPSHOT/airavata-messenger-client-0.9-SNAPSHOT.jar
[JENKINS] Archiving <https://builds.apache.org/job/Apache%20Airavata/ws/modules/ws-messenger/commons/pom.xml>
to /home/hudson/hudson/jobs/Apache Airavata/modules/org.apache.airavata$airavata-messenger-commons/builds/2013-08-01_10-03-58/archive/org.apache.airavata/airavata-messenger-commons/0.9-SNAPSHOT/airavata-messenger-commons-0.9-SNAPSHOT.pom
[JENKINS] Archiving <https://builds.apache.org/job/Apache%20Airavata/ws/modules/ws-messenger/commons/target/airavata-messenger-commons-0.9-SNAPSHOT.jar>
to /home/hudson/hudson/jobs/Apache Airavata/modules/org.apache.airavata$airavata-messenger-commons/builds/2013-08-01_10-03-58/archive/org.apache.airavata/airavata-messenger-commons/0.9-SNAPSHOT/airavata-messenger-commons-0.9-SNAPSHOT.jar
[JENKINS] Archiving <https://builds.apache.org/job/Apache%20Airavata/ws/modules/workflow-model/workflow-model-core/pom.xml>
to /home/hudson/hudson/jobs/Apache Airavata/modules/org.apache.airavata$airavata-workflow-model-core/builds/2013-08-01_10-03-59/archive/org.apache.airavata/airavata-workflow-model-core/0.9-SNAPSHOT/airavata-workflow-model-core-0.9-SNAPSHOT.pom
[JENKINS] Archiving <https://builds.apache.org/job/Apache%20Airavata/ws/modules/workflow-model/workflow-model-core/target/airavata-workflow-model-core-0.9-SNAPSHOT.jar>
to /home/hudson/hudson/jobs/Apache Airavata/modules/org.apache.airavata$airavata-workflow-model-core/builds/2013-08-01_10-03-59/archive/org.apache.airavata/airavata-workflow-model-core/0.9-SNAPSHOT/airavata-workflow-model-core-0.9-SNAPSHOT.jar
[JENKINS] Archiving <https://builds.apache.org/job/Apache%20Airavata/ws/modules/test-suite/pom.xml>
to /home/hudson/hudson/jobs/Apache Airavata/modules/org.apache.airavata$test-suite/builds/2013-08-01_10-04-02/archive/org.apache.airavata/test-suite/0.9-SNAPSHOT/test-suite-0.9-SNAPSHOT.pom
[JENKINS] Archiving <https://builds.apache.org/job/Apache%20Airavata/ws/pom.xml> to
/home/hudson/hudson/jobs/Apache Airavata/modules/org.apache.airavata$airavata/builds/2013-08-01_10-03-57/archive/org.apache.airavata/airavata/0.9-SNAPSHOT/airavata-0.9-SNAPSHOT.pom
Waiting for Jenkins to finish collecting data
mavenExecutionResult exceptions not empty
message : Failed to execute goal on project airavata-gfac-core: Could not resolve dependencies
for project org.apache.airavata:airavata-gfac-core:jar:0.9-SNAPSHOT: Failed to collect dependencies
for [org.jglobus:gss:jar:2.0.6-rc2 (compile), org.jglobus:gram:jar:2.0.6-rc2 (compile), org.jglobus:myproxy:jar:2.0.6-rc2
(compile), org.jglobus:gridftp:jar:2.0.6-rc2 (compile), commons-configuration:commons-configuration:jar:1.7
(compile), org.slf4j:slf4j-api:jar:1.7.2 (compile), org.apache.airavata:airavata-client-api:jar:0.9-SNAPSHOT
(compile), org.apache.airavata:airavata-workflow-execution-context:jar:0.9-SNAPSHOT (compile),
org.apache.airavata:airavata-workflow-tracking:jar:0.9-SNAPSHOT (compile), net.schmizz:sshj:jar:0.8.0
(compile), org.apache.airavata:airavata-credential-store:jar:0.9-SNAPSHOT (compile), com.amazonaws:aws-java-sdk:jar:1.3.20
(compile), j2ssh:j2ssh-core:jar:0.2.9 (compile), j2ssh:j2ssh-common:jar:0.2.9 (compile), org.apache.httpcomponents:httpclient:jar:4.1
(compile), org.apache.httpcomponents:httpcore:jar:4.1 (compile), junit:junit:jar:4.7 (test),
org.testng:testng:jar:6.1.1 (test), org.slf4j:jcl-over-slf4j:jar:1.7.2 (test), org.slf4j:slf4j-log4j12:jar:1.7.2
(test), eu.unicore:ogsabes-client:jar:1.6.0 (compile), org.apache.hadoop:hadoop-core:jar:1.0.3
(compile), org.apache.hadoop:hadoop-client:jar:1.0.3 (compile), org.apache.whirr:whirr-core:jar:0.7.1
(compile), org.apache.whirr:whirr-hadoop:jar:0.7.1 (compile), org.hamcrest:hamcrest-all:jar:1.1
(compile), org.mockito:mockito-all:jar:1.8.5 (compile), com.jcraft:jsch:jar:0.1.44-1 (compile),
net.sf.jopt-simple:jopt-simple:jar:3.2 (compile), com.google.guava:guava:jar:12.0 (compile)]
cause : Could not resolve dependencies for project org.apache.airavata:airavata-gfac-core:jar:0.9-SNAPSHOT:
Failed to collect dependencies for [org.jglobus:gss:jar:2.0.6-rc2 (compile), org.jglobus:gram:jar:2.0.6-rc2
(compile), org.jglobus:myproxy:jar:2.0.6-rc2 (compile), org.jglobus:gridftp:jar:2.0.6-rc2
(compile), commons-configuration:commons-configuration:jar:1.7 (compile), org.slf4j:slf4j-api:jar:1.7.2
(compile), org.apache.airavata:airavata-client-api:jar:0.9-SNAPSHOT (compile), org.apache.airavata:airavata-workflow-execution-context:jar:0.9-SNAPSHOT
(compile), org.apache.airavata:airavata-workflow-tracking:jar:0.9-SNAPSHOT (compile), net.schmizz:sshj:jar:0.8.0
(compile), org.apache.airavata:airavata-credential-store:jar:0.9-SNAPSHOT (compile), com.amazonaws:aws-java-sdk:jar:1.3.20
(compile), j2ssh:j2ssh-core:jar:0.2.9 (compile), j2ssh:j2ssh-common:jar:0.2.9 (compile), org.apache.httpcomponents:httpclient:jar:4.1
(compile), org.apache.httpcomponents:httpcore:jar:4.1 (compile), junit:junit:jar:4.7 (test),
org.testng:testng:jar:6.1.1 (test), org.slf4j:jcl-over-slf4j:jar:1.7.2 (test), org.slf4j:slf4j-log4j12:jar:1.7.2
(test), eu.unicore:ogsabes-client:jar:1.6.0 (compile), org.apache.hadoop:hadoop-core:jar:1.0.3
(compile), org.apache.hadoop:hadoop-client:jar:1.0.3 (compile), org.apache.whirr:whirr-core:jar:0.7.1
(compile), org.apache.whirr:whirr-hadoop:jar:0.7.1 (compile), org.hamcrest:hamcrest-all:jar:1.1
(compile), org.mockito:mockito-all:jar:1.8.5 (compile), com.jcraft:jsch:jar:0.1.44-1 (compile),
net.sf.jopt-simple:jopt-simple:jar:3.2 (compile), com.google.guava:guava:jar:12.0 (compile)]
Stack trace : 
org.apache.maven.lifecycle.LifecycleExecutionException: Failed to execute goal on project
airavata-gfac-core: Could not resolve dependencies for project org.apache.airavata:airavata-gfac-core:jar:0.9-SNAPSHOT:
Failed to collect dependencies for [org.jglobus:gss:jar:2.0.6-rc2 (compile), org.jglobus:gram:jar:2.0.6-rc2
(compile), org.jglobus:myproxy:jar:2.0.6-rc2 (compile), org.jglobus:gridftp:jar:2.0.6-rc2
(compile), commons-configuration:commons-configuration:jar:1.7 (compile), org.slf4j:slf4j-api:jar:1.7.2
(compile), org.apache.airavata:airavata-client-api:jar:0.9-SNAPSHOT (compile), org.apache.airavata:airavata-workflow-execution-context:jar:0.9-SNAPSHOT
(compile), org.apache.airavata:airavata-workflow-tracking:jar:0.9-SNAPSHOT (compile), net.schmizz:sshj:jar:0.8.0
(compile), org.apache.airavata:airavata-credential-store:jar:0.9-SNAPSHOT (compile), com.amazonaws:aws-java-sdk:jar:1.3.20
(compile), j2ssh:j2ssh-core:jar:0.2.9 (compile), j2ssh:j2ssh-common:jar:0.2.9 (compile), org.apache.httpcomponents:httpclient:jar:4.1
(compile), org.apache.httpcomponents:httpcore:jar:4.1 (compile), junit:junit:jar:4.7 (test),
org.testng:testng:jar:6.1.1 (test), org.slf4j:jcl-over-slf4j:jar:1.7.2 (test), org.slf4j:slf4j-log4j12:jar:1.7.2
(test), eu.unicore:ogsabes-client:jar:1.6.0 (compile), org.apache.hadoop:hadoop-core:jar:1.0.3
(compile), org.apache.hadoop:hadoop-client:jar:1.0.3 (compile), org.apache.whirr:whirr-core:jar:0.7.1
(compile), org.apache.whirr:whirr-hadoop:jar:0.7.1 (compile), org.hamcrest:hamcrest-all:jar:1.1
(compile), org.mockito:mockito-all:jar:1.8.5 (compile), com.jcraft:jsch:jar:0.1.44-1 (compile),
net.sf.jopt-simple:jopt-simple:jar:3.2 (compile), com.google.guava:guava:jar:12.0 (compile)]
	at org.apache.maven.lifecycle.internal.LifecycleDependencyResolver.getDependencies(LifecycleDependencyResolver.java:210)
	at org.apache.maven.lifecycle.internal.LifecycleDependencyResolver.resolveProjectDependencies(LifecycleDependencyResolver.java:117)
	at org.apache.maven.lifecycle.internal.MojoExecutor.ensureDependenciesAreResolved(MojoExecutor.java:258)
	at org.apache.maven.lifecycle.internal.MojoExecutor.execute(MojoExecutor.java:201)
	at org.apache.maven.lifecycle.internal.MojoExecutor.execute(MojoExecutor.java:153)
	at org.apache.maven.lifecycle.internal.MojoExecutor.execute(MojoExecutor.java:145)
	at org.apache.maven.lifecycle.internal.LifecycleModuleBuilder.buildProject(LifecycleModuleBuilder.java:84)
	at org.apache.maven.lifecycle.internal.LifecycleModuleBuilder.buildProject(LifecycleModuleBuilder.java:59)
	at org.apache.maven.lifecycle.internal.LifecycleStarter.singleThreadedBuild(LifecycleStarter.java:183)
	at org.apache.maven.lifecycle.internal.LifecycleStarter.execute(LifecycleStarter.java:161)
	at org.apache.maven.DefaultMaven.doExecute(DefaultMaven.java:320)
	at org.apache.maven.DefaultMaven.execute(DefaultMaven.java:156)
	at org.jvnet.hudson.maven3.launcher.Maven3Launcher.main(Maven3Launcher.java:117)
	at sun.reflect.NativeMethodAccessorImpl.invoke0(Native Method)
	at sun.reflect.NativeMethodAccessorImpl.invoke(NativeMethodAccessorImpl.java:57)
	at sun.reflect.DelegatingMethodAccessorImpl.invoke(DelegatingMethodAccessorImpl.java:43)
	at java.lang.reflect.Method.invoke(Method.java:606)
	at org.codehaus.plexus.classworlds.launcher.Launcher.launchStandard(Launcher.java:329)
	at org.codehaus.plexus.classworlds.launcher.Launcher.launch(Launcher.java:239)
	at org.jvnet.hudson.maven3.agent.Maven3Main.launch(Maven3Main.java:178)
	at sun.reflect.NativeMethodAccessorImpl.invoke0(Native Method)
	at sun.reflect.NativeMethodAccessorImpl.invoke(NativeMethodAccessorImpl.java:57)
	at sun.reflect.DelegatingMethodAccessorImpl.invoke(DelegatingMethodAccessorImpl.java:43)
	at java.lang.reflect.Method.invoke(Method.java:606)
	at hudson.maven.Maven3Builder.call(Maven3Builder.java:129)
	at hudson.maven.Maven3Builder.call(Maven3Builder.java:67)
	at hudson.remoting.UserRequest.perform(UserRequest.java:118)
	at hudson.remoting.UserRequest.perform(UserRequest.java:48)
	at hudson.remoting.Request$2.run(Request.java:326)
	at hudson.remoting.InterceptingExecutorService$1.call(InterceptingExecutorService.java:72)
	at java.util.concurrent.FutureTask$Sync.innerRun(FutureTask.java:334)
	at java.util.concurrent.FutureTask.run(FutureTask.java:166)
	at java.util.concurrent.ThreadPoolExecutor.runWorker(ThreadPoolExecutor.java:1145)
	at java.util.concurrent.ThreadPoolExecutor$Worker.run(ThreadPoolExecutor.java:615)
	at java.lang.Thread.run(Thread.java:724)
Caused by: org.apache.maven.project.DependencyResolutionException: Could not resolve dependencies
for project org.apache.airavata:airavata-gfac-core:jar:0.9-SNAPSHOT: Failed to collect dependencies
for [org.jglobus:gss:jar:2.0.6-rc2 (compile), org.jglobus:gram:jar:2.0.6-rc2 (compile), org.jglobus:myproxy:jar:2.0.6-rc2
(compile), org.jglobus:gridftp:jar:2.0.6-rc2 (compile), commons-configuration:commons-configuration:jar:1.7
(compile), org.slf4j:slf4j-api:jar:1.7.2 (compile), org.apache.airavata:airavata-client-api:jar:0.9-SNAPSHOT
(compile), org.apache.airavata:airavata-workflow-execution-context:jar:0.9-SNAPSHOT (compile),
org.apache.airavata:airavata-workflow-tracking:jar:0.9-SNAPSHOT (compile), net.schmizz:sshj:jar:0.8.0
(compile), org.apache.airavata:airavata-credential-store:jar:0.9-SNAPSHOT (compile), com.amazonaws:aws-java-sdk:jar:1.3.20
(compile), j2ssh:j2ssh-core:jar:0.2.9 (compile), j2ssh:j2ssh-common:jar:0.2.9 (compile), org.apache.httpcomponents:httpclient:jar:4.1
(compile), org.apache.httpcomponents:httpcore:jar:4.1 (compile), junit:junit:jar:4.7 (test),
org.testng:testng:jar:6.1.1 (test), org.slf4j:jcl-over-slf4j:jar:1.7.2 (test), org.slf4j:slf4j-log4j12:jar:1.7.2
(test), eu.unicore:ogsabes-client:jar:1.6.0 (compile), org.apache.hadoop:hadoop-core:jar:1.0.3
(compile), org.apache.hadoop:hadoop-client:jar:1.0.3 (compile), org.apache.whirr:whirr-core:jar:0.7.1
(compile), org.apache.whirr:whirr-hadoop:jar:0.7.1 (compile), org.hamcrest:hamcrest-all:jar:1.1
(compile), org.mockito:mockito-all:jar:1.8.5 (compile), com.jcraft:jsch:jar:0.1.44-1 (compile),
net.sf.jopt-simple:jopt-simple:jar:3.2 (compile), com.google.guava:guava:jar:12.0 (compile)]
	at org.apache.maven.project.DefaultProjectDependenciesResolver.resolve(DefaultProjectDependenciesResolver.java:158)
	at org.apache.maven.lifecycle.internal.LifecycleDependencyResolver.getDependencies(LifecycleDependencyResolver.java:185)
	... 34 more
Caused by: org.sonatype.aether.collection.DependencyCollectionException: Failed to collect
dependencies for [org.jglobus:gss:jar:2.0.6-rc2 (compile), org.jglobus:gram:jar:2.0.6-rc2
(compile), org.jglobus:myproxy:jar:2.0.6-rc2 (compile), org.jglobus:gridftp:jar:2.0.6-rc2
(compile), commons-configuration:commons-configuration:jar:1.7 (compile), org.slf4j:slf4j-api:jar:1.7.2
(compile), org.apache.airavata:airavata-client-api:jar:0.9-SNAPSHOT (compile), org.apache.airavata:airavata-workflow-execution-context:jar:0.9-SNAPSHOT
(compile), org.apache.airavata:airavata-workflow-tracking:jar:0.9-SNAPSHOT (compile), net.schmizz:sshj:jar:0.8.0
(compile), org.apache.airavata:airavata-credential-store:jar:0.9-SNAPSHOT (compile), com.amazonaws:aws-java-sdk:jar:1.3.20
(compile), j2ssh:j2ssh-core:jar:0.2.9 (compile), j2ssh:j2ssh-common:jar:0.2.9 (compile), org.apache.httpcomponents:httpclient:jar:4.1
(compile), org.apache.httpcomponents:httpcore:jar:4.1 (compile), junit:junit:jar:4.7 (test),
org.testng:testng:jar:6.1.1 (test), org.slf4j:jcl-over-slf4j:jar:1.7.2 (test), org.slf4j:slf4j-log4j12:jar:1.7.2
(test), eu.unicore:ogsabes-client:jar:1.6.0 (compile), org.apache.hadoop:hadoop-core:jar:1.0.3
(compile), org.apache.hadoop:hadoop-client:jar:1.0.3 (compile), org.apache.whirr:whirr-core:jar:0.7.1
(compile), org.apache.whirr:whirr-hadoop:jar:0.7.1 (compile), org.hamcrest:hamcrest-all:jar:1.1
(compile), org.mockito:mockito-all:jar:1.8.5 (compile), com.jcraft:jsch:jar:0.1.44-1 (compile),
net.sf.jopt-simple:jopt-simple:jar:3.2 (compile), com.google.guava:guava:jar:12.0 (compile)]
	at org.sonatype.aether.impl.internal.DefaultDependencyCollector.collectDependencies(DefaultDependencyCollector.java:258)
	at org.sonatype.aether.impl.internal.DefaultRepositorySystem.collectDependencies(DefaultRepositorySystem.java:308)
	at org.apache.maven.project.DefaultProjectDependenciesResolver.resolve(DefaultProjectDependenciesResolver.java:150)
	... 35 more
Caused by: org.sonatype.aether.resolution.ArtifactDescriptorException: Failed to read artifact
descriptor for net.sf.saxon:saxon:jar:9
	at org.apache.maven.repository.internal.DefaultArtifactDescriptorReader.loadPom(DefaultArtifactDescriptorReader.java:296)
	at org.apache.maven.repository.internal.DefaultArtifactDescriptorReader.readArtifactDescriptor(DefaultArtifactDescriptorReader.java:186)
	at org.sonatype.aether.impl.internal.DefaultDependencyCollector.process(DefaultDependencyCollector.java:412)
	at org.sonatype.aether.impl.internal.DefaultDependencyCollector.process(DefaultDependencyCollector.java:544)
	at org.sonatype.aether.impl.internal.DefaultDependencyCollector.process(DefaultDependencyCollector.java:544)
	at org.sonatype.aether.impl.internal.DefaultDependencyCollector.process(DefaultDependencyCollector.java:544)
	at org.sonatype.aether.impl.internal.DefaultDependencyCollector.process(DefaultDependencyCollector.java:544)
	at org.sonatype.aether.impl.internal.DefaultDependencyCollector.collectDependencies(DefaultDependencyCollector.java:240)
	... 37 more
Caused by: org.sonatype.aether.resolution.ArtifactResolutionException: Could not transfer
artifact net.sf.saxon:saxon:pom:9 from/to ogce.m2.all (http://community.ucs.indiana.edu:9090/archiva/repository/ogce.m2.all):
Connection to http://community.ucs.indiana.edu:9090 refused
	at org.sonatype.aether.impl.internal.DefaultArtifactResolver.resolve(DefaultArtifactResolver.java:538)
	at org.sonatype.aether.impl.internal.DefaultArtifactResolver.resolveArtifacts(DefaultArtifactResolver.java:216)
	at org.sonatype.aether.impl.internal.DefaultArtifactResolver.resolveArtifact(DefaultArtifactResolver.java:193)
	at org.apache.maven.repository.internal.DefaultArtifactDescriptorReader.loadPom(DefaultArtifactDescriptorReader.java:281)
	... 44 more
Caused by: org.sonatype.aether.transfer.ArtifactTransferException: Could not transfer artifact
net.sf.saxon:saxon:pom:9 from/to ogce.m2.all (http://community.ucs.indiana.edu:9090/archiva/repository/ogce.m2.all):
Connection to http://community.ucs.indiana.edu:9090 refused
	at org.sonatype.aether.connector.wagon.WagonRepositoryConnector$4.wrap(WagonRepositoryConnector.java:951)
	at org.sonatype.aether.connector.wagon.WagonRepositoryConnector$4.wrap(WagonRepositoryConnector.java:941)
	at org.sonatype.aether.connector.wagon.WagonRepositoryConnector$GetTask.run(WagonRepositoryConnector.java:669)
	at org.sonatype.aether.util.concurrency.RunnableErrorForwarder$1.run(RunnableErrorForwarder.java:60)
	... 3 more
Caused by: org.apache.maven.wagon.TransferFailedException: Connection to http://community.ucs.indiana.edu:9090
refused
	at org.apache.maven.wagon.shared.http4.AbstractHttpClientWagon.fillInputData(AbstractHttpClientWagon.java:799)
	at org.apache.maven.wagon.StreamWagon.getInputStream(StreamWagon.java:116)
	at org.apache.maven.wagon.StreamWagon.getIfNewer(StreamWagon.java:88)
	at org.apache.maven.wagon.StreamWagon.get(StreamWagon.java:61)
	at org.sonatype.aether.connector.wagon.WagonRepositoryConnector$GetTask.run(WagonRepositoryConnector.java:601)
	... 4 more
Caused by: org.apache.maven.wagon.providers.http.httpclient.conn.HttpHostConnectException:
Connection to http://community.ucs.indiana.edu:9090 refused
	at org.apache.maven.wagon.providers.http.httpclient.impl.conn.DefaultClientConnectionOperator.openConnection(DefaultClientConnectionOperator.java:158)
	at org.apache.maven.wagon.providers.http.httpclient.impl.conn.AbstractPoolEntry.open(AbstractPoolEntry.java:149)
	at org.apache.maven.wagon.providers.http.httpclient.impl.conn.AbstractPooledConnAdapter.open(AbstractPooledConnAdapter.java:121)
	at org.apache.maven.wagon.providers.http.httpclient.impl.client.DefaultRequestDirector.tryConnect(DefaultRequestDirector.java:573)
	at org.apache.maven.wagon.providers.http.httpclient.impl.client.DefaultRequestDirector.execute(DefaultRequestDirector.java:425)
	at org.apache.maven.wagon.providers.http.httpclient.impl.client.AbstractHttpClient.execute(AbstractHttpClient.java:820)
	at org.apache.maven.wagon.providers.http.httpclient.impl.client.AbstractHttpClient.execute(AbstractHttpClient.java:754)
	at org.apache.maven.wagon.shared.http4.AbstractHttpClientWagon.execute(AbstractHttpClientWagon.java:674)
	at org.apache.maven.wagon.shared.http4.AbstractHttpClientWagon.fillInputData(AbstractHttpClientWagon.java:793)
	... 8 more
Caused by: java.net.ConnectException: Connection timed out
	at java.net.PlainSocketImpl.socketConnect(Native Method)
	at java.net.AbstractPlainSocketImpl.doConnect(AbstractPlainSocketImpl.java:339)
	at java.net.AbstractPlainSocketImpl.connectToAddress(AbstractPlainSocketImpl.java:200)
	at java.net.AbstractPlainSocketImpl.connect(AbstractPlainSocketImpl.java:182)
	at java.net.SocksSocketImpl.connect(SocksSocketImpl.java:392)
	at java.net.Socket.connect(Socket.java:579)
	at org.apache.maven.wagon.providers.http.httpclient.conn.scheme.PlainSocketFactory.connectSocket(PlainSocketFactory.java:123)
	at org.apache.maven.wagon.providers.http.httpclient.impl.conn.DefaultClientConnectionOperator.openConnection(DefaultClientConnectionOperator.java:148)
	... 16 more
Sending e-mails to: dev@airavata.apache.org
channel stopped

Mime
View raw message