airavata-dev mailing list archives

Site index · List index
Message view « Date » · « Thread »
Top « Date » · « Thread »
From Vijayendra Grampurohit <vijayendra....@gmail.com>
Subject error while building
Date Wed, 03 Jul 2013 11:14:28 GMT
Hi

I am trying to build project on one more system.
I am getting the following error.


on  examination

Downloading: http://repo1.maven.org/maven2/net/sf/saxon/saxon/9/saxon-9.pom
Downloading:
http://community.ucs.indiana.edu:9090/archiva/repository/ogce.m2.all/net/sf/saxon/saxon/9/saxon-9.pom
Downloading:
http://people.apache.org/repo/m2-snapshot-repository/net/sf/saxon/saxon/9/saxon-9.pom
Downloading:
http://unicore-dev.zam.kfa-juelich.de/maven/net/sf/saxon/saxon/9/saxon-9.pom

show page not found error.  can some body help me ?

[INFO]

[INFO]
------------------------------------------------------------------------
[INFO] Building Airavata GFac Core 0.9-SNAPSHOT
[INFO]
------------------------------------------------------------------------
Downloading: http://repo1.maven.org/maven2/net/sf/saxon/saxon/9/saxon-9.pom
Downloading:
http://community.ucs.indiana.edu:9090/archiva/repository/ogce.m2.all/net/sf/saxon/saxon/9/saxon-9.pom
Downloading:
http://people.apache.org/repo/m2-snapshot-repository/net/sf/saxon/saxon/9/saxon-9.pom
Downloading:
http://unicore-dev.zam.kfa-juelich.de/maven/net/sf/saxon/saxon/9/saxon-9.pom
[INFO]
------------------------------------------------------------------------
[INFO] Reactor Summary:
[INFO]
[INFO] Airavata .......................................... SUCCESS [4.366s]
[INFO] Airavata Commons .................................. SUCCESS [0.072s]
[INFO] Airavata GFac Schema Utilities .................... SUCCESS [10.121s]
[INFO] Airavata Common Utilities ......................... SUCCESS [3.652s]
[INFO] Airavata Registry ................................. SUCCESS [0.036s]
[INFO] Airavata Registry API ............................. SUCCESS [2.146s]
[INFO] Airavata Workflow Model Parent .................... SUCCESS [0.019s]
[INFO] Airavata Workflow Model Core ...................... SUCCESS [3.540s]
[INFO] Airavata WS Messenger ............................. SUCCESS [0.071s]
[INFO] Airavata Messenger Commons ........................ SUCCESS [1.585s]
[INFO] Airavata Messenger Client ......................... SUCCESS [3.688s]
[INFO] Airavata WS Monitor ............................... SUCCESS [1.900s]
[INFO] Airavata Workflow Execution Context ............... SUCCESS [4.356s]
[INFO] Airavata Client ................................... SUCCESS [2.939s]
[INFO] Airavata Workflow Tracking ........................ SUCCESS [5.513s]
[INFO] Airavata Credential Store ......................... SUCCESS [18.115s]
[INFO] Airavata GFac Core ................................ FAILURE [5.639s]
[INFO] Airavata Message Box .............................. SKIPPED
[INFO] Airavata Message Broker ........................... SKIPPED
[INFO] Airavata Workflow Component ....................... SKIPPED
[INFO] Airavata Workflow Component Node .................. SKIPPED
[INFO] Airavata JPA Registry ............................. SKIPPED
[INFO] Airavata REST ..................................... SKIPPED
[INFO] airavata-rest-mappings ............................ SKIPPED
[INFO] airavata-rest-client .............................. SKIPPED
[INFO] Airavata XBaya .................................... SKIPPED
[INFO] Airavata Registry Service ......................... SKIPPED
[INFO] Airavata Registry Test ............................ SKIPPED
[INFO] Airavata Security Implementation .................. SKIPPED
[INFO] airavata-rest-services ............................ SKIPPED
[INFO] airavata-rest-service-webapp ...................... SKIPPED
[INFO] Airavata Tools .................................... SKIPPED
[INFO] Airavata Phoebus Integration ...................... SKIPPED
[INFO] registry-tool ..................................... SKIPPED
[INFO] Simple Math Service ............................... SKIPPED
[INFO] Complex Math Service .............................. SKIPPED
[INFO] Levenshtein Distance Service ...................... SKIPPED
[INFO] Airavata Embedded Tomcat Implementation ........... SKIPPED
[INFO] Airavata Test Suite ............................... SKIPPED
[INFO] distribution ...................................... SKIPPED
[INFO] Samples - Airavata Client Samples ................. SKIPPED
[INFO] Samples - Workflow Create Application ............. SKIPPED
[INFO] Samples - Workflow Execution ...................... SKIPPED
[INFO] Airavata server distribution ...................... SKIPPED
[INFO] Airavata client distribution ...................... SKIPPED
[INFO] Airavata xbaya-gui distribution ................... SKIPPED
[INFO] Airavata release artifacts ........................ SKIPPED
[INFO] Airavata Integration Tests ........................ SKIPPED
[INFO]
------------------------------------------------------------------------
[INFO] BUILD FAILURE
[INFO]
------------------------------------------------------------------------
[INFO] Total time: 1:08.579s
[INFO] Finished at: Wed Jul 03 16:26:48 IST 2013
[INFO] Final Memory: 134M/396M
[INFO]
------------------------------------------------------------------------
[ERROR] Failed to execute goal on project airavata-gfac-core: Could not
resolve dependencies for project
org.apache.airavata:airavata-gfac-core:jar:0.9-SNAPSHOT: Failed to collect
dependencies for [cog-jglobus:cog-jglobus:jar:1.8.0_bc (compile),
cog-globus:puretls:jar:1.0 (compile), cog-globus:cryptix32:jar:1.0
(compile), cog-globus:cryptix-asn1:jar:1.0 (compile),
commons-configuration:commons-configuration:jar:1.7 (compile),
org.slf4j:slf4j-api:jar:1.7.2 (compile),
org.apache.airavata:airavata-client-api:jar:0.9-SNAPSHOT (compile),
org.apache.airavata:airavata-workflow-execution-context:jar:0.9-SNAPSHOT
(compile), org.apache.airavata:airavata-workflow-tracking:jar:0.9-SNAPSHOT
(compile), net.schmizz:sshj:jar:0.8.0 (compile),
org.apache.airavata:airavata-credential-store:jar:0.9-SNAPSHOT (compile),
com.amazonaws:aws-java-sdk:jar:1.3.20 (compile), j2ssh:j2ssh-core:jar:0.2.9
(compile), j2ssh:j2ssh-common:jar:0.2.9 (compile),
org.apache.httpcomponents:httpclient:jar:4.1 (compile),
org.apache.httpcomponents:httpcore:jar:4.1 (compile), junit:junit:jar:4.7
(test), org.slf4j:jcl-over-slf4j:jar:1.7.2 (test),
org.slf4j:slf4j-log4j12:jar:1.7.2 (test),
eu.unicore:ogsabes-client:jar:1.6.0 (compile),
org.apache.hadoop:hadoop-core:jar:1.0.3 (compile),
org.apache.hadoop:hadoop-client:jar:1.0.3 (compile),
org.apache.whirr:whirr-core:jar:0.7.1 (compile),
org.apache.whirr:whirr-hadoop:jar:0.7.1 (compile),
org.hamcrest:hamcrest-all:jar:1.1 (compile),
org.mockito:mockito-all:jar:1.8.5 (compile), com.jcraft:jsch:jar:0.1.44-1
(compile), net.sf.jopt-simple:jopt-simple:jar:3.2 (compile),
com.google.guava:guava:jar:12.0 (compile)]: Failed to read artifact
descriptor for net.sf.saxon:saxon:jar:9: Could not transfer artifact
net.sf.saxon:saxon:pom:9 from/to ogce.m2.all (
http://community.ucs.indiana.edu:9090/archiva/repository/ogce.m2.all):
Access denied to:
http://community.ucs.indiana.edu:9090/archiva/repository/ogce.m2.all/net/sf/saxon/saxon/9/saxon-9.pom,
ReasonPhrase:Forbidden. -> [Help 1]
[ERROR]
[ERROR] To see the full stack trace of the errors, re-run Maven with the -e
switch.
[ERROR] Re-run Maven using the -X switch to enable full debug logging.
[ERROR]
[ERROR] For more information about the errors and possible solutions,
please read the following articles:
[ERROR] [Help 1]
http://cwiki.apache.org/confluence/display/MAVEN/DependencyResolutionException
[ERROR]
[ERROR] After correcting the problems, you can resume the build with the
command
[ERROR]   mvn <goals> -rf :airavata-gfac-core

Mime
  • Unnamed multipart/alternative (inline, None, 0 bytes)
View raw message