airavata-dev mailing list archives

Site index · List index
Message view « Date » · « Thread »
Top « Date » · « Thread »
From Apache Jenkins Server <jenk...@builds.apache.org>
Subject Build failed in Jenkins: Apache Airavata #1136
Date Wed, 08 May 2013 22:46:32 GMT
See <https://builds.apache.org/job/Apache%20Airavata/1136/changes>

Changes:

[chathuri] adding node error table

------------------------------------------
[...truncated 2663 lines...]
    <wsdl:part name="parameters" element="typens:invoke_InputParams">
    </wsdl:part>
  </wsdl:message>
  <wsdl:portType name="SimpleEcho">
<wsdl:documentation />
    <wsdl:operation name="invoke">
<wsdl:documentation />
      <wsdl:input name="invoke_RequestMessage_b754f7c5-2f82-4958-81ef-a8e5b5f7962a" message="invoke_RequestMessage_b754f7c5-2f82-4958-81ef-a8e5b5f7962a">
    </wsdl:input>
      <wsdl:output name="invoke_ResponseMessage_cda15869-9d71-45cc-a218-9c4fd89eba2f" message="invoke_ResponseMessage_cda15869-9d71-45cc-a218-9c4fd89eba2f">
    </wsdl:output>
    </wsdl:operation>
  </wsdl:portType>
</wsdl:definitions>

DONE
Tests run: 1, Failures: 0, Errors: 0, Skipped: 0, Time elapsed: 4.346 sec

Results :

Tests run: 1, Failures: 0, Errors: 0, Skipped: 0

[JENKINS] Recording test results
[INFO] 
[INFO] --- maven-jar-plugin:2.4:jar (default-jar) @ airavata-gfac-schema-utils ---
[INFO] Building jar: <https://builds.apache.org/job/Apache%20Airavata/ws/modules/commons/gfac-schema/target/airavata-gfac-schema-utils-0.8-SNAPSHOT.jar>
[INFO] 
[INFO] --- maven-site-plugin:3.2:attach-descriptor (attach-descriptor) @ airavata-gfac-schema-utils
---
[INFO] 
[INFO] --- maven-install-plugin:2.3.1:install (default-install) @ airavata-gfac-schema-utils
---[INFO] Installing <https://builds.apache.org/job/Apache%20Airavata/ws/modules/commons/gfac-schema/target/airavata-gfac-schema-utils-0.8-SNAPSHOT.jar>
to /export/home/hudson/hudson-slave/maven-repositories/1/org/apache/airavata/airavata-gfac-schema-utils/0.8-SNAPSHOT/airavata-gfac-schema-utils-0.8-SNAPSHOT.jar
[INFO] Installing <https://builds.apache.org/job/Apache%20Airavata/ws/modules/commons/gfac-schema/pom.xml>
to /export/home/hudson/hudson-slave/maven-repositories/1/org/apache/airavata/airavata-gfac-schema-utils/0.8-SNAPSHOT/airavata-gfac-schema-utils-0.8-SNAPSHOT.pom

[INFO]                                                                         
[INFO] ------------------------------------------------------------------------
[INFO] Building Airavata Common Utilities 0.8-SNAPSHOT
[INFO] ------------------------------------------------------------------------
[INFO] 
[INFO] --- maven-clean-plugin:2.5:clean (default-clean) @ airavata-common-utils ---
[INFO] [debug] execute contextualize

[INFO] Using 'UTF-8' encoding to copy filtered resources.
[INFO] --- maven-resources-plugin:2.5:copy-resources (copy-resources) @ airavata-common-utils
---[INFO] skip non existing resourceDirectory <https://builds.apache.org/job/Apache%20Airavata/ws/modules/commons/utils/src/main/assembly/dist>

[INFO] 
[INFO] --- maven-remote-resources-plugin:1.4:process (default) @ airavata-common-utils ---
[INFO] 
[INFO] --- maven-resources-plugin:2.5:resources (default-resources) @ airavata-common-utils
---[debug] execute contextualize
[INFO] Using 'UTF-8' encoding to copy filtered resources.
[INFO] skip non existing resourceDirectory <https://builds.apache.org/job/Apache%20Airavata/ws/modules/commons/utils/src/main/resources>
[INFO] Copying 3 resources

[INFO] 
[INFO] --- maven-compiler-plugin:2.3.2:compile (default-compile) @ airavata-common-utils ---
[INFO] Compiling 32 source files to <https://builds.apache.org/job/Apache%20Airavata/ws/modules/commons/utils/target/classes>
[INFO] [debug] execute contextualize

[INFO] --- maven-resources-plugin:2.5:testResources (default-testResources) @ airavata-common-utils
---[INFO] Using 'UTF-8' encoding to copy filtered resources.
[INFO] Copying 0 resource
[INFO] Copying 3 resources

[INFO] 
[INFO] --- maven-compiler-plugin:2.3.2:testCompile (default-testCompile) @ airavata-common-utils
---[INFO] Compiling 1 source file to <https://builds.apache.org/job/Apache%20Airavata/ws/modules/commons/utils/target/test-classes>

[INFO] 
[INFO] --- maven-surefire-plugin:2.12:test (default-test) @ airavata-common-utils ---[INFO]
Surefire report directory: <https://builds.apache.org/job/Apache%20Airavata/ws/modules/commons/utils/target/surefire-reports>

-------------------------------------------------------
 T E S T S
-------------------------------------------------------


Results :

Tests run: 0, Failures: 0, Errors: 0, Skipped: 0

[JENKINS] Recording test results
[INFO] ------------------------------------------------------------------------
[INFO] Reactor Summary:
[INFO] 
[INFO] Airavata .......................................... SUCCESS [3:18.519s]
[INFO] Airavata Commons .................................. SUCCESS [16.105s]
[INFO] Airavata GFac Schema Utilities .................... SUCCESS [2:27.945s]
[INFO] Airavata Common Utilities ......................... FAILURE [1:16.610s]
[INFO] Airavata Registry ................................. SKIPPED
[INFO] Airavata Registry API ............................. SKIPPED
[INFO] Airavata Workflow Model Parent .................... SKIPPED
[INFO] Airavata Workflow Model Core ...................... SKIPPED
[INFO] Airavata WS Messenger ............................. SKIPPED
[INFO] Airavata Messenger Commons ........................ SKIPPED
[INFO] Airavata Messenger Client ......................... SKIPPED
[INFO] Airavata WS Monitor ............................... SKIPPED
[INFO] Airavata Workflow Execution Context ............... SKIPPED
[INFO] Airavata Client ................................... SKIPPED
[INFO] Airavata Workflow Tracking ........................ SKIPPED
[INFO] Airavata GFac Core ................................ SKIPPED
[INFO] Airavata Message Box .............................. SKIPPED
[INFO] Airavata Message Broker ........................... SKIPPED
[INFO] Airavata Workflow Component ....................... SKIPPED
[INFO] Airavata Workflow Component Node .................. SKIPPED
[INFO] Airavata JPA Registry ............................. SKIPPED
[INFO] Airavata REST ..................................... SKIPPED
[INFO] airavata-rest-mappings ............................ SKIPPED
[INFO] airavata-rest-client .............................. SKIPPED
[INFO] Airavata XBaya .................................... SKIPPED
[INFO] Airavata Registry Service ......................... SKIPPED
[INFO] Airavata Registry Test ............................ SKIPPED
[INFO] Airavata Security Implementation .................. SKIPPED
[INFO] Airavata Credential Store ......................... SKIPPED
[INFO] airavata-rest-services ............................ SKIPPED
[INFO] airavata-rest-service-webapp ...................... SKIPPED
[INFO] Airavata Tools .................................... SKIPPED
[INFO] Airavata Phoebus Integration ...................... SKIPPED
[INFO] registry-tool ..................................... SKIPPED
[INFO] Simple Math Service ............................... SKIPPED
[INFO] Complex Math Service .............................. SKIPPED
[INFO] Levenshtein Distance Service ...................... SKIPPED
[INFO] Airavata Embedded Tomcat Implementation ........... SKIPPED
[INFO] Airavata Test Suite ............................... SKIPPED
[INFO] distribution ...................................... SKIPPED
[INFO] Samples - Airavata Client Samples ................. SKIPPED
[INFO] Samples - Workflow Create Application ............. SKIPPED
[INFO] Samples - Workflow Execution ...................... SKIPPED
[INFO] Airavata server distribution ...................... SKIPPED
[INFO] Airavata client distribution ...................... SKIPPED
[INFO] Airavata xbaya-gui distribution ................... SKIPPED
[INFO] Airavata release artifacts ........................ SKIPPED
[INFO] Airavata Integration Tests ........................ SKIPPED
[INFO] ------------------------------------------------------------------------
[INFO] BUILD FAILURE
[INFO] ------------------------------------------------------------------------
[INFO] Total time: 8:22.184s
[INFO] Finished at: Wed May 08 22:39:20 GMT+00:00 2013
[INFO] Final Memory: 45M/390M
[INFO] ------------------------------------------------------------------------
[JENKINS] Archiving <https://builds.apache.org/job/Apache%20Airavata/ws/modules/distribution/release/pom.xml>
to /home/hudson/hudson/jobs/Apache Airavata/modules/org.apache.airavata$apache-airavata-release-artifacts/builds/2013-05-08_22-28-34/archive/org.apache.airavata/apache-airavata-release-artifacts/0.8-SNAPSHOT/apache-airavata-release-artifacts-0.8-SNAPSHOT.pom
[JENKINS] Archiving <https://builds.apache.org/job/Apache%20Airavata/ws/modules/commons/workflow-tracking/pom.xml>
to /home/hudson/hudson/jobs/Apache Airavata/modules/org.apache.airavata$airavata-workflow-tracking/builds/2013-05-08_22-27-52/archive/org.apache.airavata/airavata-workflow-tracking/0.8-SNAPSHOT/airavata-workflow-tracking-0.8-SNAPSHOT.pom
[JENKINS] Archiving <https://builds.apache.org/job/Apache%20Airavata/ws/samples/complex-math-service/pom.xml>
to /home/hudson/hudson/jobs/Apache Airavata/modules/org.apache.airavata$airavata-complex-math-service/builds/2013-05-08_22-28-19/archive/org.apache.airavata/airavata-complex-math-service/0.8-SNAPSHOT/airavata-complex-math-service-0.8-SNAPSHOT.pom
[JENKINS] Archiving <https://builds.apache.org/job/Apache%20Airavata/ws/modules/distribution/pom.xml>
to /home/hudson/hudson/jobs/Apache Airavata/modules/org.apache.airavata$distribution/builds/2013-05-08_22-28-29/archive/org.apache.airavata/distribution/0.8-SNAPSHOT/distribution-0.8-SNAPSHOT.pom
[JENKINS] Archiving <https://builds.apache.org/job/Apache%20Airavata/ws/modules/workflow-model/workflow-model-component-node/pom.xml>
to /home/hudson/hudson/jobs/Apache Airavata/modules/org.apache.airavata$airavata-workflow-model-component-node/builds/2013-05-08_22-27-47/archive/org.apache.airavata/airavata-workflow-model-component-node/0.8-SNAPSHOT/airavata-workflow-model-component-node-0.8-SNAPSHOT.pom
[JENKINS] Archiving <https://builds.apache.org/job/Apache%20Airavata/ws/samples/simple-math-service/pom.xml>
to /home/hudson/hudson/jobs/Apache Airavata/modules/org.apache.airavata$airavata-simple-math-service/builds/2013-05-08_22-28-18/archive/org.apache.airavata/airavata-simple-math-service/0.8-SNAPSHOT/airavata-simple-math-service-0.8-SNAPSHOT.pom
[JENKINS] Archiving <https://builds.apache.org/job/Apache%20Airavata/ws/modules/server/pom.xml>
to /home/hudson/hudson/jobs/Apache Airavata/modules/org.apache.airavata$airavata-embedded-tomcat/builds/2013-05-08_22-28-22/archive/org.apache.airavata/airavata-embedded-tomcat/0.8-SNAPSHOT/airavata-embedded-tomcat-0.8-SNAPSHOT.pom
[JENKINS] Archiving <https://builds.apache.org/job/Apache%20Airavata/ws/modules/registry/registry-api/pom.xml>
to /home/hudson/hudson/jobs/Apache Airavata/modules/org.apache.airavata$airavata-registry-api/builds/2013-05-08_22-27-58/archive/org.apache.airavata/airavata-registry-api/0.8-SNAPSHOT/airavata-registry-api-0.8-SNAPSHOT.pom
[JENKINS] Archiving <https://builds.apache.org/job/Apache%20Airavata/ws/modules/ws-messenger/messagebox/pom.xml>
to /home/hudson/hudson/jobs/Apache Airavata/modules/org.apache.airavata$airavata-message-box/builds/2013-05-08_22-27-39/archive/org.apache.airavata/airavata-message-box/0.8-SNAPSHOT/airavata-message-box-0.8-SNAPSHOT.pom
[JENKINS] Archiving <https://builds.apache.org/job/Apache%20Airavata/ws/modules/security/pom.xml>
to /home/hudson/hudson/jobs/Apache Airavata/modules/org.apache.airavata$airavata-security/builds/2013-05-08_22-28-05/archive/org.apache.airavata/airavata-security/0.8-SNAPSHOT/airavata-security-0.8-SNAPSHOT.pom
[JENKINS] Archiving <https://builds.apache.org/job/Apache%20Airavata/ws/tools/phoebus-integration/pom.xml>
to /home/hudson/hudson/jobs/Apache Airavata/modules/org.apache.airavata$airavata-phoebus-integration/builds/2013-05-08_22-28-15/archive/org.apache.airavata/airavata-phoebus-integration/0.8-SNAPSHOT/airavata-phoebus-integration-0.8-SNAPSHOT.pom
[JENKINS] Archiving <https://builds.apache.org/job/Apache%20Airavata/ws/modules/gfac-core/pom.xml>
to /home/hudson/hudson/jobs/Apache Airavata/modules/org.apache.airavata$airavata-gfac-core/builds/2013-05-08_22-27-34/archive/org.apache.airavata/airavata-gfac-core/0.8-SNAPSHOT/airavata-gfac-core-0.8-SNAPSHOT.pom
[JENKINS] Archiving <https://builds.apache.org/job/Apache%20Airavata/ws/modules/distribution/airavata-server/pom.xml>
to /home/hudson/hudson/jobs/Apache Airavata/modules/org.apache.airavata$apache-airavata-server/builds/2013-05-08_22-28-30/archive/org.apache.airavata/apache-airavata-server/0.8-SNAPSHOT/apache-airavata-server-0.8-SNAPSHOT.pom
[JENKINS] Archiving <https://builds.apache.org/job/Apache%20Airavata/ws/modules/registry/airavata-registry-test/pom.xml>
to /home/hudson/hudson/jobs/Apache Airavata/modules/org.apache.airavata$airavata-registry-test/builds/2013-05-08_22-28-02/archive/org.apache.airavata/airavata-registry-test/0.8-SNAPSHOT/airavata-registry-test-0.8-SNAPSHOT.pom
[JENKINS] Archiving <https://builds.apache.org/job/Apache%20Airavata/ws/modules/workflow-model/workflow-model-component/pom.xml>
to /home/hudson/hudson/jobs/Apache Airavata/modules/org.apache.airavata$airavata-workflow-model-component/builds/2013-05-08_22-27-46/archive/org.apache.airavata/airavata-workflow-model-component/0.8-SNAPSHOT/airavata-workflow-model-component-0.8-SNAPSHOT.pom
[JENKINS] Archiving <https://builds.apache.org/job/Apache%20Airavata/ws/modules/xbaya-gui/pom.xml>
to /home/hudson/hudson/jobs/Apache Airavata/modules/org.apache.airavata$airavata-xbaya-gui/builds/2013-05-08_22-27-49/archive/org.apache.airavata/airavata-xbaya-gui/0.8-SNAPSHOT/airavata-xbaya-gui-0.8-SNAPSHOT.pom
[JENKINS] Archiving <https://builds.apache.org/job/Apache%20Airavata/ws/modules/commons/workflow-execution-context/pom.xml>
to /home/hudson/hudson/jobs/Apache Airavata/modules/org.apache.airavata$airavata-workflow-execution-context/builds/2013-05-08_22-27-56/archive/org.apache.airavata/airavata-workflow-execution-context/0.8-SNAPSHOT/airavata-workflow-execution-context-0.8-SNAPSHOT.pom
[JENKINS] Archiving <https://builds.apache.org/job/Apache%20Airavata/ws/modules/integration-tests/pom.xml>
to /home/hudson/hudson/jobs/Apache Airavata/modules/org.apache.airavata$integration-tests/builds/2013-05-08_22-28-35/archive/org.apache.airavata/integration-tests/0.8-SNAPSHOT/integration-tests-0.8-SNAPSHOT.pom
[JENKINS] Archiving <https://builds.apache.org/job/Apache%20Airavata/ws/samples/airavata-client/workflow-run/pom.xml>
to /home/hudson/hudson/jobs/Apache Airavata/modules/org.apache.airavata$samples-workflow-run/builds/2013-05-08_22-28-27/archive/org.apache.airavata/samples-workflow-run/0.8-SNAPSHOT/samples-workflow-run-0.8-SNAPSHOT.pom
[JENKINS] Archiving <https://builds.apache.org/job/Apache%20Airavata/ws/modules/commons/pom.xml>
to /home/hudson/hudson/jobs/Apache Airavata/modules/org.apache.airavata$commons/builds/2013-05-08_22-27-50/archive/org.apache.airavata/commons/0.8-SNAPSHOT/commons-0.8-SNAPSHOT.pom
[JENKINS] Archiving <https://builds.apache.org/job/Apache%20Airavata/ws/modules/ws-messenger/message-monitor/pom.xml>
to /home/hudson/hudson/jobs/Apache Airavata/modules/org.apache.airavata$airavata-message-monitor/builds/2013-05-08_22-27-42/archive/org.apache.airavata/airavata-message-monitor/0.8-SNAPSHOT/airavata-message-monitor-0.8-SNAPSHOT.pom
[JENKINS] Archiving <https://builds.apache.org/job/Apache%20Airavata/ws/modules/registry/pom.xml>
to /home/hudson/hudson/jobs/Apache Airavata/modules/org.apache.airavata$registry/builds/2013-05-08_22-27-57/archive/org.apache.airavata/registry/0.8-SNAPSHOT/registry-0.8-SNAPSHOT.pom
[JENKINS] Archiving <https://builds.apache.org/job/Apache%20Airavata/ws/tools/registry-tool/pom.xml>
to /home/hudson/hudson/jobs/Apache Airavata/modules/org.apache.airavata$registry-tool/builds/2013-05-08_22-28-17/archive/org.apache.airavata/registry-tool/0.8-SNAPSHOT/registry-tool-0.8-SNAPSHOT.pom
[JENKINS] Archiving <https://builds.apache.org/job/Apache%20Airavata/ws/tools/pom.xml>
to /home/hudson/hudson/jobs/Apache Airavata/modules/org.apache.airavata$airavata-tools-parent/builds/2013-05-08_22-28-14/archive/org.apache.airavata/airavata-tools-parent/0.8-SNAPSHOT/airavata-tools-parent-0.8-SNAPSHOT.pom
[JENKINS] Archiving <https://builds.apache.org/job/Apache%20Airavata/ws/samples/airavata-client/pom.xml>
to /home/hudson/hudson/jobs/Apache Airavata/modules/org.apache.airavata$airavata-client-sample/builds/2013-05-08_22-28-25/archive/org.apache.airavata/airavata-client-sample/0.8-SNAPSHOT/airavata-client-sample-0.8-SNAPSHOT.pom
[JENKINS] Archiving <https://builds.apache.org/job/Apache%20Airavata/ws/modules/ws-messenger/pom.xml>
to /home/hudson/hudson/jobs/Apache Airavata/modules/org.apache.airavata$airavata-ws-messenger/builds/2013-05-08_22-27-35/archive/org.apache.airavata/airavata-ws-messenger/0.8-SNAPSHOT/airavata-ws-messenger-0.8-SNAPSHOT.pom
[JENKINS] Archiving <https://builds.apache.org/job/Apache%20Airavata/ws/modules/rest/service/pom.xml>
to /home/hudson/hudson/jobs/Apache Airavata/modules/org.apache.airavata$airavata-rest-services/builds/2013-05-08_22-28-10/archive/org.apache.airavata/airavata-rest-services/0.8-SNAPSHOT/airavata-rest-services-0.8-SNAPSHOT.pom
[JENKINS] Archiving <https://builds.apache.org/job/Apache%20Airavata/ws/modules/rest/webapp/pom.xml>
to /home/hudson/hudson/jobs/Apache Airavata/modules/org.apache.airavata$airavata-rest-service-webapp/builds/2013-05-08_22-28-11/archive/org.apache.airavata/airavata-rest-service-webapp/0.8-SNAPSHOT/airavata-rest-service-webapp-0.8-SNAPSHOT.pom
[JENKINS] Archiving <https://builds.apache.org/job/Apache%20Airavata/ws/samples/airavata-client/create-application/pom.xml>
to /home/hudson/hudson/jobs/Apache Airavata/modules/org.apache.airavata$samples-create-application/builds/2013-05-08_22-28-26/archive/org.apache.airavata/samples-create-application/0.8-SNAPSHOT/samples-create-application-0.8-SNAPSHOT.pom
[JENKINS] Archiving <https://builds.apache.org/job/Apache%20Airavata/ws/modules/distribution/airavata-client/pom.xml>
to /home/hudson/hudson/jobs/Apache Airavata/modules/org.apache.airavata$apache-airavata-client/builds/2013-05-08_22-28-31/archive/org.apache.airavata/apache-airavata-client/0.8-SNAPSHOT/apache-airavata-client-0.8-SNAPSHOT.pom
[JENKINS] Archiving <https://builds.apache.org/job/Apache%20Airavata/ws/modules/registry/airavata-jpa-registry/pom.xml>
to /home/hudson/hudson/jobs/Apache Airavata/modules/org.apache.airavata$airavata-jpa-registry/builds/2013-05-08_22-28-00/archive/org.apache.airavata/airavata-jpa-registry/0.8-SNAPSHOT/airavata-jpa-registry-0.8-SNAPSHOT.pom
[JENKINS] Archiving <https://builds.apache.org/job/Apache%20Airavata/ws/modules/commons/utils/pom.xml>
to /home/hudson/hudson/jobs/Apache Airavata/modules/org.apache.airavata$airavata-common-utils/builds/2013-05-08_22-27-54/archive/org.apache.airavata/airavata-common-utils/0.8-SNAPSHOT/airavata-common-utils-0.8-SNAPSHOT.pom
[JENKINS] Archiving <https://builds.apache.org/job/Apache%20Airavata/ws/samples/levenshtein-distance-service/pom.xml>
to /home/hudson/hudson/jobs/Apache Airavata/modules/org.apache.airavata$airavata-levenshtein-distance-service/builds/2013-05-08_22-28-21/archive/org.apache.airavata/airavata-levenshtein-distance-service/0.8-SNAPSHOT/airavata-levenshtein-distance-service-0.8-SNAPSHOT.pom
[JENKINS] Archiving <https://builds.apache.org/job/Apache%20Airavata/ws/modules/rest/pom.xml>
to /home/hudson/hudson/jobs/Apache Airavata/modules/org.apache.airavata$rest/builds/2013-05-08_22-28-07/archive/org.apache.airavata/rest/0.8-SNAPSHOT/rest-0.8-SNAPSHOT.pom
[JENKINS] Archiving <https://builds.apache.org/job/Apache%20Airavata/ws/modules/distribution/xbaya-gui/pom.xml>
to /home/hudson/hudson/jobs/Apache Airavata/modules/org.apache.airavata$apache-airavata-xbaya-gui/builds/2013-05-08_22-28-33/archive/org.apache.airavata/apache-airavata-xbaya-gui/0.8-SNAPSHOT/apache-airavata-xbaya-gui-0.8-SNAPSHOT.pom
[JENKINS] Archiving <https://builds.apache.org/job/Apache%20Airavata/ws/modules/airavata-client/pom.xml>
to /home/hudson/hudson/jobs/Apache Airavata/modules/org.apache.airavata$airavata-client-api/builds/2013-05-08_22-28-03/archive/org.apache.airavata/airavata-client-api/0.8-SNAPSHOT/airavata-client-api-0.8-SNAPSHOT.pom
[JENKINS] Archiving <https://builds.apache.org/job/Apache%20Airavata/ws/modules/ws-messenger/messagebroker/pom.xml>
to /home/hudson/hudson/jobs/Apache Airavata/modules/org.apache.airavata$airavata-message-broker/builds/2013-05-08_22-27-41/archive/org.apache.airavata/airavata-message-broker/0.8-SNAPSHOT/airavata-message-broker-0.8-SNAPSHOT.pom
[JENKINS] Archiving <https://builds.apache.org/job/Apache%20Airavata/ws/modules/commons/gfac-schema/pom.xml>
to /home/hudson/hudson/jobs/Apache Airavata/modules/org.apache.airavata$airavata-gfac-schema-utils/builds/2013-05-08_22-27-53/archive/org.apache.airavata/airavata-gfac-schema-utils/0.8-SNAPSHOT/airavata-gfac-schema-utils-0.8-SNAPSHOT.pom
[JENKINS] Archiving <https://builds.apache.org/job/Apache%20Airavata/ws/modules/commons/gfac-schema/target/airavata-gfac-schema-utils-0.8-SNAPSHOT.jar>
to /home/hudson/hudson/jobs/Apache Airavata/modules/org.apache.airavata$airavata-gfac-schema-utils/builds/2013-05-08_22-27-53/archive/org.apache.airavata/airavata-gfac-schema-utils/0.8-SNAPSHOT/airavata-gfac-schema-utils-0.8-SNAPSHOT.jar
[JENKINS] Archiving <https://builds.apache.org/job/Apache%20Airavata/ws/modules/rest/mappings/pom.xml>
to /home/hudson/hudson/jobs/Apache Airavata/modules/org.apache.airavata$airavata-rest-mappings/builds/2013-05-08_22-28-09/archive/org.apache.airavata/airavata-rest-mappings/0.8-SNAPSHOT/airavata-rest-mappings-0.8-SNAPSHOT.pom
[JENKINS] Archiving <https://builds.apache.org/job/Apache%20Airavata/ws/modules/workflow-model/pom.xml>
to /home/hudson/hudson/jobs/Apache Airavata/modules/org.apache.airavata$airavata-workflow-model-parent/builds/2013-05-08_22-27-44/archive/org.apache.airavata/airavata-workflow-model-parent/0.8-SNAPSHOT/airavata-workflow-model-parent-0.8-SNAPSHOT.pom
[JENKINS] Archiving <https://builds.apache.org/job/Apache%20Airavata/ws/modules/registry/airavata-registry-service/pom.xml>
to /home/hudson/hudson/jobs/Apache Airavata/modules/org.apache.airavata$airavata-registry-service/builds/2013-05-08_22-28-01/archive/org.apache.airavata/airavata-registry-service/0.8-SNAPSHOT/airavata-registry-service-0.8-SNAPSHOT.pom
[JENKINS] Archiving <https://builds.apache.org/job/Apache%20Airavata/ws/modules/rest/client/pom.xml>
to /home/hudson/hudson/jobs/Apache Airavata/modules/org.apache.airavata$airavata-rest-client/builds/2013-05-08_22-28-12/archive/org.apache.airavata/airavata-rest-client/0.8-SNAPSHOT/airavata-rest-client-0.8-SNAPSHOT.pom
[JENKINS] Archiving <https://builds.apache.org/job/Apache%20Airavata/ws/modules/credential-store/pom.xml>
to /home/hudson/hudson/jobs/Apache Airavata/modules/org.apache.airavata$airavata-credential-store/builds/2013-05-08_22-28-06/archive/org.apache.airavata/airavata-credential-store/0.8-SNAPSHOT/airavata-credential-store-0.8-SNAPSHOT.pom
[JENKINS] Archiving <https://builds.apache.org/job/Apache%20Airavata/ws/modules/ws-messenger/client/pom.xml>
to /home/hudson/hudson/jobs/Apache Airavata/modules/org.apache.airavata$airavata-messenger-client/builds/2013-05-08_22-27-38/archive/org.apache.airavata/airavata-messenger-client/0.8-SNAPSHOT/airavata-messenger-client-0.8-SNAPSHOT.pom
[JENKINS] Archiving <https://builds.apache.org/job/Apache%20Airavata/ws/modules/ws-messenger/commons/pom.xml>
to /home/hudson/hudson/jobs/Apache Airavata/modules/org.apache.airavata$airavata-messenger-commons/builds/2013-05-08_22-27-37/archive/org.apache.airavata/airavata-messenger-commons/0.8-SNAPSHOT/airavata-messenger-commons-0.8-SNAPSHOT.pom
[JENKINS] Archiving <https://builds.apache.org/job/Apache%20Airavata/ws/modules/workflow-model/workflow-model-core/pom.xml>
to /home/hudson/hudson/jobs/Apache Airavata/modules/org.apache.airavata$airavata-workflow-model-core/builds/2013-05-08_22-27-45/archive/org.apache.airavata/airavata-workflow-model-core/0.8-SNAPSHOT/airavata-workflow-model-core-0.8-SNAPSHOT.pom
[JENKINS] Archiving <https://builds.apache.org/job/Apache%20Airavata/ws/modules/test-suite/pom.xml>
to /home/hudson/hudson/jobs/Apache Airavata/modules/org.apache.airavata$test-suite/builds/2013-05-08_22-28-23/archive/org.apache.airavata/test-suite/0.8-SNAPSHOT/test-suite-0.8-SNAPSHOT.pom
[JENKINS] Archiving <https://builds.apache.org/job/Apache%20Airavata/ws/pom.xml> to
/home/hudson/hudson/jobs/Apache Airavata/modules/org.apache.airavata$airavata/builds/2013-05-08_22-27-33/archive/org.apache.airavata/airavata/0.8-SNAPSHOT/airavata-0.8-SNAPSHOT.pom
Waiting for Jenkins to finish collecting data
mavenExecutionResult exceptions not empty
message : Failed to execute goal org.apache.maven.plugins:maven-surefire-plugin:2.12:test
(default-test) on project airavata-common-utils: Error while executing forked tests.; nested
exception is java.io.IOException: Cannot run program "/bin/sh" (in directory "<https://builds.apache.org/job/Apache%20Airavata/ws/modules/commons/utils/target/test-classes")>:
error=12, Not enough space
cause : Error while executing forked tests.; nested exception is java.io.IOException: Cannot
run program "/bin/sh" (in directory "<https://builds.apache.org/job/Apache%20Airavata/ws/modules/commons/utils/target/test-classes")>:
error=12, Not enough space
Stack trace : 
org.apache.maven.lifecycle.LifecycleExecutionException: Failed to execute goal org.apache.maven.plugins:maven-surefire-plugin:2.12:test
(default-test) on project airavata-common-utils: Error while executing forked tests.; nested
exception is java.io.IOException: Cannot run program "/bin/sh" (in directory "<https://builds.apache.org/job/Apache%20Airavata/ws/modules/commons/utils/target/test-classes")>:
error=12, Not enough space
	at org.apache.maven.lifecycle.internal.MojoExecutor.execute(MojoExecutor.java:217)
	at org.apache.maven.lifecycle.internal.MojoExecutor.execute(MojoExecutor.java:153)
	at org.apache.maven.lifecycle.internal.MojoExecutor.execute(MojoExecutor.java:145)
	at org.apache.maven.lifecycle.internal.LifecycleModuleBuilder.buildProject(LifecycleModuleBuilder.java:84)
	at org.apache.maven.lifecycle.internal.LifecycleModuleBuilder.buildProject(LifecycleModuleBuilder.java:59)
	at org.apache.maven.lifecycle.internal.LifecycleStarter.singleThreadedBuild(LifecycleStarter.java:183)
	at org.apache.maven.lifecycle.internal.LifecycleStarter.execute(LifecycleStarter.java:161)
	at org.apache.maven.DefaultMaven.doExecute(DefaultMaven.java:320)
	at org.apache.maven.DefaultMaven.execute(DefaultMaven.java:156)
	at org.jvnet.hudson.maven3.launcher.Maven3Launcher.main(Maven3Launcher.java:79)
	at sun.reflect.NativeMethodAccessorImpl.invoke0(Native Method)
	at sun.reflect.NativeMethodAccessorImpl.invoke(NativeMethodAccessorImpl.java:57)
	at sun.reflect.DelegatingMethodAccessorImpl.invoke(DelegatingMethodAccessorImpl.java:43)
	at java.lang.reflect.Method.invoke(Method.java:601)
	at org.codehaus.plexus.classworlds.launcher.Launcher.launchStandard(Launcher.java:329)
	at org.codehaus.plexus.classworlds.launcher.Launcher.launch(Launcher.java:239)
	at org.jvnet.hudson.maven3.agent.Maven3Main.launch(Maven3Main.java:158)
	at hudson.maven.Maven3Builder.call(Maven3Builder.java:100)
	at hudson.maven.Maven3Builder.call(Maven3Builder.java:66)
	at hudson.remoting.UserRequest.perform(UserRequest.java:118)
	at hudson.remoting.UserRequest.perform(UserRequest.java:48)
	at hudson.remoting.Request$2.run(Request.java:326)
	at hudson.remoting.InterceptingExecutorService$1.call(InterceptingExecutorService.java:72)
	at java.util.concurrent.FutureTask$Sync.innerRun(FutureTask.java:334)
	at java.util.concurrent.FutureTask.run(FutureTask.java:166)
	at java.util.concurrent.ThreadPoolExecutor.runWorker(ThreadPoolExecutor.java:1145)
	at java.util.concurrent.ThreadPoolExecutor$Worker.run(ThreadPoolExecutor.java:615)
	at java.lang.Thread.run(Thread.java:722)
Caused by: org.apache.maven.plugin.MojoExecutionException: Error while executing forked tests.;
nested exception is java.io.IOException: Cannot run program "/bin/sh" (in directory "<https://builds.apache.org/job/Apache%20Airavata/ws/modules/commons/utils/target/test-classes")>:
error=12, Not enough space
	at org.apache.maven.plugin.surefire.SurefirePlugin.assertNoException(SurefirePlugin.java:656)
	at org.apache.maven.plugin.surefire.SurefirePlugin.handleSummary(SurefirePlugin.java:645)
	at org.apache.maven.plugin.surefire.AbstractSurefireMojo.executeAfterPreconditionsChecked(AbstractSurefireMojo.java:137)
	at org.apache.maven.plugin.surefire.AbstractSurefireMojo.execute(AbstractSurefireMojo.java:98)
	at org.apache.maven.plugin.DefaultBuildPluginManager.executeMojo(DefaultBuildPluginManager.java:101)
	at org.apache.maven.lifecycle.internal.MojoExecutor.execute(MojoExecutor.java:209)
	... 27 more
Caused by: org.apache.maven.surefire.booter.SurefireBooterForkException: Error while executing
forked tests.; nested exception is java.io.IOException: Cannot run program "/bin/sh" (in directory
"<https://builds.apache.org/job/Apache%20Airavata/ws/modules/commons/utils/target/test-classes")>:
error=12, Not enough space
	at org.apache.maven.plugin.surefire.booterclient.ForkStarter.fork(ForkStarter.java:294)
	at org.apache.maven.plugin.surefire.booterclient.ForkStarter.run(ForkStarter.java:113)
	at org.apache.maven.plugin.surefire.AbstractSurefireMojo.executeProvider(AbstractSurefireMojo.java:199)
	at org.apache.maven.plugin.surefire.AbstractSurefireMojo.executeAllProviders(AbstractSurefireMojo.java:176)
	at org.apache.maven.plugin.surefire.AbstractSurefireMojo.executeAfterPreconditionsChecked(AbstractSurefireMojo.java:135)
	... 30 more
Caused by: java.io.IOException: Cannot run program "/bin/sh" (in directory "<https://builds.apache.org/job/Apache%20Airavata/ws/modules/commons/utils/target/test-classes")>:
error=12, Not enough space
	at java.lang.ProcessBuilder.start(ProcessBuilder.java:1029)
	at java.lang.Runtime.exec(Runtime.java:615)
	at org.codehaus.plexus.util.cli.Commandline.execute(Commandline.java:651)
	at org.codehaus.plexus.util.cli.CommandLineUtils.executeCommandLineAsCallable(CommandLineUtils.java:140)
	at org.codehaus.plexus.util.cli.CommandLineUtils.executeCommandLine(CommandLineUtils.java:111)
	at org.codehaus.plexus.util.cli.CommandLineUtils.executeCommandLine(CommandLineUtils.java:86)
	at org.apache.maven.plugin.surefire.booterclient.ForkStarter.fork(ForkStarter.java:276)
	... 34 more
Caused by: java.io.IOException: error=12, Not enough space
	at java.lang.UNIXProcess.forkAndExec(Native Method)
	at java.lang.UNIXProcess.<init>(UNIXProcess.java:79)
	at java.lang.ProcessImpl.start(ProcessImpl.java:130)
	at java.lang.ProcessBuilder.start(ProcessBuilder.java:1021)
	... 40 more
Sending e-mails to: dev@airavata.apache.org
channel stopped

Mime
View raw message