airavata-dev mailing list archives

Site index · List index
Message view « Date » · « Thread »
Top « Date » · « Thread »
From Apache Jenkins Server <jenk...@builds.apache.org>
Subject Build failed in Jenkins: Apache Airavata #1107
Date Mon, 08 Apr 2013 21:34:38 GMT
See <https://builds.apache.org/job/Apache%20Airavata/1107/changes>

Changes:

[lahiru] updating README file for 0.7 release

------------------------------------------
[...truncated 3216 lines...]
[INFO] --- xmlbeans-maven-plugin:2.3.3:xmlbeans (generateBindings) @ airavata-workflow-tracking
---
[INFO] 
[INFO] --- maven-remote-resources-plugin:1.4:process (default) @ airavata-workflow-tracking
---
[INFO] 
[INFO] --- maven-resources-plugin:2.5:resources (default-resources) @ airavata-workflow-tracking
---[debug] execute contextualize
[INFO] Using 'UTF-8' encoding to copy filtered resources.
[INFO] Copying 3 resources

[INFO] Copying 475 resources
[INFO] Copying 3 resources
[INFO] 
[INFO] --- maven-compiler-plugin:2.3.2:compile (default-compile) @ airavata-workflow-tracking
---[INFO] Compiling 58 source files to <https://builds.apache.org/job/Apache%20Airavata/ws/modules/commons/workflow-tracking/target/classes>

[INFO] 
[INFO] --- maven-resources-plugin:2.5:testResources (default-testResources) @ airavata-workflow-tracking
---[debug] execute contextualize
[INFO] Using 'UTF-8' encoding to copy filtered resources.
[INFO] Copying 0 resource
[INFO] Copying 3 resources

[INFO] 
[INFO] --- maven-compiler-plugin:2.3.2:testCompile (default-testCompile) @ airavata-workflow-tracking
---[INFO] Nothing to compile - all classes are up to date

[INFO] 
[INFO] --- maven-surefire-plugin:2.12:test (default-test) @ airavata-workflow-tracking ---[INFO]
Surefire report directory: <https://builds.apache.org/job/Apache%20Airavata/ws/modules/commons/workflow-tracking/target/surefire-reports>

-------------------------------------------------------
 T E S T S
-------------------------------------------------------


Results :

Tests run: 0, Failures: 0, Errors: 0, Skipped: 0

[JENKINS] Recording test results
[INFO] 
[INFO] --- maven-jar-plugin:2.4:jar (default-jar) @ airavata-workflow-tracking ---
[INFO] Building jar: <https://builds.apache.org/job/Apache%20Airavata/ws/modules/commons/workflow-tracking/target/airavata-workflow-tracking-0.7-SNAPSHOT.jar>
[INFO] 
[INFO] --- maven-site-plugin:3.2:attach-descriptor (attach-descriptor) @ airavata-workflow-tracking
---
[INFO] [INFO] Installing <https://builds.apache.org/job/Apache%20Airavata/ws/modules/commons/workflow-tracking/target/airavata-workflow-tracking-0.7-SNAPSHOT.jar>
to /export/home/hudson/hudson-slave/maven-repositories/0/org/apache/airavata/airavata-workflow-tracking/0.7-SNAPSHOT/airavata-workflow-tracking-0.7-SNAPSHOT.jar

[INFO] --- maven-install-plugin:2.3.1:install (default-install) @ airavata-workflow-tracking
---[INFO] Installing <https://builds.apache.org/job/Apache%20Airavata/ws/modules/commons/workflow-tracking/pom.xml>
to /export/home/hudson/hudson-slave/maven-repositories/0/org/apache/airavata/airavata-workflow-tracking/0.7-SNAPSHOT/airavata-workflow-tracking-0.7-SNAPSHOT.pom

[INFO]                                                                         
[INFO] ------------------------------------------------------------------------
[INFO] Building Airavata GFac Core 0.7-SNAPSHOT
[INFO] ------------------------------------------------------------------------
Downloading: http://repo1.maven.org/maven2/net/sf/saxon/saxon/9/saxon-9.pom
Downloading: http://community.ucs.indiana.edu:9090/archiva/repository/ogce.m2.all/net/sf/saxon/saxon/9/saxon-9.pom
Downloading: http://cilogon.svn.sourceforge.net/viewvc/cilogon/m2-repo/net/sf/saxon/saxon/9/saxon-9.pom
Downloading: http://people.apache.org/repo/m2-snapshot-repository/net/sf/saxon/saxon/9/saxon-9.pom
Downloading: http://unicore-dev.zam.kfa-juelich.de/maven/net/sf/saxon/saxon/9/saxon-9.pom
[WARNING] The POM for net.sf.saxon:saxon:jar:9 is missing, no dependency information available
[INFO] 
[INFO] --- maven-clean-plugin:2.5:clean (default-clean) @ airavata-gfac-core ---
[INFO] 
[INFO] --- maven-resources-plugin:2.5:copy-resources (copy-resources) @ airavata-gfac-core
---[debug] execute contextualize
[INFO] Using 'UTF-8' encoding to copy filtered resources.
[INFO] skip non existing resourceDirectory <https://builds.apache.org/job/Apache%20Airavata/ws/modules/gfac-core/src/main/assembly/dist>

[INFO] 
[INFO] --- maven-remote-resources-plugin:1.4:process (default) @ airavata-gfac-core ---Downloading:
http://repo1.maven.org/maven2/net/sf/saxon/saxon/9/saxon-9.pom
Downloading: http://community.ucs.indiana.edu:9090/archiva/repository/ogce.m2.all/net/sf/saxon/saxon/9/saxon-9.pom
Downloading: http://cilogon.svn.sourceforge.net/viewvc/cilogon/m2-repo/net/sf/saxon/saxon/9/saxon-9.pom
Downloading: http://people.apache.org/repo/m2-snapshot-repository/net/sf/saxon/saxon/9/saxon-9.pom

Downloading: http://unicore-dev.zam.kfa-juelich.de/maven/net/sf/saxon/saxon/9/saxon-9.pom
[WARNING] Missing POM for net.sf.saxon:saxon:jar:9
[INFO] 
[INFO] --- maven-resources-plugin:2.5:resources (default-resources) @ airavata-gfac-core ---[debug]
execute contextualize
[INFO] Using 'UTF-8' encoding to copy filtered resources.
[INFO] Copying 1 resource
[INFO] Copying 3 resources

[INFO] 
[INFO] --- maven-compiler-plugin:2.3.2:compile (default-compile) @ airavata-gfac-core ---[INFO]
Compiling 81 source files to <https://builds.apache.org/job/Apache%20Airavata/ws/modules/gfac-core/target/classes>

[INFO] -------------------------------------------------------------
[ERROR] COMPILATION ERROR : 
[INFO] -------------------------------------------------------------
[ERROR] error: error reading /export/home/hudson/hudson-slave/maven-repositories/0/net/sf/saxon/saxon/9.1.0.8/saxon-9.1.0.8.jar;
error in opening zip file
[INFO] 1 error
[INFO] -------------------------------------------------------------
[INFO] ------------------------------------------------------------------------
[INFO] Reactor Summary:
[INFO] 
[INFO] Airavata .......................................... SUCCESS [2:07.382s]
[INFO] Airavata Commons .................................. SUCCESS [9.767s]
[INFO] Airavata GFac Schema Utilities .................... SUCCESS [1:20.950s]
[INFO] Airavata Common Utilities ......................... SUCCESS [28.601s]
[INFO] Airavata Registry ................................. SUCCESS [6.610s]
[INFO] Airavata Registry API ............................. SUCCESS [16.634s]
[INFO] Airavata Workflow Model Parent .................... SUCCESS [4.989s]
[INFO] Airavata Workflow Model Core ...................... SUCCESS [20.467s]
[INFO] Airavata WS Messenger ............................. SUCCESS [5.617s]
[INFO] Airavata Messenger Commons ........................ SUCCESS [18.763s]
[INFO] Airavata Messenger Client ......................... SUCCESS [18.415s]
[INFO] Airavata WS Monitor ............................... SUCCESS [13.272s]
[INFO] Airavata Workflow Execution Context ............... SUCCESS [29.464s]
[INFO] Airavata Client ................................... SUCCESS [16.119s]
[INFO] Airavata Workflow Tracking ........................ SUCCESS [23.583s]
[INFO] Airavata GFac Core ................................ FAILURE [28.016s]
[INFO] Airavata Message Box .............................. SKIPPED
[INFO] Airavata Message Broker ........................... SKIPPED
[INFO] Airavata Workflow Component ....................... SKIPPED
[INFO] Airavata Workflow Component Node .................. SKIPPED
[INFO] Airavata JPA Registry ............................. SKIPPED
[INFO] Airavata REST ..................................... SKIPPED
[INFO] airavata-rest-mappings ............................ SKIPPED
[INFO] airavata-rest-client .............................. SKIPPED
[INFO] Airavata XBaya .................................... SKIPPED
[INFO] Airavata Registry Service ......................... SKIPPED
[INFO] Airavata Registry Test ............................ SKIPPED
[INFO] Airavata Security Implementation .................. SKIPPED
[INFO] Airavata Credential Store ......................... SKIPPED
[INFO] airavata-rest-services ............................ SKIPPED
[INFO] airavata-rest-service-webapp ...................... SKIPPED
[INFO] Airavata Tools .................................... SKIPPED
[INFO] Airavata Phoebus Integration ...................... SKIPPED
[INFO] registry-tool ..................................... SKIPPED
[INFO] Simple Math Service ............................... SKIPPED
[INFO] Complex Math Service .............................. SKIPPED
[INFO] Levenshtein Distance Service ...................... SKIPPED
[INFO] Airavata Embedded Tomcat Implementation ........... SKIPPED
[INFO] Airavata Test Suite ............................... SKIPPED
[INFO] distribution ...................................... SKIPPED
[INFO] Samples - Airavata Client Samples ................. SKIPPED
[INFO] Samples - Workflow Create Application ............. SKIPPED
[INFO] Samples - Workflow Execution ...................... SKIPPED
[INFO] Airavata server distribution ...................... SKIPPED
[INFO] Airavata client distribution ...................... SKIPPED
[INFO] Airavata xbaya-gui distribution ................... SKIPPED
[INFO] Airavata release artifacts ........................ SKIPPED
[INFO] Airavata Integration Tests ........................ SKIPPED
[INFO] ------------------------------------------------------------------------
[INFO] BUILD FAILURE
[INFO] ------------------------------------------------------------------------
[INFO] Total time: 8:26.951s
[INFO] Finished at: Mon Apr 08 21:32:11 GMT+00:00 2013
[INFO] Final Memory: 120M/462M
[INFO] ------------------------------------------------------------------------
[JENKINS] Archiving <https://builds.apache.org/job/Apache%20Airavata/ws/modules/distribution/release/pom.xml>
to /home/hudson/hudson/jobs/Apache Airavata/modules/org.apache.airavata$apache-airavata-release-artifacts/builds/2013-04-08_21-20-25/archive/org.apache.airavata/apache-airavata-release-artifacts/0.7-SNAPSHOT/apache-airavata-release-artifacts-0.7-SNAPSHOT.pom
[JENKINS] Archiving <https://builds.apache.org/job/Apache%20Airavata/ws/modules/commons/workflow-tracking/pom.xml>
to /home/hudson/hudson/jobs/Apache Airavata/modules/org.apache.airavata$airavata-workflow-tracking/builds/2013-04-08_21-20-13/archive/org.apache.airavata/airavata-workflow-tracking/0.7-SNAPSHOT/airavata-workflow-tracking-0.7-SNAPSHOT.pom
[JENKINS] Archiving <https://builds.apache.org/job/Apache%20Airavata/ws/modules/commons/workflow-tracking/target/airavata-workflow-tracking-0.7-SNAPSHOT.jar>
to /home/hudson/hudson/jobs/Apache Airavata/modules/org.apache.airavata$airavata-workflow-tracking/builds/2013-04-08_21-20-13/archive/org.apache.airavata/airavata-workflow-tracking/0.7-SNAPSHOT/airavata-workflow-tracking-0.7-SNAPSHOT.jar
[JENKINS] Archiving <https://builds.apache.org/job/Apache%20Airavata/ws/samples/complex-math-service/pom.xml>
to /home/hudson/hudson/jobs/Apache Airavata/modules/org.apache.airavata$airavata-complex-math-service/builds/2013-04-08_21-20-22/archive/org.apache.airavata/airavata-complex-math-service/0.7-SNAPSHOT/airavata-complex-math-service-0.7-SNAPSHOT.pom
[JENKINS] Archiving <https://builds.apache.org/job/Apache%20Airavata/ws/modules/distribution/pom.xml>
to /home/hudson/hudson/jobs/Apache Airavata/modules/org.apache.airavata$distribution/builds/2013-04-08_21-20-24/archive/org.apache.airavata/distribution/0.7-SNAPSHOT/distribution-0.7-SNAPSHOT.pom
[JENKINS] Archiving <https://builds.apache.org/job/Apache%20Airavata/ws/modules/workflow-model/workflow-model-component-node/pom.xml>
to /home/hudson/hudson/jobs/Apache Airavata/modules/org.apache.airavata$airavata-workflow-model-component-node/builds/2013-04-08_21-20-12/archive/org.apache.airavata/airavata-workflow-model-component-node/0.7-SNAPSHOT/airavata-workflow-model-component-node-0.7-SNAPSHOT.pom
[JENKINS] Archiving <https://builds.apache.org/job/Apache%20Airavata/ws/samples/simple-math-service/pom.xml>
to /home/hudson/hudson/jobs/Apache Airavata/modules/org.apache.airavata$airavata-simple-math-service/builds/2013-04-08_21-20-22/archive/org.apache.airavata/airavata-simple-math-service/0.7-SNAPSHOT/airavata-simple-math-service-0.7-SNAPSHOT.pom
[JENKINS] Archiving <https://builds.apache.org/job/Apache%20Airavata/ws/modules/server/pom.xml>
to /home/hudson/hudson/jobs/Apache Airavata/modules/org.apache.airavata$airavata-embedded-tomcat/builds/2013-04-08_21-20-23/archive/org.apache.airavata/airavata-embedded-tomcat/0.7-SNAPSHOT/airavata-embedded-tomcat-0.7-SNAPSHOT.pom
[JENKINS] Archiving <https://builds.apache.org/job/Apache%20Airavata/ws/modules/registry/registry-api/pom.xml>
to /home/hudson/hudson/jobs/Apache Airavata/modules/org.apache.airavata$airavata-registry-api/builds/2013-04-08_21-20-14/archive/org.apache.airavata/airavata-registry-api/0.7-SNAPSHOT/airavata-registry-api-0.7-SNAPSHOT.pom
[JENKINS] Archiving <https://builds.apache.org/job/Apache%20Airavata/ws/modules/registry/registry-api/target/airavata-registry-api-0.7-SNAPSHOT.jar>
to /home/hudson/hudson/jobs/Apache Airavata/modules/org.apache.airavata$airavata-registry-api/builds/2013-04-08_21-20-14/archive/org.apache.airavata/airavata-registry-api/0.7-SNAPSHOT/airavata-registry-api-0.7-SNAPSHOT.jar
[JENKINS] Archiving <https://builds.apache.org/job/Apache%20Airavata/ws/modules/ws-messenger/messagebox/pom.xml>
to /home/hudson/hudson/jobs/Apache Airavata/modules/org.apache.airavata$airavata-message-box/builds/2013-04-08_21-20-10/archive/org.apache.airavata/airavata-message-box/0.7-SNAPSHOT/airavata-message-box-0.7-SNAPSHOT.pom
[JENKINS] Archiving <https://builds.apache.org/job/Apache%20Airavata/ws/modules/security/pom.xml>
to /home/hudson/hudson/jobs/Apache Airavata/modules/org.apache.airavata$airavata-security/builds/2013-04-08_21-20-16/archive/org.apache.airavata/airavata-security/0.7-SNAPSHOT/airavata-security-0.7-SNAPSHOT.pom
[JENKINS] Archiving <https://builds.apache.org/job/Apache%20Airavata/ws/tools/phoebus-integration/pom.xml>
to /home/hudson/hudson/jobs/Apache Airavata/modules/org.apache.airavata$airavata-phoebus-integration/builds/2013-04-08_21-20-21/archive/org.apache.airavata/airavata-phoebus-integration/0.7-SNAPSHOT/airavata-phoebus-integration-0.7-SNAPSHOT.pom
[JENKINS] Archiving <https://builds.apache.org/job/Apache%20Airavata/ws/modules/gfac-core/pom.xml>
to /home/hudson/hudson/jobs/Apache Airavata/modules/org.apache.airavata$airavata-gfac-core/builds/2013-04-08_21-20-08/archive/org.apache.airavata/airavata-gfac-core/0.7-SNAPSHOT/airavata-gfac-core-0.7-SNAPSHOT.pom
[JENKINS] Archiving <https://builds.apache.org/job/Apache%20Airavata/ws/modules/distribution/airavata-server/pom.xml>
to /home/hudson/hudson/jobs/Apache Airavata/modules/org.apache.airavata$apache-airavata-server/builds/2013-04-08_21-20-25/archive/org.apache.airavata/apache-airavata-server/0.7-SNAPSHOT/apache-airavata-server-0.7-SNAPSHOT.pom
[JENKINS] Archiving <https://builds.apache.org/job/Apache%20Airavata/ws/modules/registry/airavata-registry-test/pom.xml>
to /home/hudson/hudson/jobs/Apache Airavata/modules/org.apache.airavata$airavata-registry-test/builds/2013-04-08_21-20-15/archive/org.apache.airavata/airavata-registry-test/0.7-SNAPSHOT/airavata-registry-test-0.7-SNAPSHOT.pom
[JENKINS] Archiving <https://builds.apache.org/job/Apache%20Airavata/ws/modules/workflow-model/workflow-model-component/pom.xml>
to /home/hudson/hudson/jobs/Apache Airavata/modules/org.apache.airavata$airavata-workflow-model-component/builds/2013-04-08_21-20-12/archive/org.apache.airavata/airavata-workflow-model-component/0.7-SNAPSHOT/airavata-workflow-model-component-0.7-SNAPSHOT.pom
[JENKINS] Archiving <https://builds.apache.org/job/Apache%20Airavata/ws/modules/xbaya-gui/pom.xml>
to /home/hudson/hudson/jobs/Apache Airavata/modules/org.apache.airavata$airavata-xbaya-gui/builds/2013-04-08_21-20-12/archive/org.apache.airavata/airavata-xbaya-gui/0.7-SNAPSHOT/airavata-xbaya-gui-0.7-SNAPSHOT.pom
[JENKINS] Archiving <https://builds.apache.org/job/Apache%20Airavata/ws/modules/commons/workflow-execution-context/pom.xml>
to /home/hudson/hudson/jobs/Apache Airavata/modules/org.apache.airavata$airavata-workflow-execution-context/builds/2013-04-08_21-20-14/archive/org.apache.airavata/airavata-workflow-execution-context/0.7-SNAPSHOT/airavata-workflow-execution-context-0.7-SNAPSHOT.pom
[JENKINS] Archiving <https://builds.apache.org/job/Apache%20Airavata/ws/modules/commons/workflow-execution-context/target/airavata-workflow-execution-context-0.7-SNAPSHOT.jar>
to /home/hudson/hudson/jobs/Apache Airavata/modules/org.apache.airavata$airavata-workflow-execution-context/builds/2013-04-08_21-20-14/archive/org.apache.airavata/airavata-workflow-execution-context/0.7-SNAPSHOT/airavata-workflow-execution-context-0.7-SNAPSHOT.jar
[JENKINS] Archiving <https://builds.apache.org/job/Apache%20Airavata/ws/modules/integration-tests/pom.xml>
to /home/hudson/hudson/jobs/Apache Airavata/modules/org.apache.airavata$integration-tests/builds/2013-04-08_21-20-25/archive/org.apache.airavata/integration-tests/0.7-SNAPSHOT/integration-tests-0.7-SNAPSHOT.pom
[JENKINS] Archiving <https://builds.apache.org/job/Apache%20Airavata/ws/samples/airavata-client/workflow-run/pom.xml>
to /home/hudson/hudson/jobs/Apache Airavata/modules/org.apache.airavata$samples-workflow-run/builds/2013-04-08_21-20-24/archive/org.apache.airavata/samples-workflow-run/0.7-SNAPSHOT/samples-workflow-run-0.7-SNAPSHOT.pom
[JENKINS] Archiving <https://builds.apache.org/job/Apache%20Airavata/ws/modules/commons/pom.xml>
to /home/hudson/hudson/jobs/Apache Airavata/modules/org.apache.airavata$commons/builds/2013-04-08_21-20-13/archive/org.apache.airavata/commons/0.7-SNAPSHOT/commons-0.7-SNAPSHOT.pom
[JENKINS] Archiving <https://builds.apache.org/job/Apache%20Airavata/ws/modules/ws-messenger/message-monitor/pom.xml>
to /home/hudson/hudson/jobs/Apache Airavata/modules/org.apache.airavata$airavata-message-monitor/builds/2013-04-08_21-20-11/archive/org.apache.airavata/airavata-message-monitor/0.7-SNAPSHOT/airavata-message-monitor-0.7-SNAPSHOT.pom
[JENKINS] Archiving <https://builds.apache.org/job/Apache%20Airavata/ws/modules/ws-messenger/message-monitor/target/airavata-message-monitor-0.7-SNAPSHOT.jar>
to /home/hudson/hudson/jobs/Apache Airavata/modules/org.apache.airavata$airavata-message-monitor/builds/2013-04-08_21-20-11/archive/org.apache.airavata/airavata-message-monitor/0.7-SNAPSHOT/airavata-message-monitor-0.7-SNAPSHOT.jar
[JENKINS] Archiving <https://builds.apache.org/job/Apache%20Airavata/ws/modules/registry/pom.xml>
to /home/hudson/hudson/jobs/Apache Airavata/modules/org.apache.airavata$registry/builds/2013-04-08_21-20-14/archive/org.apache.airavata/registry/0.7-SNAPSHOT/registry-0.7-SNAPSHOT.pom
[JENKINS] Archiving <https://builds.apache.org/job/Apache%20Airavata/ws/tools/registry-tool/pom.xml>
to /home/hudson/hudson/jobs/Apache Airavata/modules/org.apache.airavata$registry-tool/builds/2013-04-08_21-20-21/archive/org.apache.airavata/registry-tool/0.7-SNAPSHOT/registry-tool-0.7-SNAPSHOT.pom
[JENKINS] Archiving <https://builds.apache.org/job/Apache%20Airavata/ws/tools/pom.xml>
to /home/hudson/hudson/jobs/Apache Airavata/modules/org.apache.airavata$airavata-tools-parent/builds/2013-04-08_21-20-20/archive/org.apache.airavata/airavata-tools-parent/0.7-SNAPSHOT/airavata-tools-parent-0.7-SNAPSHOT.pom
[JENKINS] Archiving <https://builds.apache.org/job/Apache%20Airavata/ws/samples/airavata-client/pom.xml>
to /home/hudson/hudson/jobs/Apache Airavata/modules/org.apache.airavata$airavata-client-sample/builds/2013-04-08_21-20-24/archive/org.apache.airavata/airavata-client-sample/0.7-SNAPSHOT/airavata-client-sample-0.7-SNAPSHOT.pom
[JENKINS] Archiving <https://builds.apache.org/job/Apache%20Airavata/ws/modules/ws-messenger/pom.xml>
to /home/hudson/hudson/jobs/Apache Airavata/modules/org.apache.airavata$airavata-ws-messenger/builds/2013-04-08_21-20-09/archive/org.apache.airavata/airavata-ws-messenger/0.7-SNAPSHOT/airavata-ws-messenger-0.7-SNAPSHOT.pom
[JENKINS] Archiving <https://builds.apache.org/job/Apache%20Airavata/ws/modules/rest/service/pom.xml>
to /home/hudson/hudson/jobs/Apache Airavata/modules/org.apache.airavata$airavata-rest-services/builds/2013-04-08_21-20-19/archive/org.apache.airavata/airavata-rest-services/0.7-SNAPSHOT/airavata-rest-services-0.7-SNAPSHOT.pom
[JENKINS] Archiving <https://builds.apache.org/job/Apache%20Airavata/ws/modules/rest/webapp/pom.xml>
to /home/hudson/hudson/jobs/Apache Airavata/modules/org.apache.airavata$airavata-rest-service-webapp/builds/2013-04-08_21-20-19/archive/org.apache.airavata/airavata-rest-service-webapp/0.7-SNAPSHOT/airavata-rest-service-webapp-0.7-SNAPSHOT.pom
[JENKINS] Archiving <https://builds.apache.org/job/Apache%20Airavata/ws/samples/airavata-client/create-application/pom.xml>
to /home/hudson/hudson/jobs/Apache Airavata/modules/org.apache.airavata$samples-create-application/builds/2013-04-08_21-20-24/archive/org.apache.airavata/samples-create-application/0.7-SNAPSHOT/samples-create-application-0.7-SNAPSHOT.pom
[JENKINS] Archiving <https://builds.apache.org/job/Apache%20Airavata/ws/modules/distribution/airavata-client/pom.xml>
to /home/hudson/hudson/jobs/Apache Airavata/modules/org.apache.airavata$apache-airavata-client/builds/2013-04-08_21-20-25/archive/org.apache.airavata/apache-airavata-client/0.7-SNAPSHOT/apache-airavata-client-0.7-SNAPSHOT.pom
[JENKINS] Archiving <https://builds.apache.org/job/Apache%20Airavata/ws/modules/registry/airavata-jpa-registry/pom.xml>
to /home/hudson/hudson/jobs/Apache Airavata/modules/org.apache.airavata$airavata-jpa-registry/builds/2013-04-08_21-20-14/archive/org.apache.airavata/airavata-jpa-registry/0.7-SNAPSHOT/airavata-jpa-registry-0.7-SNAPSHOT.pom
[JENKINS] Archiving <https://builds.apache.org/job/Apache%20Airavata/ws/modules/commons/utils/pom.xml>
to /home/hudson/hudson/jobs/Apache Airavata/modules/org.apache.airavata$airavata-common-utils/builds/2013-04-08_21-20-13/archive/org.apache.airavata/airavata-common-utils/0.7-SNAPSHOT/airavata-common-utils-0.7-SNAPSHOT.pom
[JENKINS] Archiving <https://builds.apache.org/job/Apache%20Airavata/ws/modules/commons/utils/target/airavata-common-utils-0.7-SNAPSHOT.jar>
to /home/hudson/hudson/jobs/Apache Airavata/modules/org.apache.airavata$airavata-common-utils/builds/2013-04-08_21-20-13/archive/org.apache.airavata/airavata-common-utils/0.7-SNAPSHOT/airavata-common-utils-0.7-SNAPSHOT.jar
[JENKINS] Archiving <https://builds.apache.org/job/Apache%20Airavata/ws/samples/levenshtein-distance-service/pom.xml>
to /home/hudson/hudson/jobs/Apache Airavata/modules/org.apache.airavata$airavata-levenshtein-distance-service/builds/2013-04-08_21-20-23/archive/org.apache.airavata/airavata-levenshtein-distance-service/0.7-SNAPSHOT/airavata-levenshtein-distance-service-0.7-SNAPSHOT.pom
[JENKINS] Archiving <https://builds.apache.org/job/Apache%20Airavata/ws/modules/rest/pom.xml>
to /home/hudson/hudson/jobs/Apache Airavata/modules/org.apache.airavata$rest/builds/2013-04-08_21-20-17/archive/org.apache.airavata/rest/0.7-SNAPSHOT/rest-0.7-SNAPSHOT.pom
[JENKINS] Archiving <https://builds.apache.org/job/Apache%20Airavata/ws/modules/distribution/xbaya-gui/pom.xml>
to /home/hudson/hudson/jobs/Apache Airavata/modules/org.apache.airavata$apache-airavata-xbaya-gui/builds/2013-04-08_21-20-25/archive/org.apache.airavata/apache-airavata-xbaya-gui/0.7-SNAPSHOT/apache-airavata-xbaya-gui-0.7-SNAPSHOT.pom
[JENKINS] Archiving <https://builds.apache.org/job/Apache%20Airavata/ws/modules/airavata-client/pom.xml>
to /home/hudson/hudson/jobs/Apache Airavata/modules/org.apache.airavata$airavata-client-api/builds/2013-04-08_21-20-16/archive/org.apache.airavata/airavata-client-api/0.7-SNAPSHOT/airavata-client-api-0.7-SNAPSHOT.pom
[JENKINS] Archiving <https://builds.apache.org/job/Apache%20Airavata/ws/modules/airavata-client/target/airavata-client-api-0.7-SNAPSHOT.jar>
to /home/hudson/hudson/jobs/Apache Airavata/modules/org.apache.airavata$airavata-client-api/builds/2013-04-08_21-20-16/archive/org.apache.airavata/airavata-client-api/0.7-SNAPSHOT/airavata-client-api-0.7-SNAPSHOT.jar
[JENKINS] Archiving <https://builds.apache.org/job/Apache%20Airavata/ws/modules/ws-messenger/messagebroker/pom.xml>
to /home/hudson/hudson/jobs/Apache Airavata/modules/org.apache.airavata$airavata-message-broker/builds/2013-04-08_21-20-10/archive/org.apache.airavata/airavata-message-broker/0.7-SNAPSHOT/airavata-message-broker-0.7-SNAPSHOT.pom
[JENKINS] Archiving <https://builds.apache.org/job/Apache%20Airavata/ws/modules/commons/gfac-schema/pom.xml>
to /home/hudson/hudson/jobs/Apache Airavata/modules/org.apache.airavata$airavata-gfac-schema-utils/builds/2013-04-08_21-20-13/archive/org.apache.airavata/airavata-gfac-schema-utils/0.7-SNAPSHOT/airavata-gfac-schema-utils-0.7-SNAPSHOT.pom
[JENKINS] Archiving <https://builds.apache.org/job/Apache%20Airavata/ws/modules/commons/gfac-schema/target/airavata-gfac-schema-utils-0.7-SNAPSHOT.jar>
to /home/hudson/hudson/jobs/Apache Airavata/modules/org.apache.airavata$airavata-gfac-schema-utils/builds/2013-04-08_21-20-13/archive/org.apache.airavata/airavata-gfac-schema-utils/0.7-SNAPSHOT/airavata-gfac-schema-utils-0.7-SNAPSHOT.jar
[JENKINS] Archiving <https://builds.apache.org/job/Apache%20Airavata/ws/modules/rest/mappings/pom.xml>
to /home/hudson/hudson/jobs/Apache Airavata/modules/org.apache.airavata$airavata-rest-mappings/builds/2013-04-08_21-20-18/archive/org.apache.airavata/airavata-rest-mappings/0.7-SNAPSHOT/airavata-rest-mappings-0.7-SNAPSHOT.pom
[JENKINS] Archiving <https://builds.apache.org/job/Apache%20Airavata/ws/modules/workflow-model/pom.xml>
to /home/hudson/hudson/jobs/Apache Airavata/modules/org.apache.airavata$airavata-workflow-model-parent/builds/2013-04-08_21-20-11/archive/org.apache.airavata/airavata-workflow-model-parent/0.7-SNAPSHOT/airavata-workflow-model-parent-0.7-SNAPSHOT.pom
[JENKINS] Archiving <https://builds.apache.org/job/Apache%20Airavata/ws/modules/registry/airavata-registry-service/pom.xml>
to /home/hudson/hudson/jobs/Apache Airavata/modules/org.apache.airavata$airavata-registry-service/builds/2013-04-08_21-20-15/archive/org.apache.airavata/airavata-registry-service/0.7-SNAPSHOT/airavata-registry-service-0.7-SNAPSHOT.pom
[JENKINS] Archiving <https://builds.apache.org/job/Apache%20Airavata/ws/modules/rest/client/pom.xml>
to /home/hudson/hudson/jobs/Apache Airavata/modules/org.apache.airavata$airavata-rest-client/builds/2013-04-08_21-20-20/archive/org.apache.airavata/airavata-rest-client/0.7-SNAPSHOT/airavata-rest-client-0.7-SNAPSHOT.pom
[JENKINS] Archiving <https://builds.apache.org/job/Apache%20Airavata/ws/modules/credential-store/pom.xml>
to /home/hudson/hudson/jobs/Apache Airavata/modules/org.apache.airavata$airavata-credential-store/builds/2013-04-08_21-20-17/archive/org.apache.airavata/airavata-credential-store/0.7-SNAPSHOT/airavata-credential-store-0.7-SNAPSHOT.pom
[JENKINS] Archiving <https://builds.apache.org/job/Apache%20Airavata/ws/modules/ws-messenger/client/pom.xml>
to /home/hudson/hudson/jobs/Apache Airavata/modules/org.apache.airavata$airavata-messenger-client/builds/2013-04-08_21-20-10/archive/org.apache.airavata/airavata-messenger-client/0.7-SNAPSHOT/airavata-messenger-client-0.7-SNAPSHOT.pom
[JENKINS] Archiving <https://builds.apache.org/job/Apache%20Airavata/ws/modules/ws-messenger/client/target/airavata-messenger-client-0.7-SNAPSHOT.jar>
to /home/hudson/hudson/jobs/Apache Airavata/modules/org.apache.airavata$airavata-messenger-client/builds/2013-04-08_21-20-10/archive/org.apache.airavata/airavata-messenger-client/0.7-SNAPSHOT/airavata-messenger-client-0.7-SNAPSHOT.jar
[JENKINS] Archiving <https://builds.apache.org/job/Apache%20Airavata/ws/modules/ws-messenger/commons/pom.xml>
to /home/hudson/hudson/jobs/Apache Airavata/modules/org.apache.airavata$airavata-messenger-commons/builds/2013-04-08_21-20-09/archive/org.apache.airavata/airavata-messenger-commons/0.7-SNAPSHOT/airavata-messenger-commons-0.7-SNAPSHOT.pom
[JENKINS] Archiving <https://builds.apache.org/job/Apache%20Airavata/ws/modules/ws-messenger/commons/target/airavata-messenger-commons-0.7-SNAPSHOT.jar>
to /home/hudson/hudson/jobs/Apache Airavata/modules/org.apache.airavata$airavata-messenger-commons/builds/2013-04-08_21-20-09/archive/org.apache.airavata/airavata-messenger-commons/0.7-SNAPSHOT/airavata-messenger-commons-0.7-SNAPSHOT.jar
[JENKINS] Archiving <https://builds.apache.org/job/Apache%20Airavata/ws/modules/workflow-model/workflow-model-core/pom.xml>
to /home/hudson/hudson/jobs/Apache Airavata/modules/org.apache.airavata$airavata-workflow-model-core/builds/2013-04-08_21-20-11/archive/org.apache.airavata/airavata-workflow-model-core/0.7-SNAPSHOT/airavata-workflow-model-core-0.7-SNAPSHOT.pom
[JENKINS] Archiving <https://builds.apache.org/job/Apache%20Airavata/ws/modules/workflow-model/workflow-model-core/target/airavata-workflow-model-core-0.7-SNAPSHOT.jar>
to /home/hudson/hudson/jobs/Apache Airavata/modules/org.apache.airavata$airavata-workflow-model-core/builds/2013-04-08_21-20-11/archive/org.apache.airavata/airavata-workflow-model-core/0.7-SNAPSHOT/airavata-workflow-model-core-0.7-SNAPSHOT.jar
[JENKINS] Archiving <https://builds.apache.org/job/Apache%20Airavata/ws/modules/test-suite/pom.xml>
to /home/hudson/hudson/jobs/Apache Airavata/modules/org.apache.airavata$test-suite/builds/2013-04-08_21-20-23/archive/org.apache.airavata/test-suite/0.7-SNAPSHOT/test-suite-0.7-SNAPSHOT.pom
[JENKINS] Archiving <https://builds.apache.org/job/Apache%20Airavata/ws/pom.xml> to
/home/hudson/hudson/jobs/Apache Airavata/modules/org.apache.airavata$airavata/builds/2013-04-08_21-20-08/archive/org.apache.airavata/airavata/0.7-SNAPSHOT/airavata-0.7-SNAPSHOT.pom
mavenExecutionResult exceptions not empty
message : Failed to execute goal org.apache.maven.plugins:maven-compiler-plugin:2.3.2:compile
(default-compile) on project airavata-gfac-core: Compilation failure
error: error reading /export/home/hudson/hudson-slave/maven-repositories/0/net/sf/saxon/saxon/9.1.0.8/saxon-9.1.0.8.jar;
error in opening zip file

cause : Compilation failure
error: error reading /export/home/hudson/hudson-slave/maven-repositories/0/net/sf/saxon/saxon/9.1.0.8/saxon-9.1.0.8.jar;
error in opening zip file

Stack trace : 
org.apache.maven.lifecycle.LifecycleExecutionException: Failed to execute goal org.apache.maven.plugins:maven-compiler-plugin:2.3.2:compile
(default-compile) on project airavata-gfac-core: Compilation failure
error: error reading /export/home/hudson/hudson-slave/maven-repositories/0/net/sf/saxon/saxon/9.1.0.8/saxon-9.1.0.8.jar;
error in opening zip file

	at org.apache.maven.lifecycle.internal.MojoExecutor.execute(MojoExecutor.java:213)
	at org.apache.maven.lifecycle.internal.MojoExecutor.execute(MojoExecutor.java:153)
	at org.apache.maven.lifecycle.internal.MojoExecutor.execute(MojoExecutor.java:145)
	at org.apache.maven.lifecycle.internal.LifecycleModuleBuilder.buildProject(LifecycleModuleBuilder.java:84)
	at org.apache.maven.lifecycle.internal.LifecycleModuleBuilder.buildProject(LifecycleModuleBuilder.java:59)
	at org.apache.maven.lifecycle.internal.LifecycleStarter.singleThreadedBuild(LifecycleStarter.java:183)
	at org.apache.maven.lifecycle.internal.LifecycleStarter.execute(LifecycleStarter.java:161)
	at org.apache.maven.DefaultMaven.doExecute(DefaultMaven.java:319)
	at org.apache.maven.DefaultMaven.execute(DefaultMaven.java:156)
	at org.jvnet.hudson.maven3.launcher.Maven3Launcher.main(Maven3Launcher.java:79)
	at sun.reflect.NativeMethodAccessorImpl.invoke0(Native Method)
	at sun.reflect.NativeMethodAccessorImpl.invoke(NativeMethodAccessorImpl.java:57)
	at sun.reflect.DelegatingMethodAccessorImpl.invoke(DelegatingMethodAccessorImpl.java:43)
	at java.lang.reflect.Method.invoke(Method.java:601)
	at org.codehaus.plexus.classworlds.launcher.Launcher.launchStandard(Launcher.java:329)
	at org.codehaus.plexus.classworlds.launcher.Launcher.launch(Launcher.java:239)
	at org.jvnet.hudson.maven3.agent.Maven3Main.launch(Maven3Main.java:158)
	at hudson.maven.Maven3Builder.call(Maven3Builder.java:100)
	at hudson.maven.Maven3Builder.call(Maven3Builder.java:66)
	at hudson.remoting.UserRequest.perform(UserRequest.java:118)
	at hudson.remoting.UserRequest.perform(UserRequest.java:48)
	at hudson.remoting.Request$2.run(Request.java:326)
	at hudson.remoting.InterceptingExecutorService$1.call(InterceptingExecutorService.java:72)
	at java.util.concurrent.FutureTask$Sync.innerRun(FutureTask.java:334)
	at java.util.concurrent.FutureTask.run(FutureTask.java:166)
	at java.util.concurrent.ThreadPoolExecutor.runWorker(ThreadPoolExecutor.java:1145)
	at java.util.concurrent.ThreadPoolExecutor$Worker.run(ThreadPoolExecutor.java:615)
	at java.lang.Thread.run(Thread.java:722)
Caused by: org.apache.maven.plugin.CompilationFailureException: Compilation failure
error: error reading /export/home/hudson/hudson-slave/maven-repositories/0/net/sf/saxon/saxon/9.1.0.8/saxon-9.1.0.8.jar;
error in opening zip file

	at org.apache.maven.plugin.AbstractCompilerMojo.execute(AbstractCompilerMojo.java:656)
	at org.apache.maven.plugin.CompilerMojo.execute(CompilerMojo.java:128)
	at org.apache.maven.plugin.DefaultBuildPluginManager.executeMojo(DefaultBuildPluginManager.java:107)
	at org.apache.maven.lifecycle.internal.MojoExecutor.execute(MojoExecutor.java:209)
	... 27 more
Sending e-mails to: dev@airavata.apache.org
channel stopped

Mime
View raw message