airavata-dev mailing list archives

Site index · List index
Message view « Date » · « Thread »
Top « Date » · « Thread »
From Apache Jenkins Server <jenk...@builds.apache.org>
Subject Build failed in Jenkins: Apache Airavata » Airavata Integration Tests #1118
Date Tue, 23 Apr 2013 07:23:01 GMT
See <https://builds.apache.org/job/Apache%20Airavata/org.apache.airavata$integration-tests/1118/>

------------------------------------------
[...truncated 48 lines...]
[INFO] [2.ContainerStartMojo] Resolved container artifact org.codehaus.cargo:cargo-core-container-tomcat:jar:1.3.1
for container tomcat7x
[INFO] [stalledLocalDeployer] Deploying [/export/home/hudson/hudson-slave/workspace/Apache
Airavata/modules/rest/webapp/target/airavata-rest-service-webapp.war] to [<https://builds.apache.org/job/Apache%20Airavata/org.apache.airavata$integration-tests/ws/target/tests/apache-tomcat-7.0.33/webapps]...>
[INFO] [talledLocalContainer] Tomcat 7.x starting...
[INFO] [talledLocalContainer] Apr 22, 2013 7:35:28 PM org.apache.catalina.core.AprLifecycleListener
init
[INFO] [talledLocalContainer] INFO: The APR based Apache Tomcat Native library which allows
optimal performance in production environments was not found on the java.library.path: /zonestorage/hudson_solaris/home/hudson/tools/java/jdk1.7.0_15/jre/lib/i386/server:/zonestorage/hudson_solaris/home/hudson/tools/java/jdk1.7.0_15/jre/lib/i386:/zonestorage/hudson_solaris/home/hudson/tools/java/jdk1.7.0_15/jre/../lib/i386:/zonestorage/hudson_solaris/home/hudson/hudson-slave/tools/jdk6-u26-auto-install/jre/lib/i386/server:/zonestorage/hudson_solaris/home/hudson/hudson-slave/tools/jdk6-u26-auto-install/jre/lib/i386:/zonestorage/hudson_solaris/home/hudson/hudson-slave/tools/jdk6-u26-auto-install/jre/../lib/i386:/usr/jdk/packages/lib/i386:/lib:/usr/lib
[INFO] [talledLocalContainer] Apr 22, 2013 7:35:40 PM org.apache.coyote.AbstractProtocol init
[INFO] [talledLocalContainer] INFO: Initializing ProtocolHandler ["http-bio-8088"]
[INFO] [talledLocalContainer] Apr 22, 2013 7:35:40 PM org.apache.coyote.AbstractProtocol init
[INFO] [talledLocalContainer] INFO: Initializing ProtocolHandler ["ajp-bio-8009"]
[INFO] [talledLocalContainer] Apr 22, 2013 7:35:40 PM org.apache.catalina.startup.Catalina
load
[INFO] [talledLocalContainer] INFO: Initialization processed in 15454 ms
[INFO] [talledLocalContainer] Apr 22, 2013 7:35:41 PM org.apache.catalina.core.StandardService
startInternal
[INFO] [talledLocalContainer] INFO: Starting service Catalina
[INFO] [talledLocalContainer] Apr 22, 2013 7:35:41 PM org.apache.catalina.core.StandardEngine
startInternal
[INFO] [talledLocalContainer] INFO: Starting Servlet Engine: Apache Tomcat/7.0.33
[INFO] [talledLocalContainer] Apr 22, 2013 7:35:41 PM org.apache.catalina.startup.HostConfig
deployWAR
[INFO] [talledLocalContainer] INFO: Deploying web application archive /zonestorage/hudson_solaris/home/hudson/hudson-slave/workspace/Apache
Airavata/modules/integration-tests/target/tests/apache-tomcat-7.0.33/webapps/airavata-registry.war
[INFO] [talledLocalContainer] Apr 22, 2013 7:35:45 PM org.apache.catalina.loader.WebappClassLoader
validateJarFile
[INFO] [talledLocalContainer] INFO: validateJarFile(<https://builds.apache.org/job/Apache%20Airavata/org.apache.airavata$integration-tests/ws/target/tests/apache-tomcat-7.0.33/webapps/airavata-registry/WEB-INF/lib/servlet-api-2.3.jar)>
- jar not loaded. See Servlet Spec 2.3, section 9.7.2. Offending class: javax/servlet/Servlet.class
[INFO] [talledLocalContainer] Apr 22, 2013 7:35:45 PM org.apache.catalina.loader.WebappClassLoader
validateJarFile
[INFO] [talledLocalContainer] INFO: validateJarFile(<https://builds.apache.org/job/Apache%20Airavata/org.apache.airavata$integration-tests/ws/target/tests/apache-tomcat-7.0.33/webapps/airavata-registry/WEB-INF/lib/tomcat-embed-core-7.0.22.jar)>
- jar not loaded. See Servlet Spec 2.3, section 9.7.2. Offending class: javax/servlet/Servlet.class
[INFO] [talledLocalContainer] Apr 22, 2013 7:35:46 PM org.apache.tomcat.util.scan.StandardJarScanner
scan
[WARNING] [talledLocalContainer] WARNING: Failed to scan JAR [<https://builds.apache.org/job/Apache%20Airavata/org.apache.airavata$integration-tests/ws/target/tests/apache-tomcat-7.0.33/webapps/airavata-registry/WEB-INF/lib/oauth-consumer-20100527.jar]>
from WEB-INF/lib
[INFO] [talledLocalContainer] java.util.zip.ZipException: error in opening zip file
[INFO] [talledLocalContainer] 	at java.util.zip.ZipFile.open(Native Method)
[INFO] [talledLocalContainer] 	at java.util.zip.ZipFile.<init>(ZipFile.java:214)
[INFO] [talledLocalContainer] 	at java.util.zip.ZipFile.<init>(ZipFile.java:144)
[INFO] [talledLocalContainer] 	at java.util.jar.JarFile.<init>(JarFile.java:153)
[INFO] [talledLocalContainer] 	at java.util.jar.JarFile.<init>(JarFile.java:90)
[INFO] [talledLocalContainer] 	at sun.net.www.protocol.jar.URLJarFile.<init>(URLJarFile.java:93)
[INFO] [talledLocalContainer] 	at sun.net.www.protocol.jar.URLJarFile.getJarFile(URLJarFile.java:69)
[INFO] [talledLocalContainer] 	at sun.net.www.protocol.jar.JarFileFactory.get(JarFileFactory.java:88)
[INFO] [talledLocalContainer] 	at sun.net.www.protocol.jar.JarURLConnection.connect(JarURLConnection.java:122)
[INFO] [talledLocalContainer] 	at sun.net.www.protocol.jar.JarURLConnection.getJarFile(JarURLConnection.java:89)
[INFO] [talledLocalContainer] 	at org.apache.tomcat.util.scan.FileUrlJar.<init>(FileUrlJar.java:41)
[INFO] [talledLocalContainer] 	at org.apache.tomcat.util.scan.JarFactory.newInstance(JarFactory.java:34)
[INFO] [talledLocalContainer] 	at org.apache.catalina.startup.ContextConfig$FragmentJarScannerCallback.scan(ContextConfig.java:2620)
[INFO] [talledLocalContainer] 	at org.apache.tomcat.util.scan.StandardJarScanner.process(StandardJarScanner.java:241)
[INFO] [talledLocalContainer] 	at org.apache.tomcat.util.scan.StandardJarScanner.scan(StandardJarScanner.java:166)
[INFO] [talledLocalContainer] 	at org.apache.catalina.startup.ContextConfig.processJarsForWebFragments(ContextConfig.java:1917)
[INFO] [talledLocalContainer] 	at org.apache.catalina.startup.ContextConfig.webConfig(ContextConfig.java:1268)
[INFO] [talledLocalContainer] 	at org.apache.catalina.startup.ContextConfig.configureStart(ContextConfig.java:878)
[INFO] [talledLocalContainer] 	at org.apache.catalina.startup.ContextConfig.lifecycleEvent(ContextConfig.java:369)
[INFO] [talledLocalContainer] 	at org.apache.catalina.util.LifecycleSupport.fireLifecycleEvent(LifecycleSupport.java:119)
[INFO] [talledLocalContainer] 	at org.apache.catalina.util.LifecycleBase.fireLifecycleEvent(LifecycleBase.java:90)
[INFO] [talledLocalContainer] 	at org.apache.catalina.core.StandardContext.startInternal(StandardContext.java:5173)
[INFO] [talledLocalContainer] 	at org.apache.catalina.util.LifecycleBase.start(LifecycleBase.java:150)
[INFO] [talledLocalContainer] 	at org.apache.catalina.core.ContainerBase.addChildInternal(ContainerBase.java:901)
[INFO] [talledLocalContainer] 	at org.apache.catalina.core.ContainerBase.addChild(ContainerBase.java:877)
[INFO] [talledLocalContainer] 	at org.apache.catalina.core.StandardHost.addChild(StandardHost.java:633)
[INFO] [talledLocalContainer] 	at org.apache.catalina.startup.HostConfig.deployWAR(HostConfig.java:977)
[INFO] [talledLocalContainer] 	at org.apache.catalina.startup.HostConfig$DeployWar.run(HostConfig.java:1655)
[INFO] [talledLocalContainer] 	at java.util.concurrent.Executors$RunnableAdapter.call(Executors.java:471)
[INFO] [talledLocalContainer] 	at java.util.concurrent.FutureTask$Sync.innerRun(FutureTask.java:334)
[INFO] [talledLocalContainer] 	at java.util.concurrent.FutureTask.run(FutureTask.java:166)
[INFO] [talledLocalContainer] 	at java.util.concurrent.ThreadPoolExecutor.runWorker(ThreadPoolExecutor.java:1145)
[INFO] [talledLocalContainer] 	at java.util.concurrent.ThreadPoolExecutor$Worker.run(ThreadPoolExecutor.java:615)
[INFO] [talledLocalContainer] 	at java.lang.Thread.run(Thread.java:722)
[INFO] [talledLocalContainer] 
[INFO] [talledLocalContainer] Apr 22, 2013 7:35:47 PM org.apache.tomcat.util.scan.StandardJarScanner
scan
[WARNING] [talledLocalContainer] WARNING: Failed to scan JAR [<https://builds.apache.org/job/Apache%20Airavata/org.apache.airavata$integration-tests/ws/target/tests/apache-tomcat-7.0.33/webapps/airavata-registry/WEB-INF/lib/oauth-httpclient4-20090617.jar]>
from WEB-INF/lib
[INFO] [talledLocalContainer] java.util.zip.ZipException: error in opening zip file
[INFO] [talledLocalContainer] 	at java.util.zip.ZipFile.open(Native Method)
[INFO] [talledLocalContainer] 	at java.util.zip.ZipFile.<init>(ZipFile.java:214)
[INFO] [talledLocalContainer] 	at java.util.zip.ZipFile.<init>(ZipFile.java:144)
[INFO] [talledLocalContainer] 	at java.util.jar.JarFile.<init>(JarFile.java:153)
[INFO] [talledLocalContainer] 	at java.util.jar.JarFile.<init>(JarFile.java:90)
[INFO] [talledLocalContainer] 	at sun.net.www.protocol.jar.URLJarFile.<init>(URLJarFile.java:93)
[INFO] [talledLocalContainer] 	at sun.net.www.protocol.jar.URLJarFile.getJarFile(URLJarFile.java:69)
[INFO] [talledLocalContainer] 	at sun.net.www.protocol.jar.JarFileFactory.get(JarFileFactory.java:88)
[INFO] [talledLocalContainer] 	at sun.net.www.protocol.jar.JarURLConnection.connect(JarURLConnection.java:122)
[INFO] [talledLocalContainer] 	at sun.net.www.protocol.jar.JarURLConnection.getJarFile(JarURLConnection.java:89)
[INFO] [talledLocalContainer] 	at org.apache.tomcat.util.scan.FileUrlJar.<init>(FileUrlJar.java:41)
[INFO] [talledLocalContainer] 	at org.apache.tomcat.util.scan.JarFactory.newInstance(JarFactory.java:34)
[INFO] [talledLocalContainer] 	at org.apache.catalina.startup.ContextConfig$FragmentJarScannerCallback.scan(ContextConfig.java:2620)
[INFO] [talledLocalContainer] 	at org.apache.tomcat.util.scan.StandardJarScanner.process(StandardJarScanner.java:241)
[INFO] [talledLocalContainer] 	at org.apache.tomcat.util.scan.StandardJarScanner.scan(StandardJarScanner.java:166)
[INFO] [talledLocalContainer] 	at org.apache.catalina.startup.ContextConfig.processJarsForWebFragments(ContextConfig.java:1917)
[INFO] [talledLocalContainer] 	at org.apache.catalina.startup.ContextConfig.webConfig(ContextConfig.java:1268)
[INFO] [talledLocalContainer] 	at org.apache.catalina.startup.ContextConfig.configureStart(ContextConfig.java:878)
[INFO] [talledLocalContainer] 	at org.apache.catalina.startup.ContextConfig.lifecycleEvent(ContextConfig.java:369)
[INFO] [talledLocalContainer] 	at org.apache.catalina.util.LifecycleSupport.fireLifecycleEvent(LifecycleSupport.java:119)
[INFO] [talledLocalContainer] 	at org.apache.catalina.util.LifecycleBase.fireLifecycleEvent(LifecycleBase.java:90)
[INFO] [talledLocalContainer] 	at org.apache.catalina.core.StandardContext.startInternal(StandardContext.java:5173)
[INFO] [talledLocalContainer] 	at org.apache.catalina.util.LifecycleBase.start(LifecycleBase.java:150)
[INFO] [talledLocalContainer] 	at org.apache.catalina.core.ContainerBase.addChildInternal(ContainerBase.java:901)
[INFO] [talledLocalContainer] 	at org.apache.catalina.core.ContainerBase.addChild(ContainerBase.java:877)
[INFO] [talledLocalContainer] 	at org.apache.catalina.core.StandardHost.addChild(StandardHost.java:633)
[INFO] [talledLocalContainer] 	at org.apache.catalina.startup.HostConfig.deployWAR(HostConfig.java:977)
[INFO] [talledLocalContainer] 	at org.apache.catalina.startup.HostConfig$DeployWar.run(HostConfig.java:1655)
[INFO] [talledLocalContainer] 	at java.util.concurrent.Executors$RunnableAdapter.call(Executors.java:471)
[INFO] [talledLocalContainer] 	at java.util.concurrent.FutureTask$Sync.innerRun(FutureTask.java:334)
[INFO] [talledLocalContainer] 	at java.util.concurrent.FutureTask.run(FutureTask.java:166)
[INFO] [talledLocalContainer] 	at java.util.concurrent.ThreadPoolExecutor.runWorker(ThreadPoolExecutor.java:1145)
[INFO] [talledLocalContainer] 	at java.util.concurrent.ThreadPoolExecutor$Worker.run(ThreadPoolExecutor.java:615)
[INFO] [talledLocalContainer] 	at java.lang.Thread.run(Thread.java:722)
[INFO] [talledLocalContainer] 
[INFO] [talledLocalContainer] Apr 22, 2013 7:35:47 PM org.apache.catalina.startup.ContextConfig
processServletContainerInitializers
[INFO] [talledLocalContainer] SEVERE: Failed to process JAR found at URL [jar:<https://builds.apache.org/job/Apache%20Airavata/org.apache.airavata$integration-tests/ws/target/tests/apache-tomcat-7.0.33/webapps/airavata-registry/WEB-INF/lib/oauth-httpclient4-20090617.jar!/]>
for ServletContainerInitializers for context with name [/airavata-registry]
[INFO] [talledLocalContainer] Apr 22, 2013 7:35:47 PM org.apache.catalina.startup.ContextConfig
configureStart
[INFO] [talledLocalContainer] SEVERE: Marking this application unavailable due to previous
error(s)
[INFO] [talledLocalContainer] Apr 22, 2013 7:35:47 PM org.apache.catalina.startup.TldConfig
tldScanJar
[WARNING] [talledLocalContainer] WARNING: Failed to process JAR [jar:<https://builds.apache.org/job/Apache%20Airavata/org.apache.airavata$integration-tests/ws/target/tests/apache-tomcat-7.0.33/webapps/airavata-registry/WEB-INF/lib/oauth-consumer-20100527.jar!/]>
for TLD files
[INFO] [talledLocalContainer] java.util.zip.ZipException: error in opening zip file
[INFO] [talledLocalContainer] 	at java.util.zip.ZipFile.open(Native Method)
[INFO] [talledLocalContainer] 	at java.util.zip.ZipFile.<init>(ZipFile.java:214)
[INFO] [talledLocalContainer] 	at java.util.zip.ZipFile.<init>(ZipFile.java:144)
[INFO] [talledLocalContainer] 	at java.util.jar.JarFile.<init>(JarFile.java:153)
[INFO] [talledLocalContainer] 	at java.util.jar.JarFile.<init>(JarFile.java:90)
[INFO] [talledLocalContainer] 	at sun.net.www.protocol.jar.URLJarFile.<init>(URLJarFile.java:93)
[INFO] [talledLocalContainer] 	at sun.net.www.protocol.jar.URLJarFile.getJarFile(URLJarFile.java:69)
[INFO] [talledLocalContainer] 	at sun.net.www.protocol.jar.JarFileFactory.get(JarFileFactory.java:88)
[INFO] [talledLocalContainer] 	at sun.net.www.protocol.jar.JarURLConnection.connect(JarURLConnection.java:122)
[INFO] [talledLocalContainer] 	at sun.net.www.protocol.jar.JarURLConnection.getJarFile(JarURLConnection.java:89)
[INFO] [talledLocalContainer] 	at org.apache.tomcat.util.scan.FileUrlJar.<init>(FileUrlJar.java:41)
[INFO] [talledLocalContainer] 	at org.apache.tomcat.util.scan.JarFactory.newInstance(JarFactory.java:34)
[INFO] [talledLocalContainer] 	at org.apache.catalina.startup.TldConfig.tldScanJar(TldConfig.java:487)
[INFO] [talledLocalContainer] 	at org.apache.catalina.startup.TldConfig.access$100(TldConfig.java:58)
[INFO] [talledLocalContainer] 	at org.apache.catalina.startup.TldConfig$TldJarScannerCallback.scan(TldConfig.java:303)
[INFO] [talledLocalContainer] 	at org.apache.tomcat.util.scan.StandardJarScanner.process(StandardJarScanner.java:241)
[INFO] [talledLocalContainer] 	at org.apache.tomcat.util.scan.StandardJarScanner.scan(StandardJarScanner.java:166)
[INFO] [talledLocalContainer] 	at org.apache.catalina.startup.TldConfig.execute(TldConfig.java:277)
[INFO] [talledLocalContainer] 	at org.apache.catalina.startup.TldConfig.lifecycleEvent(TldConfig.java:567)
[INFO] [talledLocalContainer] 	at org.apache.catalina.util.LifecycleSupport.fireLifecycleEvent(LifecycleSupport.java:119)
[INFO] [talledLocalContainer] 	at org.apache.catalina.util.LifecycleBase.fireLifecycleEvent(LifecycleBase.java:90)
[INFO] [talledLocalContainer] 	at org.apache.catalina.core.StandardContext.startInternal(StandardContext.java:5173)
[INFO] [talledLocalContainer] 	at org.apache.catalina.util.LifecycleBase.start(LifecycleBase.java:150)
[INFO] [talledLocalContainer] 	at org.apache.catalina.core.ContainerBase.addChildInternal(ContainerBase.java:901)
[INFO] [talledLocalContainer] 	at org.apache.catalina.core.ContainerBase.addChild(ContainerBase.java:877)
[INFO] [talledLocalContainer] 	at org.apache.catalina.core.StandardHost.addChild(StandardHost.java:633)
[INFO] [talledLocalContainer] 	at org.apache.catalina.startup.HostConfig.deployWAR(HostConfig.java:977)
[INFO] [talledLocalContainer] 	at org.apache.catalina.startup.HostConfig$DeployWar.run(HostConfig.java:1655)
[INFO] [talledLocalContainer] 	at java.util.concurrent.Executors$RunnableAdapter.call(Executors.java:471)
[INFO] [talledLocalContainer] 	at java.util.concurrent.FutureTask$Sync.innerRun(FutureTask.java:334)
[INFO] [talledLocalContainer] 	at java.util.concurrent.FutureTask.run(FutureTask.java:166)
[INFO] [talledLocalContainer] 	at java.util.concurrent.ThreadPoolExecutor.runWorker(ThreadPoolExecutor.java:1145)
[INFO] [talledLocalContainer] 	at java.util.concurrent.ThreadPoolExecutor$Worker.run(ThreadPoolExecutor.java:615)
[INFO] [talledLocalContainer] 	at java.lang.Thread.run(Thread.java:722)
[INFO] [talledLocalContainer] 
[INFO] [talledLocalContainer] Apr 22, 2013 7:35:48 PM org.apache.catalina.startup.TldConfig
tldScanJar
[WARNING] [talledLocalContainer] WARNING: Failed to process JAR [jar:<https://builds.apache.org/job/Apache%20Airavata/org.apache.airavata$integration-tests/ws/target/tests/apache-tomcat-7.0.33/webapps/airavata-registry/WEB-INF/lib/oauth-httpclient4-20090617.jar!/]>
for TLD files
[INFO] [talledLocalContainer] java.util.zip.ZipException: error in opening zip file
[INFO] [talledLocalContainer] 	at java.util.zip.ZipFile.open(Native Method)
[INFO] [talledLocalContainer] 	at java.util.zip.ZipFile.<init>(ZipFile.java:214)
[INFO] [talledLocalContainer] 	at java.util.zip.ZipFile.<init>(ZipFile.java:144)
[INFO] [talledLocalContainer] 	at java.util.jar.JarFile.<init>(JarFile.java:153)
[INFO] [talledLocalContainer] 	at java.util.jar.JarFile.<init>(JarFile.java:90)
[INFO] [talledLocalContainer] 	at sun.net.www.protocol.jar.URLJarFile.<init>(URLJarFile.java:93)
[INFO] [talledLocalContainer] 	at sun.net.www.protocol.jar.URLJarFile.getJarFile(URLJarFile.java:69)
[INFO] [talledLocalContainer] 	at sun.net.www.protocol.jar.JarFileFactory.get(JarFileFactory.java:88)
[INFO] [talledLocalContainer] 	at sun.net.www.protocol.jar.JarURLConnection.connect(JarURLConnection.java:122)
[INFO] [talledLocalContainer] 	at sun.net.www.protocol.jar.JarURLConnection.getJarFile(JarURLConnection.java:89)
[INFO] [talledLocalContainer] 	at org.apache.tomcat.util.scan.FileUrlJar.<init>(FileUrlJar.java:41)
[INFO] [talledLocalContainer] 	at org.apache.tomcat.util.scan.JarFactory.newInstance(JarFactory.java:34)
[INFO] [talledLocalContainer] 	at org.apache.catalina.startup.TldConfig.tldScanJar(TldConfig.java:487)
[INFO] [talledLocalContainer] 	at org.apache.catalina.startup.TldConfig.access$100(TldConfig.java:58)
[INFO] [talledLocalContainer] 	at org.apache.catalina.startup.TldConfig$TldJarScannerCallback.scan(TldConfig.java:303)
[INFO] [talledLocalContainer] 	at org.apache.tomcat.util.scan.StandardJarScanner.process(StandardJarScanner.java:241)
[INFO] [talledLocalContainer] 	at org.apache.tomcat.util.scan.StandardJarScanner.scan(StandardJarScanner.java:166)
[INFO] [talledLocalContainer] 	at org.apache.catalina.startup.TldConfig.execute(TldConfig.java:277)
[INFO] [talledLocalContainer] 	at org.apache.catalina.startup.TldConfig.lifecycleEvent(TldConfig.java:567)
[INFO] [talledLocalContainer] 	at org.apache.catalina.util.LifecycleSupport.fireLifecycleEvent(LifecycleSupport.java:119)
[INFO] [talledLocalContainer] 	at org.apache.catalina.util.LifecycleBase.fireLifecycleEvent(LifecycleBase.java:90)
[INFO] [talledLocalContainer] 	at org.apache.catalina.core.StandardContext.startInternal(StandardContext.java:5173)
[INFO] [talledLocalContainer] 	at org.apache.catalina.util.LifecycleBase.start(LifecycleBase.java:150)
[INFO] [talledLocalContainer] 	at org.apache.catalina.core.ContainerBase.addChildInternal(ContainerBase.java:901)
[INFO] [talledLocalContainer] 	at org.apache.catalina.core.ContainerBase.addChild(ContainerBase.java:877)
[INFO] [talledLocalContainer] 	at org.apache.catalina.core.StandardHost.addChild(StandardHost.java:633)
[INFO] [talledLocalContainer] 	at org.apache.catalina.startup.HostConfig.deployWAR(HostConfig.java:977)
[INFO] [talledLocalContainer] 	at org.apache.catalina.startup.HostConfig$DeployWar.run(HostConfig.java:1655)
[INFO] [talledLocalContainer] 	at java.util.concurrent.Executors$RunnableAdapter.call(Executors.java:471)
[INFO] [talledLocalContainer] 	at java.util.concurrent.FutureTask$Sync.innerRun(FutureTask.java:334)
[INFO] [talledLocalContainer] 	at java.util.concurrent.FutureTask.run(FutureTask.java:166)
[INFO] [talledLocalContainer] 	at java.util.concurrent.ThreadPoolExecutor.runWorker(ThreadPoolExecutor.java:1145)
[INFO] [talledLocalContainer] 	at java.util.concurrent.ThreadPoolExecutor$Worker.run(ThreadPoolExecutor.java:615)
[INFO] [talledLocalContainer] 	at java.lang.Thread.run(Thread.java:722)
[INFO] [talledLocalContainer] 
[INFO] [talledLocalContainer] Apr 22, 2013 7:35:48 PM org.apache.catalina.core.StandardContext
startInternal
[INFO] [talledLocalContainer] SEVERE: Error getConfigured
[INFO] [talledLocalContainer] Apr 22, 2013 7:35:48 PM org.apache.catalina.util.SessionIdGenerator
createSecureRandom
[INFO] [talledLocalContainer] INFO: Creation of SecureRandom instance for session ID generation
using [SHA1PRNG] took [482] milliseconds.
[INFO] [talledLocalContainer] Apr 22, 2013 7:35:48 PM org.apache.catalina.core.StandardContext
startInternal
[INFO] [talledLocalContainer] SEVERE: Context [/airavata-registry] startup failed due to previous
errors
[INFO] [talledLocalContainer] Apr 22, 2013 7:35:49 PM org.apache.catalina.startup.HostConfig
deployWAR
[INFO] [talledLocalContainer] INFO: Deploying web application archive /zonestorage/hudson_solaris/home/hudson/hudson-slave/workspace/Apache
Airavata/modules/integration-tests/target/tests/apache-tomcat-7.0.33/webapps/cargocpc.war
[INFO] [talledLocalContainer] Apr 22, 2013 7:35:51 PM org.apache.catalina.startup.HostConfig
deployDirectory
[INFO] [talledLocalContainer] INFO: Deploying web application directory /zonestorage/hudson_solaris/home/hudson/hudson-slave/workspace/Apache
Airavata/modules/integration-tests/target/tests/apache-tomcat-7.0.33/webapps/manager
[INFO] [talledLocalContainer] Apr 22, 2013 7:35:52 PM org.apache.catalina.startup.HostConfig
deployDirectory
[INFO] [talledLocalContainer] INFO: Deploying web application directory /zonestorage/hudson_solaris/home/hudson/hudson-slave/workspace/Apache
Airavata/modules/integration-tests/target/tests/apache-tomcat-7.0.33/webapps/axis2
[INFO] [talledLocalContainer] [INFO] Clustering has been disabled
[INFO] [talledLocalContainer] [INFO] Deploying module: ping-1.5.1 - file:<https://builds.apache.org/job/Apache%20Airavata/org.apache.airavata$integration-tests/ws/target/tests/apache-tomcat-7.0.33/webapps/axis2/WEB-INF/modules/ping-1.5.1.mar>
[INFO] [talledLocalContainer] [INFO] Deploying module: mtompolicy-1.5.1 - file:<https://builds.apache.org/job/Apache%20Airavata/org.apache.airavata$integration-tests/ws/target/tests/apache-tomcat-7.0.33/webapps/axis2/WEB-INF/modules/mtompolicy-1.5.1.mar>
[INFO] [talledLocalContainer] [INFO] Deploying module: metadataExchange-1.5.1 - file:<https://builds.apache.org/job/Apache%20Airavata/org.apache.airavata$integration-tests/ws/target/tests/apache-tomcat-7.0.33/webapps/axis2/WEB-INF/modules/mex-1.5.1.mar>
[INFO] [talledLocalContainer] [INFO] Deploying module: addressing-1.5.1 - file:<https://builds.apache.org/job/Apache%20Airavata/org.apache.airavata$integration-tests/ws/target/tests/apache-tomcat-7.0.33/webapps/axis2/WEB-INF/modules/addressing-1.5.1.mar>
[INFO] [talledLocalContainer] [INFO] Deploying module: jaxws-1.5.1 - file:<https://builds.apache.org/job/Apache%20Airavata/org.apache.airavata$integration-tests/ws/target/tests/apache-tomcat-7.0.33/webapps/axis2/WEB-INF/modules/axis2-jaxws-mar-1.5.1.mar>
[INFO] [talledLocalContainer] [INFO] Deploying module: soapmonitor-1.5.1 - file:<https://builds.apache.org/job/Apache%20Airavata/org.apache.airavata$integration-tests/ws/target/tests/apache-tomcat-7.0.33/webapps/axis2/WEB-INF/modules/soapmonitor-1.5.1.mar>
[INFO] [talledLocalContainer] [INFO] Deploying module: script-1.5.1 - file:<https://builds.apache.org/job/Apache%20Airavata/org.apache.airavata$integration-tests/ws/target/tests/apache-tomcat-7.0.33/webapps/axis2/WEB-INF/modules/axis2-scripting-1.5.1.mar>
[INFO] [talledLocalContainer] [INFO] Deploying module: metadataExchange-1.5.1-impl - file:/zonestorage/hudson_solaris/home/hudson/hudson-slave/workspace/Apache
Airavata/modules/integration-tests/target/tests/apache-tomcat-7.0.33/webapps/axis2/WEB-INF/lib/mex-1.5.1-impl.jar
[INFO] [talledLocalContainer] [INFO] Deploying Web service: version-1.5.1.aar - file:<https://builds.apache.org/job/Apache%20Airavata/org.apache.airavata$integration-tests/ws/target/tests/apache-tomcat-7.0.33/webapps/axis2/WEB-INF/services/version-1.5.1.aar>
[INFO] [talledLocalContainer] [INFO] Deploying Web service: airavata-levenshtein-distance-service-0.8-SNAPSHOT.aar
- file:<https://builds.apache.org/job/Apache%20Airavata/org.apache.airavata$integration-tests/ws/target/tests/apache-tomcat-7.0.33/webapps/axis2/WEB-INF/services/airavata-levenshtein-distance-service-0.8-SNAPSHOT.aar>
[INFO] [talledLocalContainer] [INFO] Deploying Web service: airavata-complex-math-service-0.8-SNAPSHOT.aar
- file:<https://builds.apache.org/job/Apache%20Airavata/org.apache.airavata$integration-tests/ws/target/tests/apache-tomcat-7.0.33/webapps/axis2/WEB-INF/services/airavata-complex-math-service-0.8-SNAPSHOT.aar>
[INFO] [talledLocalContainer] [INFO] Deploying Web service: airavata-xbaya-gui-0.8-SNAPSHOT.jar
- file:<https://builds.apache.org/job/Apache%20Airavata/org.apache.airavata$integration-tests/ws/target/tests/apache-tomcat-7.0.33/webapps/axis2/WEB-INF/services/airavata-xbaya-gui-0.8-SNAPSHOT.jar>
[INFO] [talledLocalContainer] [WARN] java.sql.SQLWarning: Database 'wsmg' not created, connection
made to existing database instead. sql warning
[INFO] [talledLocalContainer] [INFO] New Database created for Message Box
[INFO] [talledLocalContainer] [INFO] Deploying Web service: airavata-message-box-0.8-SNAPSHOT.jar
- file:<https://builds.apache.org/job/Apache%20Airavata/org.apache.airavata$integration-tests/ws/target/tests/apache-tomcat-7.0.33/webapps/axis2/WEB-INF/services/airavata-message-box-0.8-SNAPSHOT.jar>
[INFO] [talledLocalContainer] [INFO] Starting Message Broker...
[INFO] [talledLocalContainer] [WARN] java.sql.SQLWarning: Database 'wsmg' not created, connection
made to existing database instead. sql warning
[INFO] [talledLocalContainer] [INFO] New Database created for Message Broker
[INFO] [talledLocalContainer] [INFO] Deploying Web service: airavata-message-broker-0.8-SNAPSHOT.jar
- file:<https://builds.apache.org/job/Apache%20Airavata/org.apache.airavata$integration-tests/ws/target/tests/apache-tomcat-7.0.33/webapps/axis2/WEB-INF/services/airavata-message-broker-0.8-SNAPSHOT.jar>
[INFO] [talledLocalContainer] Mon Apr 22 19:36:34 GMT+00:00 2013 : Apache Derby Network Server
- 10.9.1.0 - (1344872) started and ready to accept connections on port 1527
[INFO] [talledLocalContainer] [INFO] New Database created for Registry
[INFO] [talledLocalContainer] 58  airavata_data  INFO   [localhost-startStop-1] openjpa.Runtime
- Starting OpenJPA 2.2.0
[INFO] [talledLocalContainer] 147  airavata_data  INFO   [localhost-startStop-1] openjpa.jdbc.JDBC
- Using dictionary class "org.apache.openjpa.jdbc.sql.DerbyDictionary".
[INFO] [talledLocalContainer] [INFO] Deploying Web service: airavata-registry-service-0.8-SNAPSHOT.jar
- file:<https://builds.apache.org/job/Apache%20Airavata/org.apache.airavata$integration-tests/ws/target/tests/apache-tomcat-7.0.33/webapps/axis2/WEB-INF/services/airavata-registry-service-0.8-SNAPSHOT.jar>
[INFO] [talledLocalContainer] Apr 22, 2013 7:36:38 PM org.apache.catalina.startup.HostConfig
deployDirectory
[INFO] [talledLocalContainer] INFO: Deploying web application directory /zonestorage/hudson_solaris/home/hudson/hudson-slave/workspace/Apache
Airavata/modules/integration-tests/target/tests/apache-tomcat-7.0.33/webapps/ROOT
[INFO] [talledLocalContainer] Apr 22, 2013 7:36:38 PM org.apache.catalina.startup.HostConfig
deployDirectory
[INFO] [talledLocalContainer] INFO: Deploying web application directory /zonestorage/hudson_solaris/home/hudson/hudson-slave/workspace/Apache
Airavata/modules/integration-tests/target/tests/apache-tomcat-7.0.33/webapps/docs
[INFO] [talledLocalContainer] Apr 22, 2013 7:36:38 PM org.apache.catalina.startup.HostConfig
deployDirectory
[INFO] [talledLocalContainer] INFO: Deploying web application directory /zonestorage/hudson_solaris/home/hudson/hudson-slave/workspace/Apache
Airavata/modules/integration-tests/target/tests/apache-tomcat-7.0.33/webapps/host-manager
[INFO] [talledLocalContainer] Apr 22, 2013 7:36:38 PM org.apache.coyote.AbstractProtocol start
[INFO] [talledLocalContainer] INFO: Starting ProtocolHandler ["http-bio-8088"]
[INFO] [talledLocalContainer] Apr 22, 2013 7:36:38 PM org.apache.coyote.AbstractProtocol start
[INFO] [talledLocalContainer] INFO: Starting ProtocolHandler ["ajp-bio-8009"]
[INFO] [talledLocalContainer] Apr 22, 2013 7:36:38 PM org.apache.catalina.startup.Catalina
start
[INFO] [talledLocalContainer] INFO: Server startup in 57852 ms
[INFO] [talledLocalContainer] Tomcat 7.x started on port [8088]
[INFO] [debug] execute contextualize

[INFO] Using 'UTF-8' encoding to copy filtered resources.
[INFO] Copying 2 resources
[INFO] Copying 3 resources
[INFO] --- maven-resources-plugin:2.5:testResources (default-testResources) @ integration-tests
---
[INFO] [INFO] Compiling 2 source files to <https://builds.apache.org/job/Apache%20Airavata/org.apache.airavata$integration-tests/ws/target/test-classes>

[INFO] --- maven-compiler-plugin:2.3.2:testCompile (default-testCompile) @ integration-tests
---
[INFO] [INFO] Surefire report directory: <https://builds.apache.org/job/Apache%20Airavata/org.apache.airavata$integration-tests/ws/target/surefire-reports>

[INFO] --- maven-surefire-plugin:2.12:test (default-test) @ integration-tests ---

-------------------------------------------------------
 T E S T S
-------------------------------------------------------

Results :

Tests run: 0, Failures: 0, Errors: 0, Skipped: 0

[JENKINS] Recording test results

Mime
View raw message