airavata-dev mailing list archives

Site index · List index
Message view « Date » · « Thread »
Top « Date » · « Thread »
From Apache Jenkins Server <jenk...@builds.apache.org>
Subject Build failed in Jenkins: Apache Airavata #1064
Date Fri, 08 Mar 2013 02:43:33 GMT
See <https://builds.apache.org/job/Apache%20Airavata/1064/changes>

Changes:

[heshan] AIRAVATA-202 implementing the execute method.

[heshan] Minor refactor.

[heshan] AIRAVATA-202 Bundled the logic into methods in such a way that it looks cleaner.
I am going to implement the EC2Provider in a such a way that it no longer requires SSHProvider
to run jobs. By now all the references to SSHProvider is removed.

[heshan] AIRAVATA-202 Refactored and removed the redundant logic from the EC2 Provider.

[heshan] Removing a IDE specific file from the svn.

------------------------------------------
[...truncated 4742 lines...]
Downloaded: http://cilogon.svn.sourceforge.net/svnroot/cilogon/m2-repo/edu/uiuc/ncsa/myproxy/myproxy-logon/1.4.6-SNAPSHOT/maven-metadata.xml
(9 KB at 9.3 KB/sec)
Downloading: http://cilogon.svn.sourceforge.net/viewvc/cilogon/m2-repo/snapshots/edu/uiuc/ncsa/security/delegation/ncsa-security-oauth-1.0a/1.0.6-SNAPSHOT/maven-metadata.xml
Downloading: http://repository.apache.org/snapshots/edu/uiuc/ncsa/security/delegation/ncsa-security-oauth-1.0a/1.0.6-SNAPSHOT/maven-metadata.xml
Downloading: http://cilogon.svn.sourceforge.net/svnroot/cilogon/m2-repo/edu/uiuc/ncsa/security/delegation/ncsa-security-oauth-1.0a/1.0.6-SNAPSHOT/maven-metadata.xml
Downloading: http://unicore-dev.zam.kfa-juelich.de/maven/edu/uiuc/ncsa/security/delegation/ncsa-security-oauth-1.0a/1.0.6-SNAPSHOT/maven-metadata.xml
Downloading: http://cilogon.svn.sourceforge.net/svnroot/cilogon/m2-repo/snapshots/edu/uiuc/ncsa/security/delegation/ncsa-security-oauth-1.0a/1.0.6-SNAPSHOT/maven-metadata.xml
Downloaded: http://cilogon.svn.sourceforge.net/viewvc/cilogon/m2-repo/snapshots/edu/uiuc/ncsa/security/delegation/ncsa-security-oauth-1.0a/1.0.6-SNAPSHOT/maven-metadata.xml
(349 B at 0.8 KB/sec)
[WARNING] Checksum validation failed, expected <!DOCTYPE but is e86d8ce246d8a91d3b17e4586338bddaff0e348c
for http://cilogon.svn.sourceforge.net/svnroot/cilogon/m2-repo/edu/uiuc/ncsa/security/delegation/ncsa-security-oauth-1.0a/1.0.6-SNAPSHOT/maven-metadata.xml
Downloaded: http://cilogon.svn.sourceforge.net/svnroot/cilogon/m2-repo/snapshots/edu/uiuc/ncsa/security/delegation/ncsa-security-oauth-1.0a/1.0.6-SNAPSHOT/maven-metadata.xml
(349 B at 0.7 KB/sec)
[WARNING] Checksum validation failed, expected <!DOCTYPE but is e86d8ce246d8a91d3b17e4586338bddaff0e348c
for http://cilogon.svn.sourceforge.net/svnroot/cilogon/m2-repo/edu/uiuc/ncsa/security/delegation/ncsa-security-oauth-1.0a/1.0.6-SNAPSHOT/maven-metadata.xml
Downloaded: http://cilogon.svn.sourceforge.net/svnroot/cilogon/m2-repo/edu/uiuc/ncsa/security/delegation/ncsa-security-oauth-1.0a/1.0.6-SNAPSHOT/maven-metadata.xml
(9 KB at 9.0 KB/sec)
Downloading: http://cilogon.svn.sourceforge.net/svnroot/cilogon/m2-repo/edu/uiuc/ncsa/security/delegation/ncsa-security-delegation-server/1.0.6-SNAPSHOT/maven-metadata.xml
Downloading: http://unicore-dev.zam.kfa-juelich.de/maven/edu/uiuc/ncsa/security/delegation/ncsa-security-delegation-server/1.0.6-SNAPSHOT/maven-metadata.xml
Downloading: http://cilogon.svn.sourceforge.net/viewvc/cilogon/m2-repo/snapshots/edu/uiuc/ncsa/security/delegation/ncsa-security-delegation-server/1.0.6-SNAPSHOT/maven-metadata.xml
Downloading: http://repository.apache.org/snapshots/edu/uiuc/ncsa/security/delegation/ncsa-security-delegation-server/1.0.6-SNAPSHOT/maven-metadata.xml
Downloading: http://cilogon.svn.sourceforge.net/svnroot/cilogon/m2-repo/snapshots/edu/uiuc/ncsa/security/delegation/ncsa-security-delegation-server/1.0.6-SNAPSHOT/maven-metadata.xml
Downloading: http://oauth.googlecode.com/svn/code/maven/edu/uiuc/ncsa/security/delegation/ncsa-security-delegation-server/1.0.6-SNAPSHOT/maven-metadata.xml
[WARNING] Checksum validation failed, expected <!DOCTYPE but is e86d8ce246d8a91d3b17e4586338bddaff0e348c
for http://cilogon.svn.sourceforge.net/svnroot/cilogon/m2-repo/edu/uiuc/ncsa/security/delegation/ncsa-security-delegation-server/1.0.6-SNAPSHOT/maven-metadata.xml
Downloaded: http://cilogon.svn.sourceforge.net/svnroot/cilogon/m2-repo/snapshots/edu/uiuc/ncsa/security/delegation/ncsa-security-delegation-server/1.0.6-SNAPSHOT/maven-metadata.xml
(356 B at 0.5 KB/sec)
Downloaded: http://cilogon.svn.sourceforge.net/viewvc/cilogon/m2-repo/snapshots/edu/uiuc/ncsa/security/delegation/ncsa-security-delegation-server/1.0.6-SNAPSHOT/maven-metadata.xml
(356 B at 0.5 KB/sec)
[WARNING] Checksum validation failed, expected <!DOCTYPE but is e86d8ce246d8a91d3b17e4586338bddaff0e348c
for http://cilogon.svn.sourceforge.net/svnroot/cilogon/m2-repo/edu/uiuc/ncsa/security/delegation/ncsa-security-delegation-server/1.0.6-SNAPSHOT/maven-metadata.xml
Downloaded: http://cilogon.svn.sourceforge.net/svnroot/cilogon/m2-repo/edu/uiuc/ncsa/security/delegation/ncsa-security-delegation-server/1.0.6-SNAPSHOT/maven-metadata.xml
(9 KB at 8.7 KB/sec)
[WARNING] The POM for net.oauth.core:oauth-httpclient4:jar:20090617 is invalid, transitive
dependencies (if any) will not be available, enable debug logging for more details
[INFO] 
[INFO] --- maven-clean-plugin:2.5:clean (default-clean) @ airavata-credential-store ---
[INFO] 
[INFO] --- maven-resources-plugin:2.5:copy-resources (copy-resources) @ airavata-credential-store
---[debug] execute contextualize
[INFO] Using 'UTF-8' encoding to copy filtered resources.
[INFO] skip non existing resourceDirectory <https://builds.apache.org/job/Apache%20Airavata/ws/modules/credential-store/src/main/assembly/dist>

[INFO] 
[INFO] --- maven-remote-resources-plugin:1.4:process (default) @ airavata-credential-store
---
Downloading: http://cilogon.svn.sourceforge.net/svnroot/cilogon/m2-repo/edu/uiuc/ncsa/myproxy/myproxy/1.0.6-SNAPSHOT/maven-metadata.xml
Downloading: http://cilogon.svn.sourceforge.net/svnroot/cilogon/m2-repo/snapshots/edu/uiuc/ncsa/myproxy/myproxy/1.0.6-SNAPSHOT/maven-metadata.xml
[WARNING] Checksum validation failed, expected <!DOCTYPE but is e86d8ce246d8a91d3b17e4586338bddaff0e348c
for http://cilogon.svn.sourceforge.net/svnroot/cilogon/m2-repo/snapshots/edu/uiuc/ncsa/myproxy/myproxy/1.0.6-SNAPSHOT/maven-metadata.xml
[WARNING] Checksum validation failed, expected <!DOCTYPE but is e86d8ce246d8a91d3b17e4586338bddaff0e348c
for http://cilogon.svn.sourceforge.net/svnroot/cilogon/m2-repo/edu/uiuc/ncsa/myproxy/myproxy/1.0.6-SNAPSHOT/maven-metadata.xml
[WARNING] Checksum validation failed, expected <!DOCTYPE but is e86d8ce246d8a91d3b17e4586338bddaff0e348c
for http://cilogon.svn.sourceforge.net/svnroot/cilogon/m2-repo/snapshots/edu/uiuc/ncsa/myproxy/myproxy/1.0.6-SNAPSHOT/maven-metadata.xml
Downloaded: http://cilogon.svn.sourceforge.net/svnroot/cilogon/m2-repo/snapshots/edu/uiuc/ncsa/myproxy/myproxy/1.0.6-SNAPSHOT/maven-metadata.xml
(9 KB at 9.1 KB/sec)
[WARNING] Checksum validation failed, expected <!DOCTYPE but is e86d8ce246d8a91d3b17e4586338bddaff0e348c
for http://cilogon.svn.sourceforge.net/svnroot/cilogon/m2-repo/edu/uiuc/ncsa/myproxy/myproxy/1.0.6-SNAPSHOT/maven-metadata.xml
Downloaded: http://cilogon.svn.sourceforge.net/svnroot/cilogon/m2-repo/edu/uiuc/ncsa/myproxy/myproxy/1.0.6-SNAPSHOT/maven-metadata.xml
(9 KB at 8.8 KB/sec)
Downloading: http://cilogon.svn.sourceforge.net/svnroot/cilogon/m2-repo/edu/uiuc/ncsa/myproxy/oa4mp-client-api/1.0.6-SNAPSHOT/maven-metadata.xml
Downloading: http://cilogon.svn.sourceforge.net/svnroot/cilogon/m2-repo/snapshots/edu/uiuc/ncsa/myproxy/oa4mp-client-api/1.0.6-SNAPSHOT/maven-metadata.xml
[WARNING] Checksum validation failed, expected <!DOCTYPE but is e86d8ce246d8a91d3b17e4586338bddaff0e348c
for http://cilogon.svn.sourceforge.net/svnroot/cilogon/m2-repo/edu/uiuc/ncsa/myproxy/oa4mp-client-api/1.0.6-SNAPSHOT/maven-metadata.xml
[WARNING] Checksum validation failed, expected <!DOCTYPE but is e86d8ce246d8a91d3b17e4586338bddaff0e348c
for http://cilogon.svn.sourceforge.net/svnroot/cilogon/m2-repo/snapshots/edu/uiuc/ncsa/myproxy/oa4mp-client-api/1.0.6-SNAPSHOT/maven-metadata.xml
[WARNING] Checksum validation failed, expected <!DOCTYPE but is e86d8ce246d8a91d3b17e4586338bddaff0e348c
for http://cilogon.svn.sourceforge.net/svnroot/cilogon/m2-repo/edu/uiuc/ncsa/myproxy/oa4mp-client-api/1.0.6-SNAPSHOT/maven-metadata.xml
[WARNING] Checksum validation failed, expected <!DOCTYPE but is e86d8ce246d8a91d3b17e4586338bddaff0e348c
for http://cilogon.svn.sourceforge.net/svnroot/cilogon/m2-repo/snapshots/edu/uiuc/ncsa/myproxy/oa4mp-client-api/1.0.6-SNAPSHOT/maven-metadata.xml
Downloaded: http://cilogon.svn.sourceforge.net/svnroot/cilogon/m2-repo/edu/uiuc/ncsa/myproxy/oa4mp-client-api/1.0.6-SNAPSHOT/maven-metadata.xml
(9 KB at 5.9 KB/sec)
Downloaded: http://cilogon.svn.sourceforge.net/svnroot/cilogon/m2-repo/snapshots/edu/uiuc/ncsa/myproxy/oa4mp-client-api/1.0.6-SNAPSHOT/maven-metadata.xml
(9 KB at 5.9 KB/sec)
Downloading: http://oauth.googlecode.com/svn/code/maven/edu/uiuc/ncsa/security/delegation/ncsa-security-delegation/1.0.6-SNAPSHOT/maven-metadata.xml
Downloading: http://oauth.googlecode.com/svn/code/maven/edu/uiuc/ncsa/security/ncsa-security-all/1.0.6-SNAPSHOT/maven-metadata.xml
Downloading: http://oauth.googlecode.com/svn/code/maven/edu/uiuc/ncsa/security/delegation/ncsa-security-delegation-common/1.0.6-SNAPSHOT/maven-metadata.xml
Downloading: http://oauth.googlecode.com/svn/code/maven/edu/uiuc/ncsa/security/delegation/ncsa-security-delegation-client/1.0.6-SNAPSHOT/maven-metadata.xml
[WARNING] Invalid POM for net.oauth.core:oauth-httpclient4:jar:20090617, transitive dependencies
(if any) will not be available, enable debug logging for more details
Downloading: http://repo1.maven.org/maven2/net/oauth/core/oauth-consumer/20100527/oauth-consumer-20100527.pom
Downloading: http://community.ucs.indiana.edu:9090/archiva/repository/ogce.m2.all/net/oauth/core/oauth-consumer/20100527/oauth-consumer-20100527.pom
Downloading: http://cilogon.svn.sourceforge.net/viewvc/cilogon/m2-repo/snapshots/net/oauth/core/oauth-consumer/20100527/oauth-consumer-20100527.pom
Downloading: http://people.apache.org/repo/m2-snapshot-repository/net/oauth/core/oauth-consumer/20100527/oauth-consumer-20100527.pom
Downloading: http://unicore-dev.zam.kfa-juelich.de/maven/net/oauth/core/oauth-consumer/20100527/oauth-consumer-20100527.pom
Downloading: http://repo1.maven.org/maven2/net/oauth/core/oauth-httpclient4/20090617/oauth-httpclient4-20090617.pom
Downloading: http://community.ucs.indiana.edu:9090/archiva/repository/ogce.m2.all/net/oauth/core/oauth-httpclient4/20090617/oauth-httpclient4-20090617.pom
Downloading: http://cilogon.svn.sourceforge.net/viewvc/cilogon/m2-repo/snapshots/net/oauth/core/oauth-httpclient4/20090617/oauth-httpclient4-20090617.pom
Downloading: http://people.apache.org/repo/m2-snapshot-repository/net/oauth/core/oauth-httpclient4/20090617/oauth-httpclient4-20090617.pom
Downloading: http://unicore-dev.zam.kfa-juelich.de/maven/net/oauth/core/oauth-httpclient4/20090617/oauth-httpclient4-20090617.pom
[INFO] 
[INFO] --- maven-resources-plugin:2.5:resources (default-resources) @ airavata-credential-store
---[debug] execute contextualize
[INFO] Using 'UTF-8' encoding to copy filtered resources.
[INFO] skip non existing resourceDirectory <https://builds.apache.org/job/Apache%20Airavata/ws/modules/credential-store/src/main/resources>
[INFO] Copying 3 resources

[INFO] 
[INFO] --- maven-compiler-plugin:2.3.2:compile (default-compile) @ airavata-credential-store
---
[INFO] Compiling 17 source files to <https://builds.apache.org/job/Apache%20Airavata/ws/modules/credential-store/target/classes>
[INFO] -------------------------------------------------------------
[ERROR] COMPILATION ERROR : 
[INFO] -------------------------------------------------------------
[ERROR] error: error reading /export/home/hudson/hudson-slave/maven-repositories/1/net/oauth/core/oauth-httpclient4/20090617/oauth-httpclient4-20090617.jar;
error in opening zip file
[ERROR] error: error reading /export/home/hudson/hudson-slave/maven-repositories/1/net/oauth/core/oauth-consumer/20100527/oauth-consumer-20100527.jar;
error in opening zip file
[INFO] 2 errors 
[INFO] -------------------------------------------------------------
[INFO] ------------------------------------------------------------------------
[INFO] Reactor Summary:
[INFO] 
[INFO] Airavata .......................................... SUCCESS [1:47.214s]
[INFO] Airavata Commons .................................. SUCCESS [5.000s]
[INFO] Airavata GFac Schema Utilities .................... SUCCESS [2:29.878s]
[INFO] Airavata Common Utilities ......................... SUCCESS [1:19.261s]
[INFO] Airavata Registry ................................. SUCCESS [10.836s]
[INFO] Airavata Registry API ............................. SUCCESS [35.028s]
[INFO] Airavata Workflow Model Parent .................... SUCCESS [6.679s]
[INFO] Airavata Workflow Model Core ...................... SUCCESS [1:13.364s]
[INFO] Airavata WS Messenger ............................. SUCCESS [6.488s]
[INFO] Airavata Messenger Commons ........................ SUCCESS [45.362s]
[INFO] Airavata Messenger Client ......................... SUCCESS [42.413s]
[INFO] Airavata WS Monitor ............................... SUCCESS [54.538s]
[INFO] Airavata Workflow Execution Context ............... SUCCESS [1:34.186s]
[INFO] Airavata Client ................................... SUCCESS [34.020s]
[INFO] Airavata Workflow Tracking ........................ SUCCESS [27.458s]
[INFO] Airavata GFac Core ................................ SUCCESS [57.756s]
[INFO] Airavata Message Box .............................. SUCCESS [26.179s]
[INFO] Airavata Message Broker ........................... SUCCESS [59.639s]
[INFO] Airavata Workflow Component ....................... SUCCESS [12.015s]
[INFO] Airavata Workflow Component Node .................. SUCCESS [15.668s]
[INFO] Airavata JPA Registry ............................. SUCCESS [51.450s]
[INFO] Airavata REST ..................................... SUCCESS [5.948s]
[INFO] airavata-rest-mappings ............................ SUCCESS [30.189s]
[INFO] airavata-rest-client .............................. SUCCESS [15.894s]
[INFO] Airavata XBaya .................................... SUCCESS [1:30.449s]
[INFO] Airavata Registry Service ......................... SUCCESS [17.945s]
[INFO] Airavata Registry Test ............................ SUCCESS [31.547s]
[INFO] Airavata Security Implementation .................. SUCCESS [27.533s]
[INFO] Airavata Credential Store ......................... FAILURE [27.453s]
[INFO] airavata-rest-services ............................ SKIPPED
[INFO] airavata-rest-service-webapp ...................... SKIPPED
[INFO] Airavata Tools .................................... SKIPPED
[INFO] Airavata Phoebus Integration ...................... SKIPPED
[INFO] registry-tool ..................................... SKIPPED
[INFO] Simple Math Service ............................... SKIPPED
[INFO] Complex Math Service .............................. SKIPPED
[INFO] Levenshtein Distance Service ...................... SKIPPED
[INFO] Airavata Embedded Tomcat Implementation ........... SKIPPED
[INFO] Airavata Test Suite ............................... SKIPPED
[INFO] distribution ...................................... SKIPPED
[INFO] Samples - Airavata Client Samples ................. SKIPPED
[INFO] Samples - Workflow Create Application ............. SKIPPED
[INFO] Samples - Workflow Execution ...................... SKIPPED
[INFO] Airavata server distribution ...................... SKIPPED
[INFO] Airavata client distribution ...................... SKIPPED
[INFO] Airavata xbaya-gui distribution ................... SKIPPED
[INFO] Airavata release artifacts ........................ SKIPPED
[INFO] Airavata Integration Tests ........................ SKIPPED
[INFO] ------------------------------------------------------------------------
[INFO] BUILD FAILURE
[INFO] ------------------------------------------------------------------------
[INFO] Total time: 21:43.255s
[INFO] Finished at: Fri Mar 08 02:20:55 GMT+00:00 2013
[INFO] Final Memory: 127M/501M
[INFO] ------------------------------------------------------------------------
[JENKINS] Archiving <https://builds.apache.org/job/Apache%20Airavata/ws/modules/distribution/release/pom.xml>
to /home/hudson/hudson/jobs/Apache Airavata/modules/org.apache.airavata$apache-airavata-release-artifacts/builds/2013-03-08_01-56-20/archive/org.apache.airavata/apache-airavata-release-artifacts/0.7-SNAPSHOT/apache-airavata-release-artifacts-0.7-SNAPSHOT.pom
[JENKINS] Archiving <https://builds.apache.org/job/Apache%20Airavata/ws/modules/commons/workflow-tracking/pom.xml>
to /home/hudson/hudson/jobs/Apache Airavata/modules/org.apache.airavata$airavata-workflow-tracking/builds/2013-03-08_01-56-11/archive/org.apache.airavata/airavata-workflow-tracking/0.7-SNAPSHOT/airavata-workflow-tracking-0.7-SNAPSHOT.pom
[JENKINS] Archiving <https://builds.apache.org/job/Apache%20Airavata/ws/modules/commons/workflow-tracking/target/airavata-workflow-tracking-0.7-SNAPSHOT.jar>
to /home/hudson/hudson/jobs/Apache Airavata/modules/org.apache.airavata$airavata-workflow-tracking/builds/2013-03-08_01-56-11/archive/org.apache.airavata/airavata-workflow-tracking/0.7-SNAPSHOT/airavata-workflow-tracking-0.7-SNAPSHOT.jar
[JENKINS] Archiving <https://builds.apache.org/job/Apache%20Airavata/ws/samples/complex-math-service/pom.xml>
to /home/hudson/hudson/jobs/Apache Airavata/modules/org.apache.airavata$airavata-complex-math-service/builds/2013-03-08_01-56-18/archive/org.apache.airavata/airavata-complex-math-service/0.7-SNAPSHOT/airavata-complex-math-service-0.7-SNAPSHOT.pom
[JENKINS] Archiving <https://builds.apache.org/job/Apache%20Airavata/ws/modules/distribution/pom.xml>
to /home/hudson/hudson/jobs/Apache Airavata/modules/org.apache.airavata$distribution/builds/2013-03-08_01-56-20/archive/org.apache.airavata/distribution/0.7-SNAPSHOT/distribution-0.7-SNAPSHOT.pom
[JENKINS] Archiving <https://builds.apache.org/job/Apache%20Airavata/ws/modules/workflow-model/workflow-model-component-node/pom.xml>
to /home/hudson/hudson/jobs/Apache Airavata/modules/org.apache.airavata$airavata-workflow-model-component-node/builds/2013-03-08_01-56-10/archive/org.apache.airavata/airavata-workflow-model-component-node/0.7-SNAPSHOT/airavata-workflow-model-component-node-0.7-SNAPSHOT.pom
[JENKINS] Archiving <https://builds.apache.org/job/Apache%20Airavata/ws/modules/workflow-model/workflow-model-component-node/target/airavata-workflow-model-component-node-0.7-SNAPSHOT.jar>
to /home/hudson/hudson/jobs/Apache Airavata/modules/org.apache.airavata$airavata-workflow-model-component-node/builds/2013-03-08_01-56-10/archive/org.apache.airavata/airavata-workflow-model-component-node/0.7-SNAPSHOT/airavata-workflow-model-component-node-0.7-SNAPSHOT.jar
[JENKINS] Archiving <https://builds.apache.org/job/Apache%20Airavata/ws/samples/simple-math-service/pom.xml>
to /home/hudson/hudson/jobs/Apache Airavata/modules/org.apache.airavata$airavata-simple-math-service/builds/2013-03-08_01-56-17/archive/org.apache.airavata/airavata-simple-math-service/0.7-SNAPSHOT/airavata-simple-math-service-0.7-SNAPSHOT.pom
[JENKINS] Archiving <https://builds.apache.org/job/Apache%20Airavata/ws/modules/server/pom.xml>
to /home/hudson/hudson/jobs/Apache Airavata/modules/org.apache.airavata$airavata-embedded-tomcat/builds/2013-03-08_01-56-18/archive/org.apache.airavata/airavata-embedded-tomcat/0.7-SNAPSHOT/airavata-embedded-tomcat-0.7-SNAPSHOT.pom
[JENKINS] Archiving <https://builds.apache.org/job/Apache%20Airavata/ws/modules/registry/registry-api/pom.xml>
to /home/hudson/hudson/jobs/Apache Airavata/modules/org.apache.airavata$airavata-registry-api/builds/2013-03-08_01-56-13/archive/org.apache.airavata/airavata-registry-api/0.7-SNAPSHOT/airavata-registry-api-0.7-SNAPSHOT.pom
[JENKINS] Archiving <https://builds.apache.org/job/Apache%20Airavata/ws/modules/registry/registry-api/target/airavata-registry-api-0.7-SNAPSHOT.jar>
to /home/hudson/hudson/jobs/Apache Airavata/modules/org.apache.airavata$airavata-registry-api/builds/2013-03-08_01-56-13/archive/org.apache.airavata/airavata-registry-api/0.7-SNAPSHOT/airavata-registry-api-0.7-SNAPSHOT.jar
[JENKINS] Archiving <https://builds.apache.org/job/Apache%20Airavata/ws/modules/ws-messenger/messagebox/pom.xml>
to /home/hudson/hudson/jobs/Apache Airavata/modules/org.apache.airavata$airavata-message-box/builds/2013-03-08_01-56-05/archive/org.apache.airavata/airavata-message-box/0.7-SNAPSHOT/airavata-message-box-0.7-SNAPSHOT.pom
[JENKINS] Archiving <https://builds.apache.org/job/Apache%20Airavata/ws/modules/ws-messenger/messagebox/target/airavata-message-box-0.7-SNAPSHOT.jar>
to /home/hudson/hudson/jobs/Apache Airavata/modules/org.apache.airavata$airavata-message-box/builds/2013-03-08_01-56-05/archive/org.apache.airavata/airavata-message-box/0.7-SNAPSHOT/airavata-message-box-0.7-SNAPSHOT.jar
[JENKINS] Archiving <https://builds.apache.org/job/Apache%20Airavata/ws/modules/security/pom.xml>
to /home/hudson/hudson/jobs/Apache Airavata/modules/org.apache.airavata$airavata-security/builds/2013-03-08_01-56-14/archive/org.apache.airavata/airavata-security/0.7-SNAPSHOT/airavata-security-0.7-SNAPSHOT.pom
[JENKINS] Archiving <https://builds.apache.org/job/Apache%20Airavata/ws/modules/security/target/airavata-security-0.7-SNAPSHOT.jar>
to /home/hudson/hudson/jobs/Apache Airavata/modules/org.apache.airavata$airavata-security/builds/2013-03-08_01-56-14/archive/org.apache.airavata/airavata-security/0.7-SNAPSHOT/airavata-security-0.7-SNAPSHOT.jar
[JENKINS] Archiving <https://builds.apache.org/job/Apache%20Airavata/ws/tools/phoebus-integration/pom.xml>
to /home/hudson/hudson/jobs/Apache Airavata/modules/org.apache.airavata$airavata-phoebus-integration/builds/2013-03-08_01-56-16/archive/org.apache.airavata/airavata-phoebus-integration/0.7-SNAPSHOT/airavata-phoebus-integration-0.7-SNAPSHOT.pom
[JENKINS] Archiving <https://builds.apache.org/job/Apache%20Airavata/ws/modules/gfac-core/pom.xml>
to /home/hudson/hudson/jobs/Apache Airavata/modules/org.apache.airavata$airavata-gfac-core/builds/2013-03-08_01-56-03/archive/org.apache.airavata/airavata-gfac-core/0.7-SNAPSHOT/airavata-gfac-core-0.7-SNAPSHOT.pom
[JENKINS] Archiving <https://builds.apache.org/job/Apache%20Airavata/ws/modules/gfac-core/target/airavata-gfac-core-0.7-SNAPSHOT.jar>
to /home/hudson/hudson/jobs/Apache Airavata/modules/org.apache.airavata$airavata-gfac-core/builds/2013-03-08_01-56-03/archive/org.apache.airavata/airavata-gfac-core/0.7-SNAPSHOT/airavata-gfac-core-0.7-SNAPSHOT.jar
[JENKINS] Archiving <https://builds.apache.org/job/Apache%20Airavata/ws/modules/distribution/airavata-server/pom.xml>
to /home/hudson/hudson/jobs/Apache Airavata/modules/org.apache.airavata$apache-airavata-server/builds/2013-03-08_01-56-20/archive/org.apache.airavata/apache-airavata-server/0.7-SNAPSHOT/apache-airavata-server-0.7-SNAPSHOT.pom
[JENKINS] Archiving <https://builds.apache.org/job/Apache%20Airavata/ws/modules/registry/airavata-registry-test/pom.xml>
to /home/hudson/hudson/jobs/Apache Airavata/modules/org.apache.airavata$airavata-registry-test/builds/2013-03-08_01-56-14/archive/org.apache.airavata/airavata-registry-test/0.7-SNAPSHOT/airavata-registry-test-0.7-SNAPSHOT.pom
[JENKINS] Archiving <https://builds.apache.org/job/Apache%20Airavata/ws/modules/registry/airavata-registry-test/target/airavata-registry-test-0.7-SNAPSHOT.jar>
to /home/hudson/hudson/jobs/Apache Airavata/modules/org.apache.airavata$airavata-registry-test/builds/2013-03-08_01-56-14/archive/org.apache.airavata/airavata-registry-test/0.7-SNAPSHOT/airavata-registry-test-0.7-SNAPSHOT.jar
[JENKINS] Archiving <https://builds.apache.org/job/Apache%20Airavata/ws/modules/workflow-model/workflow-model-component/pom.xml>
to /home/hudson/hudson/jobs/Apache Airavata/modules/org.apache.airavata$airavata-workflow-model-component/builds/2013-03-08_01-56-09/archive/org.apache.airavata/airavata-workflow-model-component/0.7-SNAPSHOT/airavata-workflow-model-component-0.7-SNAPSHOT.pom
[JENKINS] Archiving <https://builds.apache.org/job/Apache%20Airavata/ws/modules/workflow-model/workflow-model-component/target/airavata-workflow-model-component-0.7-SNAPSHOT.jar>
to /home/hudson/hudson/jobs/Apache Airavata/modules/org.apache.airavata$airavata-workflow-model-component/builds/2013-03-08_01-56-09/archive/org.apache.airavata/airavata-workflow-model-component/0.7-SNAPSHOT/airavata-workflow-model-component-0.7-SNAPSHOT.jar
[JENKINS] Archiving <https://builds.apache.org/job/Apache%20Airavata/ws/modules/xbaya-gui/pom.xml>
to /home/hudson/hudson/jobs/Apache Airavata/modules/org.apache.airavata$airavata-xbaya-gui/builds/2013-03-08_01-56-10/archive/org.apache.airavata/airavata-xbaya-gui/0.7-SNAPSHOT/airavata-xbaya-gui-0.7-SNAPSHOT.pom
[JENKINS] Archiving <https://builds.apache.org/job/Apache%20Airavata/ws/modules/xbaya-gui/target/airavata-xbaya-gui-0.7-SNAPSHOT.jar>
to /home/hudson/hudson/jobs/Apache Airavata/modules/org.apache.airavata$airavata-xbaya-gui/builds/2013-03-08_01-56-10/archive/org.apache.airavata/airavata-xbaya-gui/0.7-SNAPSHOT/airavata-xbaya-gui-0.7-SNAPSHOT.jar
[JENKINS] Archiving <https://builds.apache.org/job/Apache%20Airavata/ws/modules/commons/workflow-execution-context/pom.xml>
to /home/hudson/hudson/jobs/Apache Airavata/modules/org.apache.airavata$airavata-workflow-execution-context/builds/2013-03-08_01-56-12/archive/org.apache.airavata/airavata-workflow-execution-context/0.7-SNAPSHOT/airavata-workflow-execution-context-0.7-SNAPSHOT.pom
[JENKINS] Archiving <https://builds.apache.org/job/Apache%20Airavata/ws/modules/commons/workflow-execution-context/target/airavata-workflow-execution-context-0.7-SNAPSHOT.jar>
to /home/hudson/hudson/jobs/Apache Airavata/modules/org.apache.airavata$airavata-workflow-execution-context/builds/2013-03-08_01-56-12/archive/org.apache.airavata/airavata-workflow-execution-context/0.7-SNAPSHOT/airavata-workflow-execution-context-0.7-SNAPSHOT.jar
[JENKINS] Archiving <https://builds.apache.org/job/Apache%20Airavata/ws/modules/integration-tests/pom.xml>
to /home/hudson/hudson/jobs/Apache Airavata/modules/org.apache.airavata$integration-tests/builds/2013-03-08_01-56-21/archive/org.apache.airavata/integration-tests/0.7-SNAPSHOT/integration-tests-0.7-SNAPSHOT.pom
[JENKINS] Archiving <https://builds.apache.org/job/Apache%20Airavata/ws/samples/airavata-client/workflow-run/pom.xml>
to /home/hudson/hudson/jobs/Apache Airavata/modules/org.apache.airavata$samples-workflow-run/builds/2013-03-08_01-56-19/archive/org.apache.airavata/samples-workflow-run/0.7-SNAPSHOT/samples-workflow-run-0.7-SNAPSHOT.pom
[JENKINS] Archiving <https://builds.apache.org/job/Apache%20Airavata/ws/modules/commons/pom.xml>
to /home/hudson/hudson/jobs/Apache Airavata/modules/org.apache.airavata$commons/builds/2013-03-08_01-56-10/archive/org.apache.airavata/commons/0.7-SNAPSHOT/commons-0.7-SNAPSHOT.pom
[JENKINS] Archiving <https://builds.apache.org/job/Apache%20Airavata/ws/modules/ws-messenger/message-monitor/pom.xml>
to /home/hudson/hudson/jobs/Apache Airavata/modules/org.apache.airavata$airavata-message-monitor/builds/2013-03-08_01-56-06/archive/org.apache.airavata/airavata-message-monitor/0.7-SNAPSHOT/airavata-message-monitor-0.7-SNAPSHOT.pom
[JENKINS] Archiving <https://builds.apache.org/job/Apache%20Airavata/ws/modules/ws-messenger/message-monitor/target/airavata-message-monitor-0.7-SNAPSHOT.jar>
to /home/hudson/hudson/jobs/Apache Airavata/modules/org.apache.airavata$airavata-message-monitor/builds/2013-03-08_01-56-06/archive/org.apache.airavata/airavata-message-monitor/0.7-SNAPSHOT/airavata-message-monitor-0.7-SNAPSHOT.jar
[JENKINS] Archiving <https://builds.apache.org/job/Apache%20Airavata/ws/modules/registry/pom.xml>
to /home/hudson/hudson/jobs/Apache Airavata/modules/org.apache.airavata$registry/builds/2013-03-08_01-56-13/archive/org.apache.airavata/registry/0.7-SNAPSHOT/registry-0.7-SNAPSHOT.pom
[JENKINS] Archiving <https://builds.apache.org/job/Apache%20Airavata/ws/tools/registry-tool/pom.xml>
to /home/hudson/hudson/jobs/Apache Airavata/modules/org.apache.airavata$registry-tool/builds/2013-03-08_01-56-17/archive/org.apache.airavata/registry-tool/0.7-SNAPSHOT/registry-tool-0.7-SNAPSHOT.pom
[JENKINS] Archiving <https://builds.apache.org/job/Apache%20Airavata/ws/tools/pom.xml>
to /home/hudson/hudson/jobs/Apache Airavata/modules/org.apache.airavata$airavata-tools-parent/builds/2013-03-08_01-56-16/archive/org.apache.airavata/airavata-tools-parent/0.7-SNAPSHOT/airavata-tools-parent-0.7-SNAPSHOT.pom
[JENKINS] Archiving <https://builds.apache.org/job/Apache%20Airavata/ws/samples/airavata-client/pom.xml>
to /home/hudson/hudson/jobs/Apache Airavata/modules/org.apache.airavata$airavata-client-sample/builds/2013-03-08_01-56-19/archive/org.apache.airavata/airavata-client-sample/0.7-SNAPSHOT/airavata-client-sample-0.7-SNAPSHOT.pom
[JENKINS] Archiving <https://builds.apache.org/job/Apache%20Airavata/ws/modules/ws-messenger/pom.xml>
to /home/hudson/hudson/jobs/Apache Airavata/modules/org.apache.airavata$airavata-ws-messenger/builds/2013-03-08_01-56-04/archive/org.apache.airavata/airavata-ws-messenger/0.7-SNAPSHOT/airavata-ws-messenger-0.7-SNAPSHOT.pom
[JENKINS] Archiving <https://builds.apache.org/job/Apache%20Airavata/ws/modules/rest/service/pom.xml>
to /home/hudson/hudson/jobs/Apache Airavata/modules/org.apache.airavata$airavata-rest-services/builds/2013-03-08_01-56-15/archive/org.apache.airavata/airavata-rest-services/0.7-SNAPSHOT/airavata-rest-services-0.7-SNAPSHOT.pom
[JENKINS] Archiving <https://builds.apache.org/job/Apache%20Airavata/ws/modules/rest/webapp/pom.xml>
to /home/hudson/hudson/jobs/Apache Airavata/modules/org.apache.airavata$airavata-rest-service-webapp/builds/2013-03-08_01-56-16/archive/org.apache.airavata/airavata-rest-service-webapp/0.7-SNAPSHOT/airavata-rest-service-webapp-0.7-SNAPSHOT.pom
[JENKINS] Archiving <https://builds.apache.org/job/Apache%20Airavata/ws/samples/airavata-client/create-application/pom.xml>
to /home/hudson/hudson/jobs/Apache Airavata/modules/org.apache.airavata$samples-create-application/builds/2013-03-08_01-56-19/archive/org.apache.airavata/samples-create-application/0.7-SNAPSHOT/samples-create-application-0.7-SNAPSHOT.pom
[JENKINS] Archiving <https://builds.apache.org/job/Apache%20Airavata/ws/modules/distribution/airavata-client/pom.xml>
to /home/hudson/hudson/jobs/Apache Airavata/modules/org.apache.airavata$apache-airavata-client/builds/2013-03-08_01-56-20/archive/org.apache.airavata/apache-airavata-client/0.7-SNAPSHOT/apache-airavata-client-0.7-SNAPSHOT.pom
[JENKINS] Archiving <https://builds.apache.org/job/Apache%20Airavata/ws/modules/registry/airavata-jpa-registry/pom.xml>
to /home/hudson/hudson/jobs/Apache Airavata/modules/org.apache.airavata$airavata-jpa-registry/builds/2013-03-08_01-56-13/archive/org.apache.airavata/airavata-jpa-registry/0.7-SNAPSHOT/airavata-jpa-registry-0.7-SNAPSHOT.pom
[JENKINS] Archiving <https://builds.apache.org/job/Apache%20Airavata/ws/modules/registry/airavata-jpa-registry/target/airavata-jpa-registry-0.7-SNAPSHOT.jar>
to /home/hudson/hudson/jobs/Apache Airavata/modules/org.apache.airavata$airavata-jpa-registry/builds/2013-03-08_01-56-13/archive/org.apache.airavata/airavata-jpa-registry/0.7-SNAPSHOT/airavata-jpa-registry-0.7-SNAPSHOT.jar
[JENKINS] Archiving <https://builds.apache.org/job/Apache%20Airavata/ws/modules/commons/utils/pom.xml>
to /home/hudson/hudson/jobs/Apache Airavata/modules/org.apache.airavata$airavata-common-utils/builds/2013-03-08_01-56-11/archive/org.apache.airavata/airavata-common-utils/0.7-SNAPSHOT/airavata-common-utils-0.7-SNAPSHOT.pom
[JENKINS] Archiving <https://builds.apache.org/job/Apache%20Airavata/ws/modules/commons/utils/target/airavata-common-utils-0.7-SNAPSHOT.jar>
to /home/hudson/hudson/jobs/Apache Airavata/modules/org.apache.airavata$airavata-common-utils/builds/2013-03-08_01-56-11/archive/org.apache.airavata/airavata-common-utils/0.7-SNAPSHOT/airavata-common-utils-0.7-SNAPSHOT.jar
[JENKINS] Archiving <https://builds.apache.org/job/Apache%20Airavata/ws/samples/levenshtein-distance-service/pom.xml>
to /home/hudson/hudson/jobs/Apache Airavata/modules/org.apache.airavata$airavata-levenshtein-distance-service/builds/2013-03-08_01-56-18/archive/org.apache.airavata/airavata-levenshtein-distance-service/0.7-SNAPSHOT/airavata-levenshtein-distance-service-0.7-SNAPSHOT.pom
[JENKINS] Archiving <https://builds.apache.org/job/Apache%20Airavata/ws/modules/rest/pom.xml>
to /home/hudson/hudson/jobs/Apache Airavata/modules/org.apache.airavata$rest/builds/2013-03-08_01-56-15/archive/org.apache.airavata/rest/0.7-SNAPSHOT/rest-0.7-SNAPSHOT.pom
[JENKINS] Archiving <https://builds.apache.org/job/Apache%20Airavata/ws/modules/distribution/xbaya-gui/pom.xml>
to /home/hudson/hudson/jobs/Apache Airavata/modules/org.apache.airavata$apache-airavata-xbaya-gui/builds/2013-03-08_01-56-20/archive/org.apache.airavata/apache-airavata-xbaya-gui/0.7-SNAPSHOT/apache-airavata-xbaya-gui-0.7-SNAPSHOT.pom
[JENKINS] Archiving <https://builds.apache.org/job/Apache%20Airavata/ws/modules/airavata-client/pom.xml>
to /home/hudson/hudson/jobs/Apache Airavata/modules/org.apache.airavata$airavata-client-api/builds/2013-03-08_01-56-14/archive/org.apache.airavata/airavata-client-api/0.7-SNAPSHOT/airavata-client-api-0.7-SNAPSHOT.pom
[JENKINS] Archiving <https://builds.apache.org/job/Apache%20Airavata/ws/modules/airavata-client/target/airavata-client-api-0.7-SNAPSHOT.jar>
to /home/hudson/hudson/jobs/Apache Airavata/modules/org.apache.airavata$airavata-client-api/builds/2013-03-08_01-56-14/archive/org.apache.airavata/airavata-client-api/0.7-SNAPSHOT/airavata-client-api-0.7-SNAPSHOT.jar
[JENKINS] Archiving <https://builds.apache.org/job/Apache%20Airavata/ws/modules/ws-messenger/messagebroker/pom.xml>
to /home/hudson/hudson/jobs/Apache Airavata/modules/org.apache.airavata$airavata-message-broker/builds/2013-03-08_01-56-06/archive/org.apache.airavata/airavata-message-broker/0.7-SNAPSHOT/airavata-message-broker-0.7-SNAPSHOT.pom
[JENKINS] Archiving <https://builds.apache.org/job/Apache%20Airavata/ws/modules/ws-messenger/messagebroker/target/airavata-message-broker-0.7-SNAPSHOT.jar>
to /home/hudson/hudson/jobs/Apache Airavata/modules/org.apache.airavata$airavata-message-broker/builds/2013-03-08_01-56-06/archive/org.apache.airavata/airavata-message-broker/0.7-SNAPSHOT/airavata-message-broker-0.7-SNAPSHOT.jar
[JENKINS] Archiving <https://builds.apache.org/job/Apache%20Airavata/ws/modules/commons/gfac-schema/pom.xml>
to /home/hudson/hudson/jobs/Apache Airavata/modules/org.apache.airavata$airavata-gfac-schema-utils/builds/2013-03-08_01-56-11/archive/org.apache.airavata/airavata-gfac-schema-utils/0.7-SNAPSHOT/airavata-gfac-schema-utils-0.7-SNAPSHOT.pom
[JENKINS] Archiving <https://builds.apache.org/job/Apache%20Airavata/ws/modules/commons/gfac-schema/target/airavata-gfac-schema-utils-0.7-SNAPSHOT.jar>
to /home/hudson/hudson/jobs/Apache Airavata/modules/org.apache.airavata$airavata-gfac-schema-utils/builds/2013-03-08_01-56-11/archive/org.apache.airavata/airavata-gfac-schema-utils/0.7-SNAPSHOT/airavata-gfac-schema-utils-0.7-SNAPSHOT.jar
[JENKINS] Archiving <https://builds.apache.org/job/Apache%20Airavata/ws/modules/rest/mappings/pom.xml>
to /home/hudson/hudson/jobs/Apache Airavata/modules/org.apache.airavata$airavata-rest-mappings/builds/2013-03-08_01-56-15/archive/org.apache.airavata/airavata-rest-mappings/0.7-SNAPSHOT/airavata-rest-mappings-0.7-SNAPSHOT.pom
[JENKINS] Archiving <https://builds.apache.org/job/Apache%20Airavata/ws/modules/rest/mappings/target/airavata-rest-mappings.jar>
to /home/hudson/hudson/jobs/Apache Airavata/modules/org.apache.airavata$airavata-rest-mappings/builds/2013-03-08_01-56-15/archive/org.apache.airavata/airavata-rest-mappings/0.7-SNAPSHOT/airavata-rest-mappings-0.7-SNAPSHOT.jar
[JENKINS] Archiving <https://builds.apache.org/job/Apache%20Airavata/ws/modules/workflow-model/pom.xml>
to /home/hudson/hudson/jobs/Apache Airavata/modules/org.apache.airavata$airavata-workflow-model-parent/builds/2013-03-08_01-56-08/archive/org.apache.airavata/airavata-workflow-model-parent/0.7-SNAPSHOT/airavata-workflow-model-parent-0.7-SNAPSHOT.pom
[JENKINS] Archiving <https://builds.apache.org/job/Apache%20Airavata/ws/modules/registry/airavata-registry-service/pom.xml>
to /home/hudson/hudson/jobs/Apache Airavata/modules/org.apache.airavata$airavata-registry-service/builds/2013-03-08_01-56-14/archive/org.apache.airavata/airavata-registry-service/0.7-SNAPSHOT/airavata-registry-service-0.7-SNAPSHOT.pom
[JENKINS] Archiving <https://builds.apache.org/job/Apache%20Airavata/ws/modules/registry/airavata-registry-service/target/airavata-registry-service-0.7-SNAPSHOT.jar>
to /home/hudson/hudson/jobs/Apache Airavata/modules/org.apache.airavata$airavata-registry-service/builds/2013-03-08_01-56-14/archive/org.apache.airavata/airavata-registry-service/0.7-SNAPSHOT/airavata-registry-service-0.7-SNAPSHOT.jar
[JENKINS] Archiving <https://builds.apache.org/job/Apache%20Airavata/ws/modules/rest/client/pom.xml>
to /home/hudson/hudson/jobs/Apache Airavata/modules/org.apache.airavata$airavata-rest-client/builds/2013-03-08_01-56-16/archive/org.apache.airavata/airavata-rest-client/0.7-SNAPSHOT/airavata-rest-client-0.7-SNAPSHOT.pom
[JENKINS] Archiving <https://builds.apache.org/job/Apache%20Airavata/ws/modules/rest/client/target/airavata-rest-client.jar>
to /home/hudson/hudson/jobs/Apache Airavata/modules/org.apache.airavata$airavata-rest-client/builds/2013-03-08_01-56-16/archive/org.apache.airavata/airavata-rest-client/0.7-SNAPSHOT/airavata-rest-client-0.7-SNAPSHOT.jar
[JENKINS] Archiving <https://builds.apache.org/job/Apache%20Airavata/ws/modules/credential-store/pom.xml>
to /home/hudson/hudson/jobs/Apache Airavata/modules/org.apache.airavata$airavata-credential-store/builds/2013-03-08_01-56-15/archive/org.apache.airavata/airavata-credential-store/0.7-SNAPSHOT/airavata-credential-store-0.7-SNAPSHOT.pom
[JENKINS] Archiving <https://builds.apache.org/job/Apache%20Airavata/ws/modules/ws-messenger/client/pom.xml>
to /home/hudson/hudson/jobs/Apache Airavata/modules/org.apache.airavata$airavata-messenger-client/builds/2013-03-08_01-56-04/archive/org.apache.airavata/airavata-messenger-client/0.7-SNAPSHOT/airavata-messenger-client-0.7-SNAPSHOT.pom
[JENKINS] Archiving <https://builds.apache.org/job/Apache%20Airavata/ws/modules/ws-messenger/client/target/airavata-messenger-client-0.7-SNAPSHOT.jar>
to /home/hudson/hudson/jobs/Apache Airavata/modules/org.apache.airavata$airavata-messenger-client/builds/2013-03-08_01-56-04/archive/org.apache.airavata/airavata-messenger-client/0.7-SNAPSHOT/airavata-messenger-client-0.7-SNAPSHOT.jar
[JENKINS] Archiving <https://builds.apache.org/job/Apache%20Airavata/ws/modules/ws-messenger/commons/pom.xml>
to /home/hudson/hudson/jobs/Apache Airavata/modules/org.apache.airavata$airavata-messenger-commons/builds/2013-03-08_01-56-04/archive/org.apache.airavata/airavata-messenger-commons/0.7-SNAPSHOT/airavata-messenger-commons-0.7-SNAPSHOT.pom
[JENKINS] Archiving <https://builds.apache.org/job/Apache%20Airavata/ws/modules/ws-messenger/commons/target/airavata-messenger-commons-0.7-SNAPSHOT.jar>
to /home/hudson/hudson/jobs/Apache Airavata/modules/org.apache.airavata$airavata-messenger-commons/builds/2013-03-08_01-56-04/archive/org.apache.airavata/airavata-messenger-commons/0.7-SNAPSHOT/airavata-messenger-commons-0.7-SNAPSHOT.jar
[JENKINS] Archiving <https://builds.apache.org/job/Apache%20Airavata/ws/modules/workflow-model/workflow-model-core/pom.xml>
to /home/hudson/hudson/jobs/Apache Airavata/modules/org.apache.airavata$airavata-workflow-model-core/builds/2013-03-08_01-56-09/archive/org.apache.airavata/airavata-workflow-model-core/0.7-SNAPSHOT/airavata-workflow-model-core-0.7-SNAPSHOT.pom
[JENKINS] Archiving <https://builds.apache.org/job/Apache%20Airavata/ws/modules/workflow-model/workflow-model-core/target/airavata-workflow-model-core-0.7-SNAPSHOT.jar>
to /home/hudson/hudson/jobs/Apache Airavata/modules/org.apache.airavata$airavata-workflow-model-core/builds/2013-03-08_01-56-09/archive/org.apache.airavata/airavata-workflow-model-core/0.7-SNAPSHOT/airavata-workflow-model-core-0.7-SNAPSHOT.jar
[JENKINS] Archiving <https://builds.apache.org/job/Apache%20Airavata/ws/modules/test-suite/pom.xml>
to /home/hudson/hudson/jobs/Apache Airavata/modules/org.apache.airavata$test-suite/builds/2013-03-08_01-56-18/archive/org.apache.airavata/test-suite/0.7-SNAPSHOT/test-suite-0.7-SNAPSHOT.pom
[JENKINS] Archiving <https://builds.apache.org/job/Apache%20Airavata/ws/pom.xml> to
/home/hudson/hudson/jobs/Apache Airavata/modules/org.apache.airavata$airavata/builds/2013-03-08_01-56-01/archive/org.apache.airavata/airavata/0.7-SNAPSHOT/airavata-0.7-SNAPSHOT.pom
Waiting for Jenkins to finish collecting data
mavenExecutionResult exceptions not empty
message : Failed to execute goal org.apache.maven.plugins:maven-compiler-plugin:2.3.2:compile
(default-compile) on project airavata-credential-store: Compilation failure
cause : Compilation failure
Stack trace : 
org.apache.maven.lifecycle.LifecycleExecutionException: Failed to execute goal org.apache.maven.plugins:maven-compiler-plugin:2.3.2:compile
(default-compile) on project airavata-credential-store: Compilation failure
	at org.apache.maven.lifecycle.internal.MojoExecutor.execute(MojoExecutor.java:213)
	at org.apache.maven.lifecycle.internal.MojoExecutor.execute(MojoExecutor.java:153)
	at org.apache.maven.lifecycle.internal.MojoExecutor.execute(MojoExecutor.java:145)
	at org.apache.maven.lifecycle.internal.LifecycleModuleBuilder.buildProject(LifecycleModuleBuilder.java:84)
	at org.apache.maven.lifecycle.internal.LifecycleModuleBuilder.buildProject(LifecycleModuleBuilder.java:59)
	at org.apache.maven.lifecycle.internal.LifecycleStarter.singleThreadedBuild(LifecycleStarter.java:183)
	at org.apache.maven.lifecycle.internal.LifecycleStarter.execute(LifecycleStarter.java:161)
	at org.apache.maven.DefaultMaven.doExecute(DefaultMaven.java:319)
	at org.apache.maven.DefaultMaven.execute(DefaultMaven.java:156)
	at org.jvnet.hudson.maven3.launcher.Maven3Launcher.main(Maven3Launcher.java:79)
	at sun.reflect.NativeMethodAccessorImpl.invoke0(Native Method)
	at sun.reflect.NativeMethodAccessorImpl.invoke(NativeMethodAccessorImpl.java:39)
	at sun.reflect.DelegatingMethodAccessorImpl.invoke(DelegatingMethodAccessorImpl.java:25)
	at java.lang.reflect.Method.invoke(Method.java:597)
	at org.codehaus.plexus.classworlds.launcher.Launcher.launchStandard(Launcher.java:329)
	at org.codehaus.plexus.classworlds.launcher.Launcher.launch(Launcher.java:239)
	at org.jvnet.hudson.maven3.agent.Maven3Main.launch(Maven3Main.java:158)
	at hudson.maven.Maven3Builder.call(Maven3Builder.java:100)
	at hudson.maven.Maven3Builder.call(Maven3Builder.java:66)
	at hudson.remoting.UserRequest.perform(UserRequest.java:118)
	at hudson.remoting.UserRequest.perform(UserRequest.java:48)
	at hudson.remoting.Request$2.run(Request.java:326)
	at hudson.remoting.InterceptingExecutorService$1.call(InterceptingExecutorService.java:72)
	at java.util.concurrent.FutureTask$Sync.innerRun(FutureTask.java:303)
	at java.util.concurrent.FutureTask.run(FutureTask.java:138)
	at java.util.concurrent.ThreadPoolExecutor$Worker.runTask(ThreadPoolExecutor.java:886)
	at java.util.concurrent.ThreadPoolExecutor$Worker.run(ThreadPoolExecutor.java:908)
	at java.lang.Thread.run(Thread.java:662)
Caused by: org.apache.maven.plugin.CompilationFailureException: Compilation failure
	at org.apache.maven.plugin.AbstractCompilerMojo.execute(AbstractCompilerMojo.java:656)
	at org.apache.maven.plugin.CompilerMojo.execute(CompilerMojo.java:128)
	at org.apache.maven.plugin.DefaultBuildPluginManager.executeMojo(DefaultBuildPluginManager.java:107)
	at org.apache.maven.lifecycle.internal.MojoExecutor.execute(MojoExecutor.java:209)
	... 27 more
Sending e-mails to: dev@airavata.apache.org heshan.suriyaarachchi@gmail.com
channel stopped

Mime
View raw message