airavata-dev mailing list archives

Site index · List index
Message view « Date » · « Thread »
Top « Date » · « Thread »
From Apache Jenkins Server <jenk...@builds.apache.org>
Subject Build failed in Jenkins: Apache Airavata » Airavata GFac Core #1054
Date Tue, 26 Feb 2013 21:39:42 GMT
See <https://builds.apache.org/job/Apache%20Airavata/org.apache.airavata$airavata-gfac-core/1054/>

------------------------------------------
[...truncated 332 lines...]
Downloading: http://repo1.maven.org/maven2/tomcat/jasper-compiler/5.5.12/jasper-compiler-5.5.12.jar
Downloaded: http://repo1.maven.org/maven2/tomcat/jasper-runtime/5.5.12/jasper-runtime-5.5.12.jar
(75 KB at 2774.1 KB/sec)
Downloading: http://repo1.maven.org/maven2/org/apache/hadoop/hadoop-client/1.0.3/hadoop-client-1.0.3.jar
Downloaded: http://repo1.maven.org/maven2/tomcat/jasper-compiler/5.5.12/jasper-compiler-5.5.12.jar
(396 KB at 10410.3 KB/sec)
Downloading: http://repo1.maven.org/maven2/org/apache/whirr/whirr-core/0.7.1/whirr-core-0.7.1.jar
Downloading: http://repo1.maven.org/maven2/org/jclouds/jclouds-compute/1.2.1/jclouds-compute-1.2.1.jar
Downloaded: http://repo1.maven.org/maven2/org/apache/hadoop/hadoop-core/1.0.3/hadoop-core-1.0.3.jar
(3837 KB at 25073.7 KB/sec)
Downloading: http://repo1.maven.org/maven2/org/jclouds/jclouds-scriptbuilder/1.2.1/jclouds-scriptbuilder-1.2.1.jar
Downloaded: http://repo1.maven.org/maven2/org/apache/hadoop/hadoop-client/1.0.3/hadoop-client-1.0.3.jar
(410 B at 2.4 KB/sec)
Downloading: http://repo1.maven.org/maven2/org/jclouds/jclouds-core/1.2.1/jclouds-core-1.2.1.jar
Downloaded: http://repo1.maven.org/maven2/org/apache/whirr/whirr-core/0.7.1/whirr-core-0.7.1.jar
(163 KB at 421.1 KB/sec)
Downloading: http://repo1.maven.org/maven2/net/oauth/core/oauth/20100527/oauth-20100527.jar
Downloaded: http://repo1.maven.org/maven2/net/oauth/core/oauth/20100527/oauth-20100527.jar
(44 KB at 846.5 KB/sec)
Downloading: http://repo1.maven.org/maven2/com/sun/jersey/jersey-core/1.6/jersey-core-1.6.jar
Downloading: http://repo1.maven.org/maven2/com/google/inject/extensions/guice-assistedinject/3.0/guice-assistedinject-3.0.jar
Downloaded: http://repo1.maven.org/maven2/com/google/inject/extensions/guice-assistedinject/3.0/guice-assistedinject-3.0.jar
(37 KB at 494.9 KB/sec)
Downloading: http://repo1.maven.org/maven2/javax/annotation/jsr250-api/1.0/jsr250-api-1.0.jar
Downloaded: http://repo1.maven.org/maven2/javax/annotation/jsr250-api/1.0/jsr250-api-1.0.jar
(6 KB at 1142.2 KB/sec)
Downloading: http://repo1.maven.org/maven2/com/google/code/gson/gson/1.7.2/gson-1.7.2.jar
Downloaded: http://repo1.maven.org/maven2/com/google/code/gson/gson/1.7.2/gson-1.7.2.jar (170
KB at 1883.8 KB/sec)
Downloading: http://repo1.maven.org/maven2/org/jclouds/api/byon/1.2.1/byon-1.2.1.jar
Downloaded: http://repo1.maven.org/maven2/com/sun/jersey/jersey-core/1.6/jersey-core-1.6.jar
(447 KB at 1801.8 KB/sec)
Downloading: http://repo1.maven.org/maven2/org/yaml/snakeyaml/1.8/snakeyaml-1.8.jar
Downloaded: http://repo1.maven.org/maven2/org/yaml/snakeyaml/1.8/snakeyaml-1.8.jar (252 KB
at 2330.5 KB/sec)
Downloading: http://repo1.maven.org/maven2/org/jclouds/driver/jclouds-enterprise/1.2.1/jclouds-enterprise-1.2.1.jar
Downloaded: http://repo1.maven.org/maven2/org/jclouds/jclouds-scriptbuilder/1.2.1/jclouds-scriptbuilder-1.2.1.jar
(100 KB at 126.9 KB/sec)
Downloading: http://repo1.maven.org/maven2/org/jclouds/driver/jclouds-joda/1.2.1/jclouds-joda-1.2.1.jar
Downloaded: http://repo1.maven.org/maven2/org/jclouds/driver/jclouds-joda/1.2.1/jclouds-joda-1.2.1.jar
(11 KB at 29.7 KB/sec)
Downloading: http://repo1.maven.org/maven2/org/jclouds/driver/jclouds-netty/1.2.1/jclouds-netty-1.2.1.jar
Downloaded: http://repo1.maven.org/maven2/org/jclouds/api/byon/1.2.1/byon-1.2.1.jar (51 KB
at 72.9 KB/sec)
Downloading: http://repo1.maven.org/maven2/org/jclouds/driver/jclouds-bouncycastle/1.2.1/jclouds-bouncycastle-1.2.1.jar
Downloaded: http://repo1.maven.org/maven2/org/jclouds/driver/jclouds-enterprise/1.2.1/jclouds-enterprise-1.2.1.jar
(10 KB at 16.3 KB/sec)
Downloading: http://repo1.maven.org/maven2/org/jclouds/driver/jclouds-sshj/1.2.1/jclouds-sshj-1.2.1.jar
Downloaded: http://repo1.maven.org/maven2/org/jclouds/jclouds-compute/1.2.1/jclouds-compute-1.2.1.jar
(372 KB at 268.8 KB/sec)
Downloading: http://repo1.maven.org/maven2/org/jclouds/driver/jclouds-slf4j/1.2.1/jclouds-slf4j-1.2.1.jar
Downloaded: http://repo1.maven.org/maven2/org/jclouds/driver/jclouds-netty/1.2.1/jclouds-netty-1.2.1.jar
(12 KB at 33.8 KB/sec)
Downloading: http://repo1.maven.org/maven2/org/jclouds/jclouds-allcompute/1.2.1/jclouds-allcompute-1.2.1.jar
Downloaded: http://repo1.maven.org/maven2/org/jclouds/driver/jclouds-bouncycastle/1.2.1/jclouds-bouncycastle-1.2.1.jar
(11 KB at 17.1 KB/sec)
Downloading: http://repo1.maven.org/maven2/org/jclouds/provider/greenhousedata-element-vcloud/1.2.1/greenhousedata-element-vcloud-1.2.1.jar
Downloaded: http://repo1.maven.org/maven2/org/jclouds/driver/jclouds-slf4j/1.2.1/jclouds-slf4j-1.2.1.jar
(11 KB at 22.8 KB/sec)
Downloading: http://repo1.maven.org/maven2/org/jclouds/provider/savvis-symphonyvpdc/1.2.1/savvis-symphonyvpdc-1.2.1.jar
Downloaded: http://repo1.maven.org/maven2/org/jclouds/jclouds-core/1.2.1/jclouds-core-1.2.1.jar
(709 KB at 368.9 KB/sec)
Downloading: http://repo1.maven.org/maven2/com/jamesmurty/utils/java-xmlbuilder/0.3/java-xmlbuilder-0.3.jar
Downloaded: http://repo1.maven.org/maven2/org/jclouds/driver/jclouds-sshj/1.2.1/jclouds-sshj-1.2.1.jar
(28 KB at 35.9 KB/sec)
Downloading: http://repo1.maven.org/maven2/org/jclouds/provider/eucalyptus-partnercloud-ec2/1.2.1/eucalyptus-partnercloud-ec2-1.2.1.jar
Downloaded: http://repo1.maven.org/maven2/com/jamesmurty/utils/java-xmlbuilder/0.3/java-xmlbuilder-0.3.jar
(18 KB at 125.3 KB/sec)
Downloading: http://repo1.maven.org/maven2/org/jclouds/api/eucalyptus/1.2.1/eucalyptus-1.2.1.jar
Downloaded: http://repo1.maven.org/maven2/org/jclouds/jclouds-allcompute/1.2.1/jclouds-allcompute-1.2.1.jar
(8 KB at 11.3 KB/sec)
Downloading: http://repo1.maven.org/maven2/org/jclouds/api/deltacloud/1.2.1/deltacloud-1.2.1.jar
Downloaded: http://repo1.maven.org/maven2/org/jclouds/provider/greenhousedata-element-vcloud/1.2.1/greenhousedata-element-vcloud-1.2.1.jar
(14 KB at 22.5 KB/sec)
Downloading: http://repo1.maven.org/maven2/org/jclouds/provider/aws-ec2/1.2.1/aws-ec2-1.2.1.jar
Downloaded: http://repo1.maven.org/maven2/org/jclouds/provider/eucalyptus-partnercloud-ec2/1.2.1/eucalyptus-partnercloud-ec2-1.2.1.jar
(15 KB at 33.1 KB/sec)
Downloading: http://repo1.maven.org/maven2/org/jclouds/common/aws-common/1.2.1/aws-common-1.2.1.jar
Downloaded: http://repo1.maven.org/maven2/org/jclouds/api/eucalyptus/1.2.1/eucalyptus-1.2.1.jar
(10 KB at 16.7 KB/sec)
Downloading: http://repo1.maven.org/maven2/org/jclouds/provider/rimuhosting/1.2.1/rimuhosting-1.2.1.jar
Downloaded: http://repo1.maven.org/maven2/org/jclouds/provider/savvis-symphonyvpdc/1.2.1/savvis-symphonyvpdc-1.2.1.jar
(146 KB at 128.1 KB/sec)
Downloading: http://repo1.maven.org/maven2/org/jclouds/api/nova/1.2.1/nova-1.2.1.jar
Downloaded: http://repo1.maven.org/maven2/org/jclouds/api/deltacloud/1.2.1/deltacloud-1.2.1.jar
(97 KB at 113.5 KB/sec)
Downloading: http://repo1.maven.org/maven2/org/jclouds/common/openstack-common/1.2.1/openstack-common-1.2.1.jar
Downloaded: http://repo1.maven.org/maven2/org/jclouds/common/aws-common/1.2.1/aws-common-1.2.1.jar
(40 KB at 70.1 KB/sec)
Downloading: http://repo1.maven.org/maven2/org/jclouds/api/ec2/1.2.1/ec2-1.2.1.jar
Downloaded: http://repo1.maven.org/maven2/org/jclouds/provider/aws-ec2/1.2.1/aws-ec2-1.2.1.jar
(183 KB at 166.2 KB/sec)
Downloading: http://repo1.maven.org/maven2/org/jclouds/provider/cloudservers-us/1.2.1/cloudservers-us-1.2.1.jar
Downloaded: http://repo1.maven.org/maven2/org/jclouds/provider/rimuhosting/1.2.1/rimuhosting-1.2.1.jar
(92 KB at 93.7 KB/sec)
Downloading: http://repo1.maven.org/maven2/org/jclouds/provider/cloudservers-uk/1.2.1/cloudservers-uk-1.2.1.jar
Downloaded: http://repo1.maven.org/maven2/org/jclouds/common/openstack-common/1.2.1/openstack-common-1.2.1.jar
(23 KB at 33.4 KB/sec)
Downloading: http://repo1.maven.org/maven2/org/jclouds/api/cloudservers/1.2.1/cloudservers-1.2.1.jar
Downloaded: http://repo1.maven.org/maven2/org/jclouds/api/nova/1.2.1/nova-1.2.1.jar (75 KB
at 69.2 KB/sec)
Downloading: http://repo1.maven.org/maven2/org/jclouds/api/vcloud/1.2.1/vcloud-1.2.1.jar
Downloaded: http://repo1.maven.org/maven2/org/jclouds/provider/cloudservers-us/1.2.1/cloudservers-us-1.2.1.jar
(11 KB at 19.8 KB/sec)
Downloading: http://repo1.maven.org/maven2/org/jclouds/api/cloudsigma/1.2.1/cloudsigma-1.2.1.jar
Downloaded: http://repo1.maven.org/maven2/org/jclouds/provider/cloudservers-uk/1.2.1/cloudservers-uk-1.2.1.jar
(11 KB at 18.2 KB/sec)
Downloading: http://repo1.maven.org/maven2/org/jclouds/provider/trmk-vcloudexpress/1.2.1/trmk-vcloudexpress-1.2.1.jar
Downloaded: http://repo1.maven.org/maven2/org/jclouds/api/ec2/1.2.1/ec2-1.2.1.jar (300 KB
at 240.6 KB/sec)
Downloading: http://repo1.maven.org/maven2/org/jclouds/common/trmk-common/1.2.1/trmk-common-1.2.1.jar
Downloaded: http://repo1.maven.org/maven2/org/jclouds/api/cloudservers/1.2.1/cloudservers-1.2.1.jar
(84 KB at 105.1 KB/sec)
Downloading: http://repo1.maven.org/maven2/org/jclouds/provider/trmk-ecloud/1.2.1/trmk-ecloud-1.2.1.jar
Downloaded: http://repo1.maven.org/maven2/org/jclouds/provider/trmk-vcloudexpress/1.2.1/trmk-vcloudexpress-1.2.1.jar
(19 KB at 26.1 KB/sec)
Downloading: http://repo1.maven.org/maven2/org/jclouds/provider/bluelock-vcloud-zone01/1.2.1/bluelock-vcloud-zone01-1.2.1.jar
Downloaded: http://repo1.maven.org/maven2/org/jclouds/api/cloudsigma/1.2.1/cloudsigma-1.2.1.jar
(159 KB at 136.6 KB/sec)
Downloading: http://repo1.maven.org/maven2/org/jclouds/provider/stratogen-vcloud-mycloud/1.2.1/stratogen-vcloud-mycloud-1.2.1.jar
Downloaded: http://repo1.maven.org/maven2/org/jclouds/provider/trmk-ecloud/1.2.1/trmk-ecloud-1.2.1.jar
(35 KB at 44.2 KB/sec)
Downloading: http://repo1.maven.org/maven2/org/jclouds/provider/gogrid/1.2.1/gogrid-1.2.1.jar
Downloaded: http://repo1.maven.org/maven2/org/jclouds/provider/bluelock-vcloud-zone01/1.2.1/bluelock-vcloud-zone01-1.2.1.jar
(13 KB at 27.8 KB/sec)
Downloading: http://repo1.maven.org/maven2/org/jclouds/provider/slicehost/1.2.1/slicehost-1.2.1.jar
Downloaded: http://repo1.maven.org/maven2/org/jclouds/common/trmk-common/1.2.1/trmk-common-1.2.1.jar
(339 KB at 265.4 KB/sec)
Downloading: http://repo1.maven.org/maven2/org/jclouds/api/elasticstack/1.2.1/elasticstack-1.2.1.jar
Downloaded: http://repo1.maven.org/maven2/org/jclouds/provider/stratogen-vcloud-mycloud/1.2.1/stratogen-vcloud-mycloud-1.2.1.jar
(14 KB at 29.7 KB/sec)
Downloading: http://repo1.maven.org/maven2/org/jclouds/provider/elastichosts-lon-p/1.2.1/elastichosts-lon-p-1.2.1.jar
Downloaded: http://repo1.maven.org/maven2/org/jclouds/api/vcloud/1.2.1/vcloud-1.2.1.jar (365
KB at 207.7 KB/sec)
Downloading: http://repo1.maven.org/maven2/org/jclouds/provider/elastichosts-sat-p/1.2.1/elastichosts-sat-p-1.2.1.jar
Downloaded: http://repo1.maven.org/maven2/org/jclouds/provider/slicehost/1.2.1/slicehost-1.2.1.jar
(72 KB at 84.7 KB/sec)
Downloading: http://repo1.maven.org/maven2/org/jclouds/provider/elastichosts-lon-b/1.2.1/elastichosts-lon-b-1.2.1.jar
Downloaded: http://repo1.maven.org/maven2/org/jclouds/provider/elastichosts-sat-p/1.2.1/elastichosts-sat-p-1.2.1.jar
(12 KB at 21.6 KB/sec)
Downloading: http://repo1.maven.org/maven2/org/jclouds/provider/openhosting-east1/1.2.1/openhosting-east1-1.2.1.jar
Downloaded: http://repo1.maven.org/maven2/org/jclouds/provider/elastichosts-lon-p/1.2.1/elastichosts-lon-p-1.2.1.jar
(12 KB at 16.8 KB/sec)
Downloading: http://repo1.maven.org/maven2/org/jclouds/provider/serverlove-z1-man/1.2.1/serverlove-z1-man-1.2.1.jar
Downloaded: http://repo1.maven.org/maven2/org/jclouds/provider/gogrid/1.2.1/gogrid-1.2.1.jar
(149 KB at 116.1 KB/sec)
Downloading: http://repo1.maven.org/maven2/org/jclouds/provider/skalicloud-sdg-my/1.2.1/skalicloud-sdg-my-1.2.1.jar
Downloaded: http://repo1.maven.org/maven2/org/jclouds/api/elasticstack/1.2.1/elasticstack-1.2.1.jar
(137 KB at 127.7 KB/sec)
Downloading: http://repo1.maven.org/maven2/org/jclouds/provider/cloudsigma-zrh/1.2.1/cloudsigma-zrh-1.2.1.jar
Downloaded: http://repo1.maven.org/maven2/org/jclouds/provider/openhosting-east1/1.2.1/openhosting-east1-1.2.1.jar
(13 KB at 26.7 KB/sec)
Downloading: http://repo1.maven.org/maven2/org/jclouds/provider/cloudsigma-lvs/1.2.1/cloudsigma-lvs-1.2.1.jar
Downloaded: http://repo1.maven.org/maven2/org/jclouds/provider/elastichosts-lon-b/1.2.1/elastichosts-lon-b-1.2.1.jar
(12 KB at 19.6 KB/sec)
Downloading: http://repo1.maven.org/maven2/org/jclouds/provider/go2cloud-jhb1/1.2.1/go2cloud-jhb1-1.2.1.jar
Downloaded: http://repo1.maven.org/maven2/org/jclouds/provider/skalicloud-sdg-my/1.2.1/skalicloud-sdg-my-1.2.1.jar
(13 KB at 37.5 KB/sec)
Downloading: http://repo1.maven.org/maven2/org/jclouds/provider/softlayer/1.2.1/softlayer-1.2.1.jar
Downloaded: http://repo1.maven.org/maven2/org/jclouds/provider/serverlove-z1-man/1.2.1/serverlove-z1-man-1.2.1.jar
(13 KB at 22.2 KB/sec)
Downloading: http://repo1.maven.org/maven2/org/jclouds/jclouds-allblobstore/1.2.1/jclouds-allblobstore-1.2.1.jar
Downloaded: http://repo1.maven.org/maven2/org/jclouds/provider/cloudsigma-lvs/1.2.1/cloudsigma-lvs-1.2.1.jar
(16 KB at 33.1 KB/sec)
Downloading: http://repo1.maven.org/maven2/org/jclouds/api/s3/1.2.1/s3-1.2.1.jar
Downloaded: http://repo1.maven.org/maven2/org/jclouds/provider/go2cloud-jhb1/1.2.1/go2cloud-jhb1-1.2.1.jar
(13 KB at 20.7 KB/sec)
Downloading: http://repo1.maven.org/maven2/org/jclouds/jclouds-blobstore/1.2.1/jclouds-blobstore-1.2.1.jar
Downloaded: http://repo1.maven.org/maven2/org/jclouds/jclouds-allblobstore/1.2.1/jclouds-allblobstore-1.2.1.jar
(8 KB at 13.7 KB/sec)
Downloading: http://repo1.maven.org/maven2/org/jclouds/provider/aws-s3/1.2.1/aws-s3-1.2.1.jar
Downloaded: http://repo1.maven.org/maven2/org/jclouds/provider/cloudsigma-zrh/1.2.1/cloudsigma-zrh-1.2.1.jar
(27 KB at 28.8 KB/sec)
Downloading: http://repo1.maven.org/maven2/org/jclouds/provider/ninefold-storage/1.2.1/ninefold-storage-1.2.1.jar
Downloaded: http://repo1.maven.org/maven2/org/jclouds/provider/softlayer/1.2.1/softlayer-1.2.1.jar
(123 KB at 109.5 KB/sec)
Downloading: http://repo1.maven.org/maven2/org/jclouds/provider/synaptic-storage/1.2.1/synaptic-storage-1.2.1.jar
Downloaded: http://repo1.maven.org/maven2/org/jclouds/provider/ninefold-storage/1.2.1/ninefold-storage-1.2.1.jar
(11 KB at 19.1 KB/sec)
Downloading: http://repo1.maven.org/maven2/org/jclouds/provider/cloudonestorage/1.2.1/cloudonestorage-1.2.1.jar
Downloaded: http://repo1.maven.org/maven2/org/jclouds/provider/aws-s3/1.2.1/aws-s3-1.2.1.jar
(45 KB at 56.7 KB/sec)
Downloading: http://repo1.maven.org/maven2/org/jclouds/api/walrus/1.2.1/walrus-1.2.1.jar
Downloaded: http://repo1.maven.org/maven2/org/jclouds/api/s3/1.2.1/s3-1.2.1.jar (135 KB at
120.6 KB/sec)
Downloading: http://repo1.maven.org/maven2/org/jclouds/provider/eucalyptus-partnercloud-s3/1.2.1/eucalyptus-partnercloud-s3-1.2.1.jar
Downloaded: http://repo1.maven.org/maven2/org/jclouds/jclouds-blobstore/1.2.1/jclouds-blobstore-1.2.1.jar
(191 KB at 171.0 KB/sec)
Downloading: http://repo1.maven.org/maven2/org/jclouds/provider/azureblob/1.2.1/azureblob-1.2.1.jar
Downloaded: http://repo1.maven.org/maven2/org/jclouds/provider/synaptic-storage/1.2.1/synaptic-storage-1.2.1.jar
(11 KB at 19.3 KB/sec)
Downloading: http://repo1.maven.org/maven2/org/jclouds/common/azure-common/1.2.1/azure-common-1.2.1.jar
Downloaded: http://repo1.maven.org/maven2/org/jclouds/provider/cloudonestorage/1.2.1/cloudonestorage-1.2.1.jar
(11 KB at 19.9 KB/sec)
Downloading: http://repo1.maven.org/maven2/org/jclouds/api/atmos/1.2.1/atmos-1.2.1.jar
Downloaded: http://repo1.maven.org/maven2/org/jclouds/api/walrus/1.2.1/walrus-1.2.1.jar (12
KB at 25.1 KB/sec)
Downloading: http://repo1.maven.org/maven2/org/jclouds/api/swift/1.2.1/swift-1.2.1.jar
Downloaded: http://repo1.maven.org/maven2/org/jclouds/provider/eucalyptus-partnercloud-s3/1.2.1/eucalyptus-partnercloud-s3-1.2.1.jar
(11 KB at 31.9 KB/sec)
Downloading: http://repo1.maven.org/maven2/org/jclouds/api/cloudfiles/1.2.1/cloudfiles-1.2.1.jar
Downloaded: http://repo1.maven.org/maven2/org/jclouds/api/cloudfiles/1.2.1/cloudfiles-1.2.1.jar
(30 KB at 64.0 KB/sec)
Downloading: http://repo1.maven.org/maven2/org/jclouds/provider/cloudfiles-us/1.2.1/cloudfiles-us-1.2.1.jar
Downloaded: http://repo1.maven.org/maven2/org/jclouds/common/azure-common/1.2.1/azure-common-1.2.1.jar
(34 KB at 42.5 KB/sec)
Downloading: http://repo1.maven.org/maven2/org/jclouds/provider/cloudfiles-uk/1.2.1/cloudfiles-uk-1.2.1.jar
Downloaded: http://repo1.maven.org/maven2/org/jclouds/provider/azureblob/1.2.1/azureblob-1.2.1.jar
(86 KB at 98.5 KB/sec)
Downloading: http://repo1.maven.org/maven2/org/jclouds/api/filesystem/1.2.1/filesystem-1.2.1.jar
Downloaded: http://repo1.maven.org/maven2/org/jclouds/api/atmos/1.2.1/atmos-1.2.1.jar (99
KB at 117.1 KB/sec)
Downloading: http://repo1.maven.org/maven2/org/apache/whirr/whirr-hadoop/0.7.1/whirr-hadoop-0.7.1.jar
Downloaded: http://repo1.maven.org/maven2/org/jclouds/api/swift/1.2.1/swift-1.2.1.jar (76
KB at 73.5 KB/sec)
Downloading: http://repo1.maven.org/maven2/org/hamcrest/hamcrest-all/1.1/hamcrest-all-1.1.jar
Downloaded: http://repo1.maven.org/maven2/org/jclouds/provider/cloudfiles-us/1.2.1/cloudfiles-us-1.2.1.jar
(11 KB at 18.4 KB/sec)
Downloading: http://repo1.maven.org/maven2/org/mockito/mockito-all/1.8.5/mockito-all-1.8.5.jar
Downloaded: http://repo1.maven.org/maven2/org/hamcrest/hamcrest-all/1.1/hamcrest-all-1.1.jar
(530 KB at 8674.4 KB/sec)
Downloading: http://repo1.maven.org/maven2/commons-configuration/commons-configuration/1.7/commons-configuration-1.7.jar
Downloaded: http://repo1.maven.org/maven2/org/apache/whirr/whirr-hadoop/0.7.1/whirr-hadoop-0.7.1.jar
(33 KB at 104.8 KB/sec)
Downloading: http://repo1.maven.org/maven2/commons-digester/commons-digester/1.8.1/commons-digester-1.8.1.jar
Downloaded: http://repo1.maven.org/maven2/commons-digester/commons-digester/1.8.1/commons-digester-1.8.1.jar
(143 KB at 2972.6 KB/sec)
Downloading: http://repo1.maven.org/maven2/net/sf/jopt-simple/jopt-simple/3.2/jopt-simple-3.2.jar
Downloaded: http://repo1.maven.org/maven2/commons-configuration/commons-configuration/1.7/commons-configuration-1.7.jar
(343 KB at 3978.2 KB/sec)
Downloaded: http://repo1.maven.org/maven2/org/mockito/mockito-all/1.8.5/mockito-all-1.8.5.jar
(1387 KB at 14294.8 KB/sec)
Downloaded: http://repo1.maven.org/maven2/org/jclouds/provider/cloudfiles-uk/1.2.1/cloudfiles-uk-1.2.1.jar
(11 KB at 19.8 KB/sec)
Downloaded: http://repo1.maven.org/maven2/net/sf/jopt-simple/jopt-simple/3.2/jopt-simple-3.2.jar
(52 KB at 702.6 KB/sec)
Downloaded: http://repo1.maven.org/maven2/org/jclouds/api/filesystem/1.2.1/filesystem-1.2.1.jar
(47 KB at 68.6 KB/sec)
Downloading: http://community.ucs.indiana.edu:9090/archiva/repository/ogce.m2.all/cog-globus/cog-jglobus/1.8.0-bc146/cog-jglobus-1.8.0-bc146.jar
Downloading: http://community.ucs.indiana.edu:9090/archiva/repository/ogce.m2.all/cog-globus/puretls/1.0/puretls-1.0.jar
Downloading: http://community.ucs.indiana.edu:9090/archiva/repository/ogce.m2.all/eu/unicore/services/use-wsrftypes/2.2.0-rc/use-wsrftypes-2.2.0-rc.jar
Downloading: http://community.ucs.indiana.edu:9090/archiva/repository/ogce.m2.all/cog-globus/cryptix32/1.0/cryptix32-1.0.jar
Downloading: http://community.ucs.indiana.edu:9090/archiva/repository/ogce.m2.all/cog-globus/cryptix-asn1/1.0/cryptix-asn1-1.0.jar
Downloading: http://community.ucs.indiana.edu:9090/archiva/repository/ogce.m2.all/eu/unicore/services/use-wsrfclient/2.2.0-rc/use-wsrfclient-2.2.0-rc.jar
Downloading: http://community.ucs.indiana.edu:9090/archiva/repository/ogce.m2.all/eu/unicore/security/secutils-xfire/1.2.0/secutils-xfire-1.2.0.jar
Downloading: http://community.ucs.indiana.edu:9090/archiva/repository/ogce.m2.all/eu/unicore/security/securityLibrary/3.0.0/securityLibrary-3.0.0.jar
Downloading: http://community.ucs.indiana.edu:9090/archiva/repository/ogce.m2.all/pl/edu/icm/saml/samly2/1.4.0/samly2-1.4.0.jar
Downloading: http://cilogon.svn.sourceforge.net/viewvc/cilogon/m2-repo/snapshots/cog-globus/cog-jglobus/1.8.0-bc146/cog-jglobus-1.8.0-bc146.jar
Downloading: http://cilogon.svn.sourceforge.net/viewvc/cilogon/m2-repo/snapshots/cog-globus/puretls/1.0/puretls-1.0.jar
Downloading: http://cilogon.svn.sourceforge.net/viewvc/cilogon/m2-repo/snapshots/cog-globus/cryptix32/1.0/cryptix32-1.0.jar
Downloading: http://cilogon.svn.sourceforge.net/viewvc/cilogon/m2-repo/snapshots/cog-globus/cryptix-asn1/1.0/cryptix-asn1-1.0.jar
Downloading: http://cilogon.svn.sourceforge.net/viewvc/cilogon/m2-repo/snapshots/eu/unicore/services/use-wsrftypes/2.2.0-rc/use-wsrftypes-2.2.0-rc.jar
Downloading: http://cilogon.svn.sourceforge.net/viewvc/cilogon/m2-repo/snapshots/eu/unicore/services/use-wsrfclient/2.2.0-rc/use-wsrfclient-2.2.0-rc.jar
Downloading: http://cilogon.svn.sourceforge.net/viewvc/cilogon/m2-repo/snapshots/eu/unicore/security/secutils-xfire/1.2.0/secutils-xfire-1.2.0.jar
Downloading: http://cilogon.svn.sourceforge.net/viewvc/cilogon/m2-repo/snapshots/eu/unicore/security/securityLibrary/3.0.0/securityLibrary-3.0.0.jar
Downloading: http://cilogon.svn.sourceforge.net/viewvc/cilogon/m2-repo/snapshots/pl/edu/icm/saml/samly2/1.4.0/samly2-1.4.0.jar
Downloading: http://people.apache.org/repo/m2-snapshot-repository/cog-globus/cog-jglobus/1.8.0-bc146/cog-jglobus-1.8.0-bc146.jar
Downloading: http://people.apache.org/repo/m2-snapshot-repository/cog-globus/puretls/1.0/puretls-1.0.jar
Downloading: http://people.apache.org/repo/m2-snapshot-repository/cog-globus/cryptix32/1.0/cryptix32-1.0.jar
Downloading: http://people.apache.org/repo/m2-snapshot-repository/eu/unicore/services/use-wsrftypes/2.2.0-rc/use-wsrftypes-2.2.0-rc.jar
Downloading: http://people.apache.org/repo/m2-snapshot-repository/cog-globus/cryptix-asn1/1.0/cryptix-asn1-1.0.jar
Downloading: http://people.apache.org/repo/m2-snapshot-repository/eu/unicore/services/use-wsrfclient/2.2.0-rc/use-wsrfclient-2.2.0-rc.jar
Downloading: http://people.apache.org/repo/m2-snapshot-repository/eu/unicore/security/secutils-xfire/1.2.0/secutils-xfire-1.2.0.jar
Downloading: http://people.apache.org/repo/m2-snapshot-repository/eu/unicore/security/securityLibrary/3.0.0/securityLibrary-3.0.0.jar
Downloading: http://people.apache.org/repo/m2-snapshot-repository/pl/edu/icm/saml/samly2/1.4.0/samly2-1.4.0.jar
Downloading: http://unicore-dev.zam.kfa-juelich.de/maven/cog-globus/cog-jglobus/1.8.0-bc146/cog-jglobus-1.8.0-bc146.jar
Downloading: http://unicore-dev.zam.kfa-juelich.de/maven/cog-globus/puretls/1.0/puretls-1.0.jar
Downloading: http://unicore-dev.zam.kfa-juelich.de/maven/cog-globus/cryptix32/1.0/cryptix32-1.0.jar
Downloading: http://unicore-dev.zam.kfa-juelich.de/maven/cog-globus/cryptix-asn1/1.0/cryptix-asn1-1.0.jar
Downloading: http://unicore-dev.zam.kfa-juelich.de/maven/eu/unicore/ogsabes-client/1.6.0-SNAPSHOT/ogsabes-client-1.6.0-20130114.135205-5.jar
Downloaded: http://unicore-dev.zam.kfa-juelich.de/maven/eu/unicore/ogsabes-client/1.6.0-SNAPSHOT/ogsabes-client-1.6.0-20130114.135205-5.jar
(27 KB at 503.8 KB/sec)
Downloading: http://unicore-dev.zam.kfa-juelich.de/maven/eu/unicore/ogsabes-types/1.6.0-SNAPSHOT/ogsabes-types-1.6.0-20130114.135158-5.jar
Downloaded: http://unicore-dev.zam.kfa-juelich.de/maven/cog-globus/cryptix-asn1/1.0/cryptix-asn1-1.0.jar
(79 KB at 957.4 KB/sec)
Downloading: http://unicore-dev.zam.kfa-juelich.de/maven/eu/unicore/cis-u6-infoprovider-types/1.6.0-SNAPSHOT/cis-u6-infoprovider-types-1.6.0-20130114.135104-7.jar
Downloaded: http://unicore-dev.zam.kfa-juelich.de/maven/cog-globus/puretls/1.0/puretls-1.0.jar
(187 KB at 1683.5 KB/sec)
Downloading: http://unicore-dev.zam.kfa-juelich.de/maven/eu/unicore/services/use-wsrftypes/2.2.0-rc/use-wsrftypes-2.2.0-rc.jar
Downloaded: http://unicore-dev.zam.kfa-juelich.de/maven/cog-globus/cryptix32/1.0/cryptix32-1.0.jar
(358 KB at 2249.5 KB/sec)
Downloading: http://unicore-dev.zam.kfa-juelich.de/maven/eu/unicore/uas-types/1.6.0-SNAPSHOT/uas-types-1.6.0-20130114.135055-7.jar
Downloaded: http://unicore-dev.zam.kfa-juelich.de/maven/eu/unicore/ogsabes-types/1.6.0-SNAPSHOT/ogsabes-types-1.6.0-20130114.135158-5.jar
(372 KB at 2474.6 KB/sec)
Downloading: http://unicore-dev.zam.kfa-juelich.de/maven/eu/unicore/uas-client/1.6.0-SNAPSHOT/uas-client-1.6.0-20130114.135118-10.jar
Downloaded: http://unicore-dev.zam.kfa-juelich.de/maven/eu/unicore/uas-client/1.6.0-SNAPSHOT/uas-client-1.6.0-20130114.135118-10.jar
(147 KB at 1344.7 KB/sec)
Downloading: http://unicore-dev.zam.kfa-juelich.de/maven/eu/unicore/services/use-wsrfclient/2.2.0-rc/use-wsrfclient-2.2.0-rc.jar
Downloaded: http://unicore-dev.zam.kfa-juelich.de/maven/eu/unicore/services/use-wsrfclient/2.2.0-rc/use-wsrfclient-2.2.0-rc.jar
(93 KB at 1859.5 KB/sec)
Downloading: http://unicore-dev.zam.kfa-juelich.de/maven/eu/unicore/security/secutils-xfire/1.2.0/secutils-xfire-1.2.0.jar
Downloaded: http://unicore-dev.zam.kfa-juelich.de/maven/cog-globus/cog-jglobus/1.8.0-bc146/cog-jglobus-1.8.0-bc146.jar
(1024 KB at 2751.2 KB/sec)
Downloading: http://unicore-dev.zam.kfa-juelich.de/maven/eu/unicore/security/securityLibrary/3.0.0/securityLibrary-3.0.0.jar
[WARNING] Checksum validation failed, expected eb562cef7e8b43fcaaf393707c62143e972c0d3c but
is 5085f50973b9bc55a0c2bbdc2cbe9b1ab142068f for http://unicore-dev.zam.kfa-juelich.de/maven/eu/unicore/security/secutils-xfire/1.2.0/secutils-xfire-1.2.0.jar
[WARNING] Checksum validation failed, expected e947f3beba6c22e19d659a8abd7b46c3c6997b35 but
is 75d70967a9c7752b20bd48368c8e86294889dae4 for http://unicore-dev.zam.kfa-juelich.de/maven/eu/unicore/security/securityLibrary/3.0.0/securityLibrary-3.0.0.jar
[WARNING] Checksum validation failed, expected eb562cef7e8b43fcaaf393707c62143e972c0d3c but
is 5085f50973b9bc55a0c2bbdc2cbe9b1ab142068f for http://unicore-dev.zam.kfa-juelich.de/maven/eu/unicore/security/secutils-xfire/1.2.0/secutils-xfire-1.2.0.jar
Downloaded: http://unicore-dev.zam.kfa-juelich.de/maven/eu/unicore/security/secutils-xfire/1.2.0/secutils-xfire-1.2.0.jar
(76 KB at 982.0 KB/sec)
Downloading: http://unicore-dev.zam.kfa-juelich.de/maven/pl/edu/icm/saml/samly2/1.4.0/samly2-1.4.0.jar
[WARNING] Checksum validation failed, expected bea8ee152aae06bbedd38f9cd7ce49fc8a63dca5 but
is f73b4a6636ccdde4bca83f4891b4e900a39332d3 for http://unicore-dev.zam.kfa-juelich.de/maven/pl/edu/icm/saml/samly2/1.4.0/samly2-1.4.0.jar
[WARNING] Checksum validation failed, expected e947f3beba6c22e19d659a8abd7b46c3c6997b35 but
is 75d70967a9c7752b20bd48368c8e86294889dae4 for http://unicore-dev.zam.kfa-juelich.de/maven/eu/unicore/security/securityLibrary/3.0.0/securityLibrary-3.0.0.jar
Downloaded: http://unicore-dev.zam.kfa-juelich.de/maven/eu/unicore/security/securityLibrary/3.0.0/securityLibrary-3.0.0.jar
(156 KB at 1251.0 KB/sec)
[WARNING] Checksum validation failed, expected bea8ee152aae06bbedd38f9cd7ce49fc8a63dca5 but
is f73b4a6636ccdde4bca83f4891b4e900a39332d3 for http://unicore-dev.zam.kfa-juelich.de/maven/pl/edu/icm/saml/samly2/1.4.0/samly2-1.4.0.jar
Downloaded: http://unicore-dev.zam.kfa-juelich.de/maven/pl/edu/icm/saml/samly2/1.4.0/samly2-1.4.0.jar
(102 KB at 995.4 KB/sec)
Downloaded: http://unicore-dev.zam.kfa-juelich.de/maven/eu/unicore/cis-u6-infoprovider-types/1.6.0-SNAPSHOT/cis-u6-infoprovider-types-1.6.0-20130114.135104-7.jar
(859 KB at 1774.4 KB/sec)
Downloaded: http://unicore-dev.zam.kfa-juelich.de/maven/eu/unicore/services/use-wsrftypes/2.2.0-rc/use-wsrftypes-2.2.0-rc.jar
(1990 KB at 3074.6 KB/sec)
Downloaded: http://unicore-dev.zam.kfa-juelich.de/maven/eu/unicore/uas-types/1.6.0-SNAPSHOT/uas-types-1.6.0-20130114.135055-7.jar
(2279 KB at 3079.2 KB/sec)
[INFO] 
[INFO] --- maven-clean-plugin:2.5:clean (default-clean) @ airavata-gfac-core ---
[INFO] [debug] execute contextualize

[INFO] Using 'UTF-8' encoding to copy filtered resources.
[INFO] --- maven-resources-plugin:2.5:copy-resources (copy-resources) @ airavata-gfac-core
---
[INFO] skip non existing resourceDirectory <https://builds.apache.org/job/Apache%20Airavata/org.apache.airavata$airavata-gfac-core/ws/src/main/assembly/dist>
[INFO] 
[INFO] --- maven-remote-resources-plugin:1.4:process (default) @ airavata-gfac-core ---
Downloading: http://repo1.maven.org/maven2/net/sf/saxon/saxon/9/saxon-9.pom
Downloading: http://community.ucs.indiana.edu:9090/archiva/repository/ogce.m2.all/net/sf/saxon/saxon/9/saxon-9.pom
Downloading: http://cilogon.svn.sourceforge.net/viewvc/cilogon/m2-repo/snapshots/net/sf/saxon/saxon/9/saxon-9.pom
Downloading: http://people.apache.org/repo/m2-snapshot-repository/net/sf/saxon/saxon/9/saxon-9.pom
Downloading: http://unicore-dev.zam.kfa-juelich.de/maven/net/sf/saxon/saxon/9/saxon-9.pom
[WARNING] Missing POM for net.sf.saxon:saxon:jar:9
[INFO] 
[INFO] --- maven-resources-plugin:2.5:resources (default-resources) @ airavata-gfac-core ---[debug]
execute contextualize
[INFO] Using 'UTF-8' encoding to copy filtered resources.
[INFO] Copying 1 resource
[INFO] Copying 3 resources

[INFO] 
[INFO] --- maven-compiler-plugin:2.3.2:compile (default-compile) @ airavata-gfac-core ---
[INFO] Compiling 135 source files to <https://builds.apache.org/job/Apache%20Airavata/org.apache.airavata$airavata-gfac-core/ws/target/classes>
[INFO] -------------------------------------------------------------
[ERROR] COMPILATION ERROR : 
[INFO] -------------------------------------------------------------
[ERROR] error: error reading /export/home/hudson/hudson-slave/maven-repositories/0/net/sf/saxon/saxon/9.1.0.8/saxon-9.1.0.8.jar;
error in opening zip file
[INFO] 1 error
[INFO] -------------------------------------------------------------

Mime
View raw message