airavata-dev mailing list archives

Site index · List index
Message view « Date » · « Thread »
Top « Date » · « Thread »
From Apache Jenkins Server <jenk...@builds.apache.org>
Subject Build failed in Jenkins: Apache Airavata #1046
Date Sat, 09 Feb 2013 01:30:25 GMT
See <https://builds.apache.org/job/Apache%20Airavata/1046/changes>

Changes:

[lahiru] comitting new gfac-config.xml.

[lahiru] fixing integration test.

------------------------------------------
[...truncated 3608 lines...]
Results :

Tests run: 0, Failures: 0, Errors: 0, Skipped: 0

mojoSucceeded org.apache.maven.plugins:maven-surefire-plugin:2.12(default-test)
[JENKINS] Recording test results
mojoStarted org.apache.maven.plugins:maven-jar-plugin:2.4(default-jar)
[INFO] 
[INFO] --- maven-jar-plugin:2.4:jar (default-jar) @ airavata-workflow-tracking ---
[INFO] Building jar: <https://builds.apache.org/job/Apache%20Airavata/ws/modules/commons/workflow-tracking/target/airavata-workflow-tracking-0.7-SNAPSHOT.jar>
mojoSucceeded org.apache.maven.plugins:maven-jar-plugin:2.4(default-jar)
mojoStarted org.apache.maven.plugins:maven-site-plugin:3.2(attach-descriptor)
[INFO] 
[INFO] --- maven-site-plugin:3.2:attach-descriptor (attach-descriptor) @ airavata-workflow-tracking ---
mojoSucceeded org.apache.maven.plugins:maven-site-plugin:3.2(attach-descriptor)
mojoStarted org.apache.maven.plugins:maven-install-plugin:2.3.1(default-install)
[INFO] 
[INFO] Installing <https://builds.apache.org/job/Apache%20Airavata/ws/modules/commons/workflow-tracking/target/airavata-workflow-tracking-0.7-SNAPSHOT.jar> to /export/home/hudson/hudson-slave/maven-repositories/0/org/apache/airavata/airavata-workflow-tracking/0.7-SNAPSHOT/airavata-workflow-tracking-0.7-SNAPSHOT.jar
[INFO] Installing <https://builds.apache.org/job/Apache%20Airavata/ws/modules/commons/workflow-tracking/pom.xml> to /export/home/hudson/hudson-slave/maven-repositories/0/org/apache/airavata/airavata-workflow-tracking/0.7-SNAPSHOT/airavata-workflow-tracking-0.7-SNAPSHOT.pom
[INFO] --- maven-install-plugin:2.3.1:install (default-install) @ airavata-workflow-tracking ---
mojoSucceeded org.apache.maven.plugins:maven-install-plugin:2.3.1(default-install)
projectSucceeded org.apache.airavata:airavata-workflow-tracking:0.7-SNAPSHOT
projectStarted org.apache.airavata:airavata-gfac-core:0.7-SNAPSHOT
[INFO]                                                                         
[INFO] ------------------------------------------------------------------------
[INFO] Building Airavata GFac Core 0.7-SNAPSHOT
[INFO] ------------------------------------------------------------------------[WARNING] The POM for lead-security:puretls:jar:0.9b4-1 is invalid, transitive dependencies (if any) will not be available, enable debug logging for more details
[WARNING] The POM for lead-security:cryptix32:jar:versionless is invalid, transitive dependencies (if any) will not be available, enable debug logging for more details
[WARNING] The POM for lead-security:cryptix-asn1:jar:versionless is invalid, transitive dependencies (if any) will not be available, enable debug logging for more details

Downloading: http://repo1.maven.org/maven2/net/sf/saxon/saxon/9/saxon-9.pom
Downloading: http://community.ucs.indiana.edu:9090/archiva/repository/ogce.m2.all/net/sf/saxon/saxon/9/saxon-9.pom
Downloading: http://cilogon.svn.sourceforge.net/viewvc/cilogon/m2-repo/snapshots/net/sf/saxon/saxon/9/saxon-9.pom
Downloading: http://people.apache.org/repo/m2-snapshot-repository/net/sf/saxon/saxon/9/saxon-9.pom
Downloading: http://unicore-dev.zam.kfa-juelich.de/maven/net/sf/saxon/saxon/9/saxon-9.pom
projectFailed org.apache.airavata:airavata-gfac-core:0.7-SNAPSHOT
sessionEnded
[INFO] ------------------------------------------------------------------------
[INFO] Reactor Summary:
[INFO] 
[INFO] Airavata .......................................... SUCCESS [1:51.576s]
[INFO] Airavata Commons .................................. SUCCESS [7.357s]
[INFO] Airavata GFac Schema Utilities .................... SUCCESS [1:16.235s]
[INFO] Airavata Common Utilities ......................... SUCCESS [24.105s]
[INFO] Airavata Registry ................................. SUCCESS [6.573s]
[INFO] Airavata Registry API ............................. SUCCESS [17.157s]
[INFO] Airavata Workflow Model Parent .................... SUCCESS [7.493s]
[INFO] Airavata Workflow Model Core ...................... SUCCESS [20.160s]
[INFO] Airavata WS Messenger ............................. SUCCESS [7.686s]
[INFO] Airavata Messenger Commons ........................ SUCCESS [15.830s]
[INFO] Airavata Messenger Client ......................... SUCCESS [31.638s]
[INFO] Airavata WS Monitor ............................... SUCCESS [18.050s]
[INFO] Airavata Workflow Execution Context ............... SUCCESS [24.741s]
[INFO] Airavata Client ................................... SUCCESS [21.395s]
[INFO] Airavata Workflow Tracking ........................ SUCCESS [31.902s]
[INFO] Airavata GFac Core ................................ FAILURE [1:35.253s]
[INFO] Airavata Message Box .............................. SKIPPED
[INFO] Airavata Message Broker ........................... SKIPPED
[INFO] Airavata Workflow Component ....................... SKIPPED
[INFO] Airavata Workflow Component Node .................. SKIPPED
[INFO] Airavata JPA Registry ............................. SKIPPED
[INFO] Airavata REST ..................................... SKIPPED
[INFO] airavata-rest-mappings ............................ SKIPPED
[INFO] airavata-rest-client .............................. SKIPPED
[INFO] Airavata XBaya .................................... SKIPPED
[INFO] Airavata Registry Service ......................... SKIPPED
[INFO] Airavata Registry Test ............................ SKIPPED
[INFO] Airavata Security Implementation .................. SKIPPED
[INFO] Airavata Credential Store ......................... SKIPPED
[INFO] airavata-rest-services ............................ SKIPPED
[INFO] airavata-rest-service-webapp ...................... SKIPPED
[INFO] Airavata Tools .................................... SKIPPED
[INFO] Airavata Phoebus Integration ...................... SKIPPED
[INFO] registry-tool ..................................... SKIPPED
[INFO] Simple Math Service ............................... SKIPPED
[INFO] Complex Math Service .............................. SKIPPED
[INFO] Levenshtein Distance Service ...................... SKIPPED
[INFO] Airavata Embedded Tomcat Implementation ........... SKIPPED
[INFO] Airavata Test Suite ............................... SKIPPED
[INFO] distribution ...................................... SKIPPED
[INFO] Samples - Airavata Client Samples ................. SKIPPED
[INFO] Samples - Workflow Create Application ............. SKIPPED
[INFO] Samples - Workflow Execution ...................... SKIPPED
[INFO] Airavata server distribution ...................... SKIPPED
[INFO] Airavata client distribution ...................... SKIPPED
[INFO] Airavata xbaya-gui distribution ................... SKIPPED
[INFO] Airavata release artifacts ........................ SKIPPED
[INFO] Airavata Integration Tests ........................ SKIPPED
[INFO] ------------------------------------------------------------------------
[INFO] BUILD FAILURE
[INFO] ------------------------------------------------------------------------
[INFO] Total time: 9:33.063s
[INFO] Finished at: Sat Feb 09 01:25:39 GMT+00:00 2013
[INFO] Final Memory: 101M/441M
[INFO] ------------------------------------------------------------------------
Projects to build: [MavenProject: org.apache.airavata:airavata:0.7-SNAPSHOT @ <https://builds.apache.org/job/Apache%20Airavata/ws/pom.xml,> MavenProject: org.apache.airavata:commons:0.7-SNAPSHOT @ <https://builds.apache.org/job/Apache%20Airavata/ws/modules/commons/pom.xml,> MavenProject: org.apache.airavata:airavata-gfac-schema-utils:0.7-SNAPSHOT @ <https://builds.apache.org/job/Apache%20Airavata/ws/modules/commons/gfac-schema/pom.xml,> MavenProject: org.apache.airavata:airavata-common-utils:0.7-SNAPSHOT @ <https://builds.apache.org/job/Apache%20Airavata/ws/modules/commons/utils/pom.xml,> MavenProject: org.apache.airavata:registry:0.7-SNAPSHOT @ <https://builds.apache.org/job/Apache%20Airavata/ws/modules/registry/pom.xml,> MavenProject: org.apache.airavata:airavata-registry-api:0.7-SNAPSHOT @ <https://builds.apache.org/job/Apache%20Airavata/ws/modules/registry/registry-api/pom.xml,> MavenProject: org.apache.airavata:airavata-workflow-model-parent:0.7-SNAPSHOT @ <https://builds.apache.org/job/Apache%20Airavata/ws/modules/workflow-model/pom.xml,> MavenProject: org.apache.airavata:airavata-workflow-model-core:0.7-SNAPSHOT @ <https://builds.apache.org/job/Apache%20Airavata/ws/modules/workflow-model/workflow-model-core/pom.xml,> MavenProject: org.apache.airavata:airavata-ws-messenger:0.7-SNAPSHOT @ <https://builds.apache.org/job/Apache%20Airavata/ws/modules/ws-messenger/pom.xml,> MavenProject: org.apache.airavata:airavata-messenger-commons:0.7-SNAPSHOT @ <https://builds.apache.org/job/Apache%20Airavata/ws/modules/ws-messenger/commons/pom.xml,> MavenProject: org.apache.airavata:airavata-messenger-client:0.7-SNAPSHOT @ <https://builds.apache.org/job/Apache%20Airavata/ws/modules/ws-messenger/client/pom.xml,> MavenProject: org.apache.airavata:airavata-message-monitor:0.7-SNAPSHOT @ <https://builds.apache.org/job/Apache%20Airavata/ws/modules/ws-messenger/message-monitor/pom.xml,> MavenProject: org.apache.airavata:airavata-workflow-execution-context:0.7-SNAPSHOT @ <https://builds.apache.org/job/Apache%20Airavata/ws/modules/commons/workflow-execution-context/pom.xml,> MavenProject: org.apache.airavata:airavata-client-api:0.7-SNAPSHOT @ <https://builds.apache.org/job/Apache%20Airavata/ws/modules/airavata-client/pom.xml,> MavenProject: org.apache.airavata:airavata-workflow-tracking:0.7-SNAPSHOT @ <https://builds.apache.org/job/Apache%20Airavata/ws/modules/commons/workflow-tracking/pom.xml,> MavenProject: org.apache.airavata:airavata-gfac-core:0.7-SNAPSHOT @ <https://builds.apache.org/job/Apache%20Airavata/ws/modules/gfac-core/pom.xml,> MavenProject: org.apache.airavata:airavata-message-box:0.7-SNAPSHOT @ <https://builds.apache.org/job/Apache%20Airavata/ws/modules/ws-messenger/messagebox/pom.xml,> MavenProject: org.apache.airavata:airavata-message-broker:0.7-SNAPSHOT @ <https://builds.apache.org/job/Apache%20Airavata/ws/modules/ws-messenger/messagebroker/pom.xml,> MavenProject: org.apache.airavata:airavata-workflow-model-component:0.7-SNAPSHOT @ <https://builds.apache.org/job/Apache%20Airavata/ws/modules/workflow-model/workflow-model-component/pom.xml,> MavenProject: org.apache.airavata:airavata-workflow-model-component-node:0.7-SNAPSHOT @ <https://builds.apache.org/job/Apache%20Airavata/ws/modules/workflow-model/workflow-model-component-node/pom.xml,> MavenProject: org.apache.airavata:airavata-jpa-registry:0.7-SNAPSHOT @ <https://builds.apache.org/job/Apache%20Airavata/ws/modules/registry/airavata-jpa-registry/pom.xml,> MavenProject: org.apache.airavata:rest:0.7-SNAPSHOT @ <https://builds.apache.org/job/Apache%20Airavata/ws/modules/rest/pom.xml,> MavenProject: org.apache.airavata:airavata-rest-mappings:0.7-SNAPSHOT @ <https://builds.apache.org/job/Apache%20Airavata/ws/modules/rest/mappings/pom.xml,> MavenProject: org.apache.airavata:airavata-rest-client:0.7-SNAPSHOT @ <https://builds.apache.org/job/Apache%20Airavata/ws/modules/rest/client/pom.xml,> MavenProject: org.apache.airavata:airavata-xbaya-gui:0.7-SNAPSHOT @ <https://builds.apache.org/job/Apache%20Airavata/ws/modules/xbaya-gui/pom.xml,> MavenProject: org.apache.airavata:airavata-registry-service:0.7-SNAPSHOT @ <https://builds.apache.org/job/Apache%20Airavata/ws/modules/registry/airavata-registry-service/pom.xml,> MavenProject: org.apache.airavata:airavata-registry-test:0.7-SNAPSHOT @ <https://builds.apache.org/job/Apache%20Airavata/ws/modules/registry/airavata-registry-test/pom.xml,> MavenProject: org.apache.airavata:airavata-security:0.7-SNAPSHOT @ <https://builds.apache.org/job/Apache%20Airavata/ws/modules/security/pom.xml,> MavenProject: org.apache.airavata:airavata-credential-store:0.7-SNAPSHOT @ <https://builds.apache.org/job/Apache%20Airavata/ws/modules/credential-store/pom.xml,> MavenProject: org.apache.airavata:airavata-rest-services:0.7-SNAPSHOT @ <https://builds.apache.org/job/Apache%20Airavata/ws/modules/rest/service/pom.xml,> MavenProject: org.apache.airavata:airavata-rest-service-webapp:0.7-SNAPSHOT @ <https://builds.apache.org/job/Apache%20Airavata/ws/modules/rest/webapp/pom.xml,> MavenProject: org.apache.airavata:airavata-tools-parent:0.7-SNAPSHOT @ <https://builds.apache.org/job/Apache%20Airavata/ws/tools/pom.xml,> MavenProject: org.apache.airavata:airavata-phoebus-integration:0.7-SNAPSHOT @ <https://builds.apache.org/job/Apache%20Airavata/ws/tools/phoebus-integration/pom.xml,> MavenProject: org.apache.airavata:registry-tool:0.7-SNAPSHOT @ <https://builds.apache.org/job/Apache%20Airavata/ws/tools/registry-tool/pom.xml,> MavenProject: org.apache.airavata:airavata-simple-math-service:0.7-SNAPSHOT @ <https://builds.apache.org/job/Apache%20Airavata/ws/samples/simple-math-service/pom.xml,> MavenProject: org.apache.airavata:airavata-complex-math-service:0.7-SNAPSHOT @ <https://builds.apache.org/job/Apache%20Airavata/ws/samples/complex-math-service/pom.xml,> MavenProject: org.apache.airavata:airavata-levenshtein-distance-service:0.7-SNAPSHOT @ <https://builds.apache.org/job/Apache%20Airavata/ws/samples/levenshtein-distance-service/pom.xml,> MavenProject: org.apache.airavata:airavata-embedded-tomcat:0.7-SNAPSHOT @ <https://builds.apache.org/job/Apache%20Airavata/ws/modules/server/pom.xml,> MavenProject: org.apache.airavata:test-suite:0.7-SNAPSHOT @ <https://builds.apache.org/job/Apache%20Airavata/ws/modules/test-suite/pom.xml,> MavenProject: org.apache.airavata:distribution:0.7-SNAPSHOT @ <https://builds.apache.org/job/Apache%20Airavata/ws/modules/distribution/pom.xml,> MavenProject: org.apache.airavata:airavata-client-sample:0.7-SNAPSHOT @ <https://builds.apache.org/job/Apache%20Airavata/ws/samples/airavata-client/pom.xml,> MavenProject: org.apache.airavata:samples-create-application:0.7-SNAPSHOT @ <https://builds.apache.org/job/Apache%20Airavata/ws/samples/airavata-client/create-application/pom.xml,> MavenProject: org.apache.airavata:samples-workflow-run:0.7-SNAPSHOT @ <https://builds.apache.org/job/Apache%20Airavata/ws/samples/airavata-client/workflow-run/pom.xml,> MavenProject: org.apache.airavata:apache-airavata-server:0.7-SNAPSHOT @ <https://builds.apache.org/job/Apache%20Airavata/ws/modules/distribution/airavata-server/pom.xml,> MavenProject: org.apache.airavata:apache-airavata-client:0.7-SNAPSHOT @ <https://builds.apache.org/job/Apache%20Airavata/ws/modules/distribution/airavata-client/pom.xml,> MavenProject: org.apache.airavata:apache-airavata-xbaya-gui:0.7-SNAPSHOT @ <https://builds.apache.org/job/Apache%20Airavata/ws/modules/distribution/xbaya-gui/pom.xml,> MavenProject: org.apache.airavata:apache-airavata-release-artifacts:0.7-SNAPSHOT @ <https://builds.apache.org/job/Apache%20Airavata/ws/modules/distribution/release/pom.xml,> MavenProject: org.apache.airavata:integration-tests:0.7-SNAPSHOT @ <https://builds.apache.org/job/Apache%20Airavata/ws/modules/integration-tests/pom.xml]>
[JENKINS] Archiving <https://builds.apache.org/job/Apache%20Airavata/ws/modules/distribution/release/pom.xml> to /home/hudson/hudson/jobs/Apache Airavata/modules/org.apache.airavata$apache-airavata-release-artifacts/builds/2013-02-09_01-13-28/archive/org.apache.airavata/apache-airavata-release-artifacts/0.7-SNAPSHOT/apache-airavata-release-artifacts-0.7-SNAPSHOT.pom
[JENKINS] Archiving <https://builds.apache.org/job/Apache%20Airavata/ws/modules/commons/workflow-tracking/pom.xml> to /home/hudson/hudson/jobs/Apache Airavata/modules/org.apache.airavata$airavata-workflow-tracking/builds/2013-02-09_01-13-20/archive/org.apache.airavata/airavata-workflow-tracking/0.7-SNAPSHOT/airavata-workflow-tracking-0.7-SNAPSHOT.pom
[JENKINS] Archiving <https://builds.apache.org/job/Apache%20Airavata/ws/modules/commons/workflow-tracking/target/airavata-workflow-tracking-0.7-SNAPSHOT.jar> to /home/hudson/hudson/jobs/Apache Airavata/modules/org.apache.airavata$airavata-workflow-tracking/builds/2013-02-09_01-13-20/archive/org.apache.airavata/airavata-workflow-tracking/0.7-SNAPSHOT/airavata-workflow-tracking-0.7-SNAPSHOT.jar
[JENKINS] Archiving <https://builds.apache.org/job/Apache%20Airavata/ws/samples/complex-math-service/pom.xml> to /home/hudson/hudson/jobs/Apache Airavata/modules/org.apache.airavata$airavata-complex-math-service/builds/2013-02-09_01-13-25/archive/org.apache.airavata/airavata-complex-math-service/0.7-SNAPSHOT/airavata-complex-math-service-0.7-SNAPSHOT.pom
[JENKINS] Archiving <https://builds.apache.org/job/Apache%20Airavata/ws/modules/distribution/pom.xml> to /home/hudson/hudson/jobs/Apache Airavata/modules/org.apache.airavata$distribution/builds/2013-02-09_01-13-27/archive/org.apache.airavata/distribution/0.7-SNAPSHOT/distribution-0.7-SNAPSHOT.pom
[JENKINS] Archiving <https://builds.apache.org/job/Apache%20Airavata/ws/modules/workflow-model/workflow-model-component-node/pom.xml> to /home/hudson/hudson/jobs/Apache Airavata/modules/org.apache.airavata$airavata-workflow-model-component-node/builds/2013-02-09_01-13-19/archive/org.apache.airavata/airavata-workflow-model-component-node/0.7-SNAPSHOT/airavata-workflow-model-component-node-0.7-SNAPSHOT.pom
[JENKINS] Archiving <https://builds.apache.org/job/Apache%20Airavata/ws/samples/simple-math-service/pom.xml> to /home/hudson/hudson/jobs/Apache Airavata/modules/org.apache.airavata$airavata-simple-math-service/builds/2013-02-09_01-13-24/archive/org.apache.airavata/airavata-simple-math-service/0.7-SNAPSHOT/airavata-simple-math-service-0.7-SNAPSHOT.pom
[JENKINS] Archiving <https://builds.apache.org/job/Apache%20Airavata/ws/modules/server/pom.xml> to /home/hudson/hudson/jobs/Apache Airavata/modules/org.apache.airavata$airavata-embedded-tomcat/builds/2013-02-09_01-13-25/archive/org.apache.airavata/airavata-embedded-tomcat/0.7-SNAPSHOT/airavata-embedded-tomcat-0.7-SNAPSHOT.pom
[JENKINS] Archiving <https://builds.apache.org/job/Apache%20Airavata/ws/modules/registry/registry-api/pom.xml> to /home/hudson/hudson/jobs/Apache Airavata/modules/org.apache.airavata$airavata-registry-api/builds/2013-02-09_01-13-21/archive/org.apache.airavata/airavata-registry-api/0.7-SNAPSHOT/airavata-registry-api-0.7-SNAPSHOT.pom
[JENKINS] Archiving <https://builds.apache.org/job/Apache%20Airavata/ws/modules/registry/registry-api/target/airavata-registry-api-0.7-SNAPSHOT.jar> to /home/hudson/hudson/jobs/Apache Airavata/modules/org.apache.airavata$airavata-registry-api/builds/2013-02-09_01-13-21/archive/org.apache.airavata/airavata-registry-api/0.7-SNAPSHOT/airavata-registry-api-0.7-SNAPSHOT.jar
[JENKINS] Archiving <https://builds.apache.org/job/Apache%20Airavata/ws/modules/ws-messenger/messagebox/pom.xml> to /home/hudson/hudson/jobs/Apache Airavata/modules/org.apache.airavata$airavata-message-box/builds/2013-02-09_01-13-16/archive/org.apache.airavata/airavata-message-box/0.7-SNAPSHOT/airavata-message-box-0.7-SNAPSHOT.pom
[JENKINS] Archiving <https://builds.apache.org/job/Apache%20Airavata/ws/modules/security/pom.xml> to /home/hudson/hudson/jobs/Apache Airavata/modules/org.apache.airavata$airavata-security/builds/2013-02-09_01-13-22/archive/org.apache.airavata/airavata-security/0.7-SNAPSHOT/airavata-security-0.7-SNAPSHOT.pom
[JENKINS] Archiving <https://builds.apache.org/job/Apache%20Airavata/ws/tools/phoebus-integration/pom.xml> to /home/hudson/hudson/jobs/Apache Airavata/modules/org.apache.airavata$airavata-phoebus-integration/builds/2013-02-09_01-13-24/archive/org.apache.airavata/airavata-phoebus-integration/0.7-SNAPSHOT/airavata-phoebus-integration-0.7-SNAPSHOT.pom
[JENKINS] Archiving <https://builds.apache.org/job/Apache%20Airavata/ws/modules/gfac-core/pom.xml> to /home/hudson/hudson/jobs/Apache Airavata/modules/org.apache.airavata$airavata-gfac-core/builds/2013-02-09_01-13-14/archive/org.apache.airavata/airavata-gfac-core/0.7-SNAPSHOT/airavata-gfac-core-0.7-SNAPSHOT.pom
[JENKINS] Archiving <https://builds.apache.org/job/Apache%20Airavata/ws/modules/distribution/airavata-server/pom.xml> to /home/hudson/hudson/jobs/Apache Airavata/modules/org.apache.airavata$apache-airavata-server/builds/2013-02-09_01-13-27/archive/org.apache.airavata/apache-airavata-server/0.7-SNAPSHOT/apache-airavata-server-0.7-SNAPSHOT.pom
[JENKINS] Archiving <https://builds.apache.org/job/Apache%20Airavata/ws/modules/registry/airavata-registry-test/pom.xml> to /home/hudson/hudson/jobs/Apache Airavata/modules/org.apache.airavata$airavata-registry-test/builds/2013-02-09_01-13-22/archive/org.apache.airavata/airavata-registry-test/0.7-SNAPSHOT/airavata-registry-test-0.7-SNAPSHOT.pom
[JENKINS] Archiving <https://builds.apache.org/job/Apache%20Airavata/ws/modules/workflow-model/workflow-model-component/pom.xml> to /home/hudson/hudson/jobs/Apache Airavata/modules/org.apache.airavata$airavata-workflow-model-component/builds/2013-02-09_01-13-18/archive/org.apache.airavata/airavata-workflow-model-component/0.7-SNAPSHOT/airavata-workflow-model-component-0.7-SNAPSHOT.pom
[JENKINS] Archiving <https://builds.apache.org/job/Apache%20Airavata/ws/modules/xbaya-gui/pom.xml> to /home/hudson/hudson/jobs/Apache Airavata/modules/org.apache.airavata$airavata-xbaya-gui/builds/2013-02-09_01-13-19/archive/org.apache.airavata/airavata-xbaya-gui/0.7-SNAPSHOT/airavata-xbaya-gui-0.7-SNAPSHOT.pom
[JENKINS] Archiving <https://builds.apache.org/job/Apache%20Airavata/ws/modules/commons/workflow-execution-context/pom.xml> to /home/hudson/hudson/jobs/Apache Airavata/modules/org.apache.airavata$airavata-workflow-execution-context/builds/2013-02-09_01-13-21/archive/org.apache.airavata/airavata-workflow-execution-context/0.7-SNAPSHOT/airavata-workflow-execution-context-0.7-SNAPSHOT.pom
[JENKINS] Archiving <https://builds.apache.org/job/Apache%20Airavata/ws/modules/commons/workflow-execution-context/target/airavata-workflow-execution-context-0.7-SNAPSHOT.jar> to /home/hudson/hudson/jobs/Apache Airavata/modules/org.apache.airavata$airavata-workflow-execution-context/builds/2013-02-09_01-13-21/archive/org.apache.airavata/airavata-workflow-execution-context/0.7-SNAPSHOT/airavata-workflow-execution-context-0.7-SNAPSHOT.jar
[JENKINS] Archiving <https://builds.apache.org/job/Apache%20Airavata/ws/modules/integration-tests/pom.xml> to /home/hudson/hudson/jobs/Apache Airavata/modules/org.apache.airavata$integration-tests/builds/2013-02-09_01-13-28/archive/org.apache.airavata/integration-tests/0.7-SNAPSHOT/integration-tests-0.7-SNAPSHOT.pom
[JENKINS] Archiving <https://builds.apache.org/job/Apache%20Airavata/ws/samples/airavata-client/workflow-run/pom.xml> to /home/hudson/hudson/jobs/Apache Airavata/modules/org.apache.airavata$samples-workflow-run/builds/2013-02-09_01-13-27/archive/org.apache.airavata/samples-workflow-run/0.7-SNAPSHOT/samples-workflow-run-0.7-SNAPSHOT.pom
[JENKINS] Archiving <https://builds.apache.org/job/Apache%20Airavata/ws/modules/commons/pom.xml> to /home/hudson/hudson/jobs/Apache Airavata/modules/org.apache.airavata$commons/builds/2013-02-09_01-13-19/archive/org.apache.airavata/commons/0.7-SNAPSHOT/commons-0.7-SNAPSHOT.pom
[JENKINS] Archiving <https://builds.apache.org/job/Apache%20Airavata/ws/modules/ws-messenger/message-monitor/pom.xml> to /home/hudson/hudson/jobs/Apache Airavata/modules/org.apache.airavata$airavata-message-monitor/builds/2013-02-09_01-13-17/archive/org.apache.airavata/airavata-message-monitor/0.7-SNAPSHOT/airavata-message-monitor-0.7-SNAPSHOT.pom
[JENKINS] Archiving <https://builds.apache.org/job/Apache%20Airavata/ws/modules/ws-messenger/message-monitor/target/airavata-message-monitor-0.7-SNAPSHOT.jar> to /home/hudson/hudson/jobs/Apache Airavata/modules/org.apache.airavata$airavata-message-monitor/builds/2013-02-09_01-13-17/archive/org.apache.airavata/airavata-message-monitor/0.7-SNAPSHOT/airavata-message-monitor-0.7-SNAPSHOT.jar
[JENKINS] Archiving <https://builds.apache.org/job/Apache%20Airavata/ws/modules/registry/pom.xml> to /home/hudson/hudson/jobs/Apache Airavata/modules/org.apache.airavata$registry/builds/2013-02-09_01-13-21/archive/org.apache.airavata/registry/0.7-SNAPSHOT/registry-0.7-SNAPSHOT.pom
[JENKINS] Archiving <https://builds.apache.org/job/Apache%20Airavata/ws/tools/registry-tool/pom.xml> to /home/hudson/hudson/jobs/Apache Airavata/modules/org.apache.airavata$registry-tool/builds/2013-02-09_01-13-24/archive/org.apache.airavata/registry-tool/0.7-SNAPSHOT/registry-tool-0.7-SNAPSHOT.pom
[JENKINS] Archiving <https://builds.apache.org/job/Apache%20Airavata/ws/tools/pom.xml> to /home/hudson/hudson/jobs/Apache Airavata/modules/org.apache.airavata$airavata-tools-parent/builds/2013-02-09_01-13-24/archive/org.apache.airavata/airavata-tools-parent/0.7-SNAPSHOT/airavata-tools-parent-0.7-SNAPSHOT.pom
[JENKINS] Archiving <https://builds.apache.org/job/Apache%20Airavata/ws/samples/airavata-client/pom.xml> to /home/hudson/hudson/jobs/Apache Airavata/modules/org.apache.airavata$airavata-client-sample/builds/2013-02-09_01-13-26/archive/org.apache.airavata/airavata-client-sample/0.7-SNAPSHOT/airavata-client-sample-0.7-SNAPSHOT.pom
[JENKINS] Archiving <https://builds.apache.org/job/Apache%20Airavata/ws/modules/ws-messenger/pom.xml> to /home/hudson/hudson/jobs/Apache Airavata/modules/org.apache.airavata$airavata-ws-messenger/builds/2013-02-09_01-13-15/archive/org.apache.airavata/airavata-ws-messenger/0.7-SNAPSHOT/airavata-ws-messenger-0.7-SNAPSHOT.pom
[JENKINS] Archiving <https://builds.apache.org/job/Apache%20Airavata/ws/modules/rest/service/pom.xml> to /home/hudson/hudson/jobs/Apache Airavata/modules/org.apache.airavata$airavata-rest-services/builds/2013-02-09_01-13-23/archive/org.apache.airavata/airavata-rest-services/0.7-SNAPSHOT/airavata-rest-services-0.7-SNAPSHOT.pom
[JENKINS] Archiving <https://builds.apache.org/job/Apache%20Airavata/ws/modules/rest/webapp/pom.xml> to /home/hudson/hudson/jobs/Apache Airavata/modules/org.apache.airavata$airavata-rest-service-webapp/builds/2013-02-09_01-13-23/archive/org.apache.airavata/airavata-rest-service-webapp/0.7-SNAPSHOT/airavata-rest-service-webapp-0.7-SNAPSHOT.pom
[JENKINS] Archiving <https://builds.apache.org/job/Apache%20Airavata/ws/samples/airavata-client/create-application/pom.xml> to /home/hudson/hudson/jobs/Apache Airavata/modules/org.apache.airavata$samples-create-application/builds/2013-02-09_01-13-26/archive/org.apache.airavata/samples-create-application/0.7-SNAPSHOT/samples-create-application-0.7-SNAPSHOT.pom
[JENKINS] Archiving <https://builds.apache.org/job/Apache%20Airavata/ws/modules/distribution/airavata-client/pom.xml> to /home/hudson/hudson/jobs/Apache Airavata/modules/org.apache.airavata$apache-airavata-client/builds/2013-02-09_01-13-27/archive/org.apache.airavata/apache-airavata-client/0.7-SNAPSHOT/apache-airavata-client-0.7-SNAPSHOT.pom
[JENKINS] Archiving <https://builds.apache.org/job/Apache%20Airavata/ws/modules/registry/airavata-jpa-registry/pom.xml> to /home/hudson/hudson/jobs/Apache Airavata/modules/org.apache.airavata$airavata-jpa-registry/builds/2013-02-09_01-13-21/archive/org.apache.airavata/airavata-jpa-registry/0.7-SNAPSHOT/airavata-jpa-registry-0.7-SNAPSHOT.pom
[JENKINS] Archiving <https://builds.apache.org/job/Apache%20Airavata/ws/modules/commons/utils/pom.xml> to /home/hudson/hudson/jobs/Apache Airavata/modules/org.apache.airavata$airavata-common-utils/builds/2013-02-09_01-13-20/archive/org.apache.airavata/airavata-common-utils/0.7-SNAPSHOT/airavata-common-utils-0.7-SNAPSHOT.pom
[JENKINS] Archiving <https://builds.apache.org/job/Apache%20Airavata/ws/modules/commons/utils/target/airavata-common-utils-0.7-SNAPSHOT.jar> to /home/hudson/hudson/jobs/Apache Airavata/modules/org.apache.airavata$airavata-common-utils/builds/2013-02-09_01-13-20/archive/org.apache.airavata/airavata-common-utils/0.7-SNAPSHOT/airavata-common-utils-0.7-SNAPSHOT.jar
[JENKINS] Archiving <https://builds.apache.org/job/Apache%20Airavata/ws/samples/levenshtein-distance-service/pom.xml> to /home/hudson/hudson/jobs/Apache Airavata/modules/org.apache.airavata$airavata-levenshtein-distance-service/builds/2013-02-09_01-13-25/archive/org.apache.airavata/airavata-levenshtein-distance-service/0.7-SNAPSHOT/airavata-levenshtein-distance-service-0.7-SNAPSHOT.pom
[JENKINS] Archiving <https://builds.apache.org/job/Apache%20Airavata/ws/modules/rest/pom.xml> to /home/hudson/hudson/jobs/Apache Airavata/modules/org.apache.airavata$rest/builds/2013-02-09_01-13-23/archive/org.apache.airavata/rest/0.7-SNAPSHOT/rest-0.7-SNAPSHOT.pom
[JENKINS] Archiving <https://builds.apache.org/job/Apache%20Airavata/ws/modules/distribution/xbaya-gui/pom.xml> to /home/hudson/hudson/jobs/Apache Airavata/modules/org.apache.airavata$apache-airavata-xbaya-gui/builds/2013-02-09_01-13-28/archive/org.apache.airavata/apache-airavata-xbaya-gui/0.7-SNAPSHOT/apache-airavata-xbaya-gui-0.7-SNAPSHOT.pom
[JENKINS] Archiving <https://builds.apache.org/job/Apache%20Airavata/ws/modules/airavata-client/pom.xml> to /home/hudson/hudson/jobs/Apache Airavata/modules/org.apache.airavata$airavata-client-api/builds/2013-02-09_01-13-22/archive/org.apache.airavata/airavata-client-api/0.7-SNAPSHOT/airavata-client-api-0.7-SNAPSHOT.pom
[JENKINS] Archiving <https://builds.apache.org/job/Apache%20Airavata/ws/modules/airavata-client/target/airavata-client-api-0.7-SNAPSHOT.jar> to /home/hudson/hudson/jobs/Apache Airavata/modules/org.apache.airavata$airavata-client-api/builds/2013-02-09_01-13-22/archive/org.apache.airavata/airavata-client-api/0.7-SNAPSHOT/airavata-client-api-0.7-SNAPSHOT.jar
[JENKINS] Archiving <https://builds.apache.org/job/Apache%20Airavata/ws/modules/ws-messenger/messagebroker/pom.xml> to /home/hudson/hudson/jobs/Apache Airavata/modules/org.apache.airavata$airavata-message-broker/builds/2013-02-09_01-13-16/archive/org.apache.airavata/airavata-message-broker/0.7-SNAPSHOT/airavata-message-broker-0.7-SNAPSHOT.pom
[JENKINS] Archiving <https://builds.apache.org/job/Apache%20Airavata/ws/modules/commons/gfac-schema/pom.xml> to /home/hudson/hudson/jobs/Apache Airavata/modules/org.apache.airavata$airavata-gfac-schema-utils/builds/2013-02-09_01-13-20/archive/org.apache.airavata/airavata-gfac-schema-utils/0.7-SNAPSHOT/airavata-gfac-schema-utils-0.7-SNAPSHOT.pom
[JENKINS] Archiving <https://builds.apache.org/job/Apache%20Airavata/ws/modules/commons/gfac-schema/target/airavata-gfac-schema-utils-0.7-SNAPSHOT.jar> to /home/hudson/hudson/jobs/Apache Airavata/modules/org.apache.airavata$airavata-gfac-schema-utils/builds/2013-02-09_01-13-20/archive/org.apache.airavata/airavata-gfac-schema-utils/0.7-SNAPSHOT/airavata-gfac-schema-utils-0.7-SNAPSHOT.jar
[JENKINS] Archiving <https://builds.apache.org/job/Apache%20Airavata/ws/modules/rest/mappings/pom.xml> to /home/hudson/hudson/jobs/Apache Airavata/modules/org.apache.airavata$airavata-rest-mappings/builds/2013-02-09_01-13-23/archive/org.apache.airavata/airavata-rest-mappings/0.7-SNAPSHOT/airavata-rest-mappings-0.7-SNAPSHOT.pom
[JENKINS] Archiving <https://builds.apache.org/job/Apache%20Airavata/ws/modules/workflow-model/pom.xml> to /home/hudson/hudson/jobs/Apache Airavata/modules/org.apache.airavata$airavata-workflow-model-parent/builds/2013-02-09_01-13-17/archive/org.apache.airavata/airavata-workflow-model-parent/0.7-SNAPSHOT/airavata-workflow-model-parent-0.7-SNAPSHOT.pom
[JENKINS] Archiving <https://builds.apache.org/job/Apache%20Airavata/ws/modules/registry/airavata-registry-service/pom.xml> to /home/hudson/hudson/jobs/Apache Airavata/modules/org.apache.airavata$airavata-registry-service/builds/2013-02-09_01-13-22/archive/org.apache.airavata/airavata-registry-service/0.7-SNAPSHOT/airavata-registry-service-0.7-SNAPSHOT.pom
[JENKINS] Archiving <https://builds.apache.org/job/Apache%20Airavata/ws/modules/rest/client/pom.xml> to /home/hudson/hudson/jobs/Apache Airavata/modules/org.apache.airavata$airavata-rest-client/builds/2013-02-09_01-13-24/archive/org.apache.airavata/airavata-rest-client/0.7-SNAPSHOT/airavata-rest-client-0.7-SNAPSHOT.pom
[JENKINS] Archiving <https://builds.apache.org/job/Apache%20Airavata/ws/modules/credential-store/pom.xml> to /home/hudson/hudson/jobs/Apache Airavata/modules/org.apache.airavata$airavata-credential-store/builds/2013-02-09_01-13-23/archive/org.apache.airavata/airavata-credential-store/0.7-SNAPSHOT/airavata-credential-store-0.7-SNAPSHOT.pom
[JENKINS] Archiving <https://builds.apache.org/job/Apache%20Airavata/ws/modules/ws-messenger/client/pom.xml> to /home/hudson/hudson/jobs/Apache Airavata/modules/org.apache.airavata$airavata-messenger-client/builds/2013-02-09_01-13-16/archive/org.apache.airavata/airavata-messenger-client/0.7-SNAPSHOT/airavata-messenger-client-0.7-SNAPSHOT.pom
[JENKINS] Archiving <https://builds.apache.org/job/Apache%20Airavata/ws/modules/ws-messenger/client/target/airavata-messenger-client-0.7-SNAPSHOT.jar> to /home/hudson/hudson/jobs/Apache Airavata/modules/org.apache.airavata$airavata-messenger-client/builds/2013-02-09_01-13-16/archive/org.apache.airavata/airavata-messenger-client/0.7-SNAPSHOT/airavata-messenger-client-0.7-SNAPSHOT.jar
[JENKINS] Archiving <https://builds.apache.org/job/Apache%20Airavata/ws/modules/ws-messenger/commons/pom.xml> to /home/hudson/hudson/jobs/Apache Airavata/modules/org.apache.airavata$airavata-messenger-commons/builds/2013-02-09_01-13-15/archive/org.apache.airavata/airavata-messenger-commons/0.7-SNAPSHOT/airavata-messenger-commons-0.7-SNAPSHOT.pom
[JENKINS] Archiving <https://builds.apache.org/job/Apache%20Airavata/ws/modules/ws-messenger/commons/target/airavata-messenger-commons-0.7-SNAPSHOT.jar> to /home/hudson/hudson/jobs/Apache Airavata/modules/org.apache.airavata$airavata-messenger-commons/builds/2013-02-09_01-13-15/archive/org.apache.airavata/airavata-messenger-commons/0.7-SNAPSHOT/airavata-messenger-commons-0.7-SNAPSHOT.jar
[JENKINS] Archiving <https://builds.apache.org/job/Apache%20Airavata/ws/modules/workflow-model/workflow-model-core/pom.xml> to /home/hudson/hudson/jobs/Apache Airavata/modules/org.apache.airavata$airavata-workflow-model-core/builds/2013-02-09_01-13-18/archive/org.apache.airavata/airavata-workflow-model-core/0.7-SNAPSHOT/airavata-workflow-model-core-0.7-SNAPSHOT.pom
[JENKINS] Archiving <https://builds.apache.org/job/Apache%20Airavata/ws/modules/workflow-model/workflow-model-core/target/airavata-workflow-model-core-0.7-SNAPSHOT.jar> to /home/hudson/hudson/jobs/Apache Airavata/modules/org.apache.airavata$airavata-workflow-model-core/builds/2013-02-09_01-13-18/archive/org.apache.airavata/airavata-workflow-model-core/0.7-SNAPSHOT/airavata-workflow-model-core-0.7-SNAPSHOT.jar
[JENKINS] Archiving <https://builds.apache.org/job/Apache%20Airavata/ws/modules/test-suite/pom.xml> to /home/hudson/hudson/jobs/Apache Airavata/modules/org.apache.airavata$test-suite/builds/2013-02-09_01-13-26/archive/org.apache.airavata/test-suite/0.7-SNAPSHOT/test-suite-0.7-SNAPSHOT.pom
[JENKINS] Archiving <https://builds.apache.org/job/Apache%20Airavata/ws/pom.xml> to /home/hudson/hudson/jobs/Apache Airavata/modules/org.apache.airavata$airavata/builds/2013-02-09_01-13-14/archive/org.apache.airavata/airavata/0.7-SNAPSHOT/airavata-0.7-SNAPSHOT.pom
mavenExecutionResult exceptions not empty
message : Failed to execute goal on project airavata-gfac-core: Could not resolve dependencies for project org.apache.airavata:airavata-gfac-core:jar:0.7-SNAPSHOT: Failed to collect dependencies for [cog-jglobus:cog-jglobus:jar:1.8.0_1 (compile), lead-security:puretls:jar:0.9b4-1 (compile), lead-security:cryptix32:jar:versionless (compile), lead-security:cryptix-asn1:jar:versionless (compile), org.bouncycastle:bcprov-jdk15:jar:1.45 (compile), commons-configuration:commons-configuration:jar:1.6 (compile), org.slf4j:slf4j-api:jar:1.7.2 (compile), org.apache.airavata:airavata-client-api:jar:0.7-SNAPSHOT (compile), org.apache.airavata:airavata-workflow-execution-context:jar:0.7-SNAPSHOT (compile), org.apache.airavata:airavata-workflow-tracking:jar:0.7-SNAPSHOT (compile), net.schmizz:sshj:jar:0.5.0 (compile), com.amazonaws:aws-java-sdk:jar:1.3.20 (compile), junit:junit:jar:4.7 (test), org.slf4j:jcl-over-slf4j:jar:1.7.2 (test), org.slf4j:slf4j-log4j12:jar:1.7.2 (test), j2ssh:j2ssh-core:jar:0.2.9 (compile), j2ssh:j2ssh-common:jar:0.2.9 (compile), eu.unicore:ogsabes-client:jar:1.5.1-rc3 (compile), eu.unicore:ogsabes-types:jar:1.5.1-rc3 (compile), eu.unicore:uas-client:jar:1.5.1-rc3 (compile), de.fzj.unicore:jsdl-xmlbeans:jar:2.1.0 (compile), eu.unicore:cis-u6-infoprovider-types:jar:1.5.1-rc3 (compile), eu.unicore:uas-types:jar:1.5.1-rc3 (compile), eu.unicore.services:use-wsrfclient:jar:2.1.1 (compile), commons-io:commons-io:jar:2.0.1 (compile), eu.unicore:uftp:jar:1.2.1 (compile), com.google.guava:guava:jar:12.0 (compile)]
cause : Could not resolve dependencies for project org.apache.airavata:airavata-gfac-core:jar:0.7-SNAPSHOT: Failed to collect dependencies for [cog-jglobus:cog-jglobus:jar:1.8.0_1 (compile), lead-security:puretls:jar:0.9b4-1 (compile), lead-security:cryptix32:jar:versionless (compile), lead-security:cryptix-asn1:jar:versionless (compile), org.bouncycastle:bcprov-jdk15:jar:1.45 (compile), commons-configuration:commons-configuration:jar:1.6 (compile), org.slf4j:slf4j-api:jar:1.7.2 (compile), org.apache.airavata:airavata-client-api:jar:0.7-SNAPSHOT (compile), org.apache.airavata:airavata-workflow-execution-context:jar:0.7-SNAPSHOT (compile), org.apache.airavata:airavata-workflow-tracking:jar:0.7-SNAPSHOT (compile), net.schmizz:sshj:jar:0.5.0 (compile), com.amazonaws:aws-java-sdk:jar:1.3.20 (compile), junit:junit:jar:4.7 (test), org.slf4j:jcl-over-slf4j:jar:1.7.2 (test), org.slf4j:slf4j-log4j12:jar:1.7.2 (test), j2ssh:j2ssh-core:jar:0.2.9 (compile), j2ssh:j2ssh-common:jar:0.2.9 (compile), eu.unicore:ogsabes-client:jar:1.5.1-rc3 (compile), eu.unicore:ogsabes-types:jar:1.5.1-rc3 (compile), eu.unicore:uas-client:jar:1.5.1-rc3 (compile), de.fzj.unicore:jsdl-xmlbeans:jar:2.1.0 (compile), eu.unicore:cis-u6-infoprovider-types:jar:1.5.1-rc3 (compile), eu.unicore:uas-types:jar:1.5.1-rc3 (compile), eu.unicore.services:use-wsrfclient:jar:2.1.1 (compile), commons-io:commons-io:jar:2.0.1 (compile), eu.unicore:uftp:jar:1.2.1 (compile), com.google.guava:guava:jar:12.0 (compile)]
Stack trace : 
org.apache.maven.lifecycle.LifecycleExecutionException: Failed to execute goal on project airavata-gfac-core: Could not resolve dependencies for project org.apache.airavata:airavata-gfac-core:jar:0.7-SNAPSHOT: Failed to collect dependencies for [cog-jglobus:cog-jglobus:jar:1.8.0_1 (compile), lead-security:puretls:jar:0.9b4-1 (compile), lead-security:cryptix32:jar:versionless (compile), lead-security:cryptix-asn1:jar:versionless (compile), org.bouncycastle:bcprov-jdk15:jar:1.45 (compile), commons-configuration:commons-configuration:jar:1.6 (compile), org.slf4j:slf4j-api:jar:1.7.2 (compile), org.apache.airavata:airavata-client-api:jar:0.7-SNAPSHOT (compile), org.apache.airavata:airavata-workflow-execution-context:jar:0.7-SNAPSHOT (compile), org.apache.airavata:airavata-workflow-tracking:jar:0.7-SNAPSHOT (compile), net.schmizz:sshj:jar:0.5.0 (compile), com.amazonaws:aws-java-sdk:jar:1.3.20 (compile), junit:junit:jar:4.7 (test), org.slf4j:jcl-over-slf4j:jar:1.7.2 (test), org.slf4j:slf4j-log4j12:jar:1.7.2 (test), j2ssh:j2ssh-core:jar:0.2.9 (compile), j2ssh:j2ssh-common:jar:0.2.9 (compile), eu.unicore:ogsabes-client:jar:1.5.1-rc3 (compile), eu.unicore:ogsabes-types:jar:1.5.1-rc3 (compile), eu.unicore:uas-client:jar:1.5.1-rc3 (compile), de.fzj.unicore:jsdl-xmlbeans:jar:2.1.0 (compile), eu.unicore:cis-u6-infoprovider-types:jar:1.5.1-rc3 (compile), eu.unicore:uas-types:jar:1.5.1-rc3 (compile), eu.unicore.services:use-wsrfclient:jar:2.1.1 (compile), commons-io:commons-io:jar:2.0.1 (compile), eu.unicore:uftp:jar:1.2.1 (compile), com.google.guava:guava:jar:12.0 (compile)]
	at org.apache.maven.lifecycle.internal.LifecycleDependencyResolver.getDependencies(LifecycleDependencyResolver.java:196)
	at org.apache.maven.lifecycle.internal.LifecycleDependencyResolver.resolveProjectDependencies(LifecycleDependencyResolver.java:108)
	at org.apache.maven.lifecycle.internal.MojoExecutor.ensureDependenciesAreResolved(MojoExecutor.java:258)
	at org.apache.maven.lifecycle.internal.MojoExecutor.execute(MojoExecutor.java:201)
	at org.apache.maven.lifecycle.internal.MojoExecutor.execute(MojoExecutor.java:153)
	at org.apache.maven.lifecycle.internal.MojoExecutor.execute(MojoExecutor.java:145)
	at org.apache.maven.lifecycle.internal.LifecycleModuleBuilder.buildProject(LifecycleModuleBuilder.java:84)
	at org.apache.maven.lifecycle.internal.LifecycleModuleBuilder.buildProject(LifecycleModuleBuilder.java:59)
	at org.apache.maven.lifecycle.internal.LifecycleStarter.singleThreadedBuild(LifecycleStarter.java:183)
	at org.apache.maven.lifecycle.internal.LifecycleStarter.execute(LifecycleStarter.java:161)
	at org.apache.maven.DefaultMaven.doExecute(DefaultMaven.java:319)
	at org.apache.maven.DefaultMaven.execute(DefaultMaven.java:156)
	at org.jvnet.hudson.maven3.launcher.Maven3Launcher.main(Maven3Launcher.java:79)
	at sun.reflect.NativeMethodAccessorImpl.invoke0(Native Method)
	at sun.reflect.NativeMethodAccessorImpl.invoke(NativeMethodAccessorImpl.java:39)
	at sun.reflect.DelegatingMethodAccessorImpl.invoke(DelegatingMethodAccessorImpl.java:25)
	at java.lang.reflect.Method.invoke(Method.java:597)
	at org.codehaus.plexus.classworlds.launcher.Launcher.launchStandard(Launcher.java:329)
	at org.codehaus.plexus.classworlds.launcher.Launcher.launch(Launcher.java:239)
	at org.jvnet.hudson.maven3.agent.Maven3Main.launch(Maven3Main.java:158)
	at hudson.maven.Maven3Builder.call(Maven3Builder.java:100)
	at hudson.maven.Maven3Builder.call(Maven3Builder.java:66)
	at hudson.remoting.UserRequest.perform(UserRequest.java:118)
	at hudson.remoting.UserRequest.perform(UserRequest.java:48)
	at hudson.remoting.Request$2.run(Request.java:326)
	at hudson.remoting.InterceptingExecutorService$1.call(InterceptingExecutorService.java:72)
	at java.util.concurrent.FutureTask$Sync.innerRun(FutureTask.java:303)
	at java.util.concurrent.FutureTask.run(FutureTask.java:138)
	at java.util.concurrent.ThreadPoolExecutor$Worker.runTask(ThreadPoolExecutor.java:886)
	at java.util.concurrent.ThreadPoolExecutor$Worker.run(ThreadPoolExecutor.java:908)
	at java.lang.Thread.run(Thread.java:662)
Caused by: org.apache.maven.project.DependencyResolutionException: Could not resolve dependencies for project org.apache.airavata:airavata-gfac-core:jar:0.7-SNAPSHOT: Failed to collect dependencies for [cog-jglobus:cog-jglobus:jar:1.8.0_1 (compile), lead-security:puretls:jar:0.9b4-1 (compile), lead-security:cryptix32:jar:versionless (compile), lead-security:cryptix-asn1:jar:versionless (compile), org.bouncycastle:bcprov-jdk15:jar:1.45 (compile), commons-configuration:commons-configuration:jar:1.6 (compile), org.slf4j:slf4j-api:jar:1.7.2 (compile), org.apache.airavata:airavata-client-api:jar:0.7-SNAPSHOT (compile), org.apache.airavata:airavata-workflow-execution-context:jar:0.7-SNAPSHOT (compile), org.apache.airavata:airavata-workflow-tracking:jar:0.7-SNAPSHOT (compile), net.schmizz:sshj:jar:0.5.0 (compile), com.amazonaws:aws-java-sdk:jar:1.3.20 (compile), junit:junit:jar:4.7 (test), org.slf4j:jcl-over-slf4j:jar:1.7.2 (test), org.slf4j:slf4j-log4j12:jar:1.7.2 (test), j2ssh:j2ssh-core:jar:0.2.9 (compile), j2ssh:j2ssh-common:jar:0.2.9 (compile), eu.unicore:ogsabes-client:jar:1.5.1-rc3 (compile), eu.unicore:ogsabes-types:jar:1.5.1-rc3 (compile), eu.unicore:uas-client:jar:1.5.1-rc3 (compile), de.fzj.unicore:jsdl-xmlbeans:jar:2.1.0 (compile), eu.unicore:cis-u6-infoprovider-types:jar:1.5.1-rc3 (compile), eu.unicore:uas-types:jar:1.5.1-rc3 (compile), eu.unicore.services:use-wsrfclient:jar:2.1.1 (compile), commons-io:commons-io:jar:2.0.1 (compile), eu.unicore:uftp:jar:1.2.1 (compile), com.google.guava:guava:jar:12.0 (compile)]
	at org.apache.maven.project.DefaultProjectDependenciesResolver.resolve(DefaultProjectDependenciesResolver.java:139)
	at org.apache.maven.lifecycle.internal.LifecycleDependencyResolver.getDependencies(LifecycleDependencyResolver.java:171)
	... 30 more
Caused by: org.sonatype.aether.collection.DependencyCollectionException: Failed to collect dependencies for [cog-jglobus:cog-jglobus:jar:1.8.0_1 (compile), lead-security:puretls:jar:0.9b4-1 (compile), lead-security:cryptix32:jar:versionless (compile), lead-security:cryptix-asn1:jar:versionless (compile), org.bouncycastle:bcprov-jdk15:jar:1.45 (compile), commons-configuration:commons-configuration:jar:1.6 (compile), org.slf4j:slf4j-api:jar:1.7.2 (compile), org.apache.airavata:airavata-client-api:jar:0.7-SNAPSHOT (compile), org.apache.airavata:airavata-workflow-execution-context:jar:0.7-SNAPSHOT (compile), org.apache.airavata:airavata-workflow-tracking:jar:0.7-SNAPSHOT (compile), net.schmizz:sshj:jar:0.5.0 (compile), com.amazonaws:aws-java-sdk:jar:1.3.20 (compile), junit:junit:jar:4.7 (test), org.slf4j:jcl-over-slf4j:jar:1.7.2 (test), org.slf4j:slf4j-log4j12:jar:1.7.2 (test), j2ssh:j2ssh-core:jar:0.2.9 (compile), j2ssh:j2ssh-common:jar:0.2.9 (compile), eu.unicore:ogsabes-client:jar:1.5.1-rc3 (compile), eu.unicore:ogsabes-types:jar:1.5.1-rc3 (compile), eu.unicore:uas-client:jar:1.5.1-rc3 (compile), de.fzj.unicore:jsdl-xmlbeans:jar:2.1.0 (compile), eu.unicore:cis-u6-infoprovider-types:jar:1.5.1-rc3 (compile), eu.unicore:uas-types:jar:1.5.1-rc3 (compile), eu.unicore.services:use-wsrfclient:jar:2.1.1 (compile), commons-io:commons-io:jar:2.0.1 (compile), eu.unicore:uftp:jar:1.2.1 (compile), com.google.guava:guava:jar:12.0 (compile)]
	at org.sonatype.aether.impl.internal.DefaultDependencyCollector.collectDependencies(DefaultDependencyCollector.java:262)
	at org.sonatype.aether.impl.internal.DefaultRepositorySystem.collectDependencies(DefaultRepositorySystem.java:345)
	at org.apache.maven.project.DefaultProjectDependenciesResolver.resolve(DefaultProjectDependenciesResolver.java:131)
	... 31 more
Caused by: org.sonatype.aether.resolution.ArtifactDescriptorException: Failed to read artifact descriptor for net.sf.saxon:saxon:jar:9
	at org.apache.maven.repository.internal.DefaultArtifactDescriptorReader.loadPom(DefaultArtifactDescriptorReader.java:282)
	at org.apache.maven.repository.internal.DefaultArtifactDescriptorReader.readArtifactDescriptor(DefaultArtifactDescriptorReader.java:172)
	at org.sonatype.aether.impl.internal.DefaultDependencyCollector.process(DefaultDependencyCollector.java:419)
	at org.sonatype.aether.impl.internal.DefaultDependencyCollector.process(DefaultDependencyCollector.java:533)
	at org.sonatype.aether.impl.internal.DefaultDependencyCollector.process(DefaultDependencyCollector.java:533)
	at org.sonatype.aether.impl.internal.DefaultDependencyCollector.process(DefaultDependencyCollector.java:533)
	at org.sonatype.aether.impl.internal.DefaultDependencyCollector.process(DefaultDependencyCollector.java:533)
	at org.sonatype.aether.impl.internal.DefaultDependencyCollector.collectDependencies(DefaultDependencyCollector.java:243)
	... 33 more
Caused by: org.sonatype.aether.resolution.ArtifactResolutionException: Could not transfer artifact net.sf.saxon:saxon:pom:9 from/to oa4mp.repo (http://cilogon.svn.sourceforge.net/viewvc/cilogon/m2-repo/snapshots): Error transferring file: Server returned HTTP response code: 504 for URL: http://cilogon.svn.sourceforge.net/viewvc/cilogon/m2-repo/snapshots/net/sf/saxon/saxon/9/saxon-9.pom
	at org.sonatype.aether.impl.internal.DefaultArtifactResolver.resolve(DefaultArtifactResolver.java:541)
	at org.sonatype.aether.impl.internal.DefaultArtifactResolver.resolveArtifacts(DefaultArtifactResolver.java:220)
	at org.sonatype.aether.impl.internal.DefaultArtifactResolver.resolveArtifact(DefaultArtifactResolver.java:197)
	at org.apache.maven.repository.internal.DefaultArtifactDescriptorReader.loadPom(DefaultArtifactDescriptorReader.java:267)
	... 40 more
Caused by: org.sonatype.aether.transfer.ArtifactTransferException: Could not transfer artifact net.sf.saxon:saxon:pom:9 from/to oa4mp.repo (http://cilogon.svn.sourceforge.net/viewvc/cilogon/m2-repo/snapshots): Error transferring file: Server returned HTTP response code: 504 for URL: http://cilogon.svn.sourceforge.net/viewvc/cilogon/m2-repo/snapshots/net/sf/saxon/saxon/9/saxon-9.pom
	at org.sonatype.aether.connector.wagon.WagonRepositoryConnector$4.wrap(WagonRepositoryConnector.java:949)
	at org.sonatype.aether.connector.wagon.WagonRepositoryConnector$4.wrap(WagonRepositoryConnector.java:940)
	at org.sonatype.aether.connector.wagon.WagonRepositoryConnector$GetTask.flush(WagonRepositoryConnector.java:695)
	at org.sonatype.aether.connector.wagon.WagonRepositoryConnector$GetTask.flush(WagonRepositoryConnector.java:689)
	at org.sonatype.aether.connector.wagon.WagonRepositoryConnector.get(WagonRepositoryConnector.java:445)
	at org.sonatype.aether.impl.internal.DefaultArtifactResolver.resolve(DefaultArtifactResolver.java:460)
	... 43 more
Caused by: org.apache.maven.wagon.TransferFailedException: Error transferring file: Server returned HTTP response code: 504 for URL: http://cilogon.svn.sourceforge.net/viewvc/cilogon/m2-repo/snapshots/net/sf/saxon/saxon/9/saxon-9.pom
	at org.apache.maven.wagon.providers.http.LightweightHttpWagon.fillInputData(LightweightHttpWagon.java:143)
	at org.apache.maven.wagon.StreamWagon.getInputStream(StreamWagon.java:116)
	at org.apache.maven.wagon.StreamWagon.getIfNewer(StreamWagon.java:88)
	at org.apache.maven.wagon.StreamWagon.get(StreamWagon.java:61)
	at org.sonatype.aether.connector.wagon.WagonRepositoryConnector$GetTask.run(WagonRepositoryConnector.java:608)
	at org.sonatype.aether.util.concurrency.RunnableErrorForwarder$1.run(RunnableErrorForwarder.java:64)
	... 3 more
Caused by: java.io.IOException: Server returned HTTP response code: 504 for URL: http://cilogon.svn.sourceforge.net/viewvc/cilogon/m2-repo/snapshots/net/sf/saxon/saxon/9/saxon-9.pom
	at sun.reflect.NativeConstructorAccessorImpl.newInstance0(Native Method)
	at sun.reflect.NativeConstructorAccessorImpl.newInstance(NativeConstructorAccessorImpl.java:39)
	at sun.reflect.DelegatingConstructorAccessorImpl.newInstance(DelegatingConstructorAccessorImpl.java:27)
	at java.lang.reflect.Constructor.newInstance(Constructor.java:513)
	at sun.net.www.protocol.http.HttpURLConnection$6.run(HttpURLConnection.java:1491)
	at java.security.AccessController.doPrivileged(Native Method)
	at sun.net.www.protocol.http.HttpURLConnection.getChainedException(HttpURLConnection.java:1485)
	at sun.net.www.protocol.http.HttpURLConnection.getInputStream(HttpURLConnection.java:1139)
	at org.apache.maven.wagon.providers.http.LightweightHttpWagon.fillInputData(LightweightHttpWagon.java:122)
	... 8 more
Caused by: java.io.IOException: Server returned HTTP response code: 504 for URL: http://cilogon.svn.sourceforge.net/viewvc/cilogon/m2-repo/snapshots/net/sf/saxon/saxon/9/saxon-9.pom
	at sun.net.www.protocol.http.HttpURLConnection.getInputStream(HttpURLConnection.java:1436)
	at java.net.HttpURLConnection.getResponseCode(HttpURLConnection.java:379)
	at org.apache.maven.wagon.providers.http.LightweightHttpWagon.fillInputData(LightweightHttpWagon.java:115)
	... 8 more
Sending e-mails to: dev@airavata.apache.org
channel stopped

Mime
View raw message