airavata-dev mailing list archives

Site index · List index
Message view « Date » · « Thread »
Top « Date » · « Thread »
From Apache Jenkins Server <jenk...@builds.apache.org>
Subject Build failed in Jenkins: Apache Airavata #1045
Date Fri, 08 Feb 2013 20:19:20 GMT
See <https://builds.apache.org/job/Apache%20Airavata/1045/changes>

Changes:

[samindaw] removing GFacService, updating API & removing gfac service

------------------------------------------
[...truncated 3620 lines...]
[INFO] --- maven-site-plugin:3.2:attach-descriptor (attach-descriptor) @ airavata-workflow-tracking
---
mojoSucceeded org.apache.maven.plugins:maven-site-plugin:3.2(attach-descriptor)
mojoStarted org.apache.maven.plugins:maven-install-plugin:2.3.1(default-install)
[INFO] 
[INFO] Installing <https://builds.apache.org/job/Apache%20Airavata/ws/modules/commons/workflow-tracking/target/airavata-workflow-tracking-0.7-SNAPSHOT.jar>
to /export/home/hudson/hudson-slave/maven-repositories/0/org/apache/airavata/airavata-workflow-tracking/0.7-SNAPSHOT/airavata-workflow-tracking-0.7-SNAPSHOT.jar
[INFO] Installing <https://builds.apache.org/job/Apache%20Airavata/ws/modules/commons/workflow-tracking/pom.xml>
to /export/home/hudson/hudson-slave/maven-repositories/0/org/apache/airavata/airavata-workflow-tracking/0.7-SNAPSHOT/airavata-workflow-tracking-0.7-SNAPSHOT.pom
[INFO] --- maven-install-plugin:2.3.1:install (default-install) @ airavata-workflow-tracking
---
mojoSucceeded org.apache.maven.plugins:maven-install-plugin:2.3.1(default-install)
projectSucceeded org.apache.airavata:airavata-workflow-tracking:0.7-SNAPSHOT
projectStarted org.apache.airavata:airavata-gfac-core:0.7-SNAPSHOT
[INFO]                                                                         
[INFO] ------------------------------------------------------------------------
[INFO] Building Airavata GFac Core 0.7-SNAPSHOT
[INFO] ------------------------------------------------------------------------Downloading:
http://repo1.maven.org/maven2/lead-security/puretls/0.9b4-1/puretls-0.9b4-1.pom

Downloading: http://community.ucs.indiana.edu:9090/archiva/repository/ogce.m2.all/lead-security/puretls/0.9b4-1/puretls-0.9b4-1.pom
Downloaded: http://community.ucs.indiana.edu:9090/archiva/repository/ogce.m2.all/lead-security/puretls/0.9b4-1/puretls-0.9b4-1.pom
(391 B at 0.6 KB/sec)
[WARNING] The POM for lead-security:puretls:jar:0.9b4-1 is invalid, transitive dependencies
(if any) will not be available, enable debug logging for more details
Downloading: http://repo1.maven.org/maven2/lead-security/cryptix32/versionless/cryptix32-versionless.pom
Downloading: http://community.ucs.indiana.edu:9090/archiva/repository/ogce.m2.all/lead-security/cryptix32/versionless/cryptix32-versionless.pom
Downloaded: http://community.ucs.indiana.edu:9090/archiva/repository/ogce.m2.all/lead-security/cryptix32/versionless/cryptix32-versionless.pom
(403 B at 1.5 KB/sec)
[WARNING] The POM for lead-security:cryptix32:jar:versionless is invalid, transitive dependencies
(if any) will not be available, enable debug logging for more details
Downloading: http://repo1.maven.org/maven2/lead-security/cryptix-asn1/versionless/cryptix-asn1-versionless.pom
Downloading: http://community.ucs.indiana.edu:9090/archiva/repository/ogce.m2.all/lead-security/cryptix-asn1/versionless/cryptix-asn1-versionless.pom
Downloaded: http://community.ucs.indiana.edu:9090/archiva/repository/ogce.m2.all/lead-security/cryptix-asn1/versionless/cryptix-asn1-versionless.pom
(409 B at 1.5 KB/sec)
[WARNING] The POM for lead-security:cryptix-asn1:jar:versionless is invalid, transitive dependencies
(if any) will not be available, enable debug logging for more details
Downloading: http://repo1.maven.org/maven2/net/sf/saxon/saxon/9/saxon-9.pom
Downloading: http://community.ucs.indiana.edu:9090/archiva/repository/ogce.m2.all/net/sf/saxon/saxon/9/saxon-9.pom
Downloading: http://cilogon.svn.sourceforge.net/viewvc/cilogon/m2-repo/snapshots/net/sf/saxon/saxon/9/saxon-9.pom
Downloading: http://people.apache.org/repo/m2-snapshot-repository/net/sf/saxon/saxon/9/saxon-9.pom
Downloading: http://unicore-dev.zam.kfa-juelich.de/maven/net/sf/saxon/saxon/9/saxon-9.pom
[WARNING] The POM for net.sf.saxon:saxon:jar:9 is missing, no dependency information available
Downloading: http://repo1.maven.org/maven2/lead-security/puretls/0.9b4-1/puretls-0.9b4-1.jar
Downloading: http://repo1.maven.org/maven2/lead-security/cryptix-asn1/versionless/cryptix-asn1-versionless.jar
Downloading: http://repo1.maven.org/maven2/lead-security/cryptix32/versionless/cryptix32-versionless.jar
Downloading: http://community.ucs.indiana.edu:9090/archiva/repository/ogce.m2.all/lead-security/puretls/0.9b4-1/puretls-0.9b4-1.jar
Downloading: http://community.ucs.indiana.edu:9090/archiva/repository/ogce.m2.all/lead-security/cryptix-asn1/versionless/cryptix-asn1-versionless.jar
Downloading: http://community.ucs.indiana.edu:9090/archiva/repository/ogce.m2.all/lead-security/cryptix32/versionless/cryptix32-versionless.jar
Downloaded: http://community.ucs.indiana.edu:9090/archiva/repository/ogce.m2.all/lead-security/cryptix-asn1/versionless/cryptix-asn1-versionless.jar
(79 KB at 67.0 KB/sec)
Downloaded: http://community.ucs.indiana.edu:9090/archiva/repository/ogce.m2.all/lead-security/puretls/0.9b4-1/puretls-0.9b4-1.jar
(187 KB at 130.5 KB/sec)
Downloaded: http://community.ucs.indiana.edu:9090/archiva/repository/ogce.m2.all/lead-security/cryptix32/versionless/cryptix32-versionless.jar
(358 KB at 174.4 KB/sec)
mojoStarted org.apache.maven.plugins:maven-clean-plugin:2.5(default-clean)
[INFO] 
[INFO] --- maven-clean-plugin:2.5:clean (default-clean) @ airavata-gfac-core ---
mojoSucceeded org.apache.maven.plugins:maven-clean-plugin:2.5(default-clean)
mojoStarted org.apache.maven.plugins:maven-resources-plugin:2.5(copy-resources)
[INFO] 
[debug] execute contextualize
[INFO] Using 'UTF-8' encoding to copy filtered resources.
[INFO] --- maven-resources-plugin:2.5:copy-resources (copy-resources) @ airavata-gfac-core
---
[INFO] skip non existing resourceDirectory <https://builds.apache.org/job/Apache%20Airavata/ws/modules/gfac-core/src/main/assembly/dist>
mojoSucceeded org.apache.maven.plugins:maven-resources-plugin:2.5(copy-resources)
mojoStarted org.apache.maven.plugins:maven-remote-resources-plugin:1.4(default)
[INFO] 
[WARNING] Invalid POM for lead-security:puretls:jar:0.9b4-1, transitive dependencies (if any)
will not be available, enable debug logging for more details
[WARNING] Invalid POM for lead-security:cryptix32:jar:versionless, transitive dependencies
(if any) will not be available, enable debug logging for more details
[WARNING] Invalid POM for lead-security:cryptix-asn1:jar:versionless, transitive dependencies
(if any) will not be available, enable debug logging for more details
[INFO] --- maven-remote-resources-plugin:1.4:process (default) @ airavata-gfac-core ---
Downloading: http://repo1.maven.org/maven2/net/sf/saxon/saxon/9/saxon-9.pom
Downloading: http://community.ucs.indiana.edu:9090/archiva/repository/ogce.m2.all/net/sf/saxon/saxon/9/saxon-9.pom
Downloading: http://cilogon.svn.sourceforge.net/viewvc/cilogon/m2-repo/snapshots/net/sf/saxon/saxon/9/saxon-9.pom
Downloading: http://people.apache.org/repo/m2-snapshot-repository/net/sf/saxon/saxon/9/saxon-9.pom
Downloading: http://unicore-dev.zam.kfa-juelich.de/maven/net/sf/saxon/saxon/9/saxon-9.pom
[WARNING] Missing POM for net.sf.saxon:saxon:jar:9
[WARNING] Invalid project model for artifact [puretls:lead-security:0.9b4-1]. It will be ignored
by the remote resources Mojo.
[WARNING] Invalid project model for artifact [cryptix-asn1:lead-security:versionless]. It
will be ignored by the remote resources Mojo.
[WARNING] Invalid project model for artifact [cryptix32:lead-security:versionless]. It will
be ignored by the remote resources Mojo.
mojoSucceeded org.apache.maven.plugins:maven-remote-resources-plugin:1.4(default)
mojoStarted org.apache.maven.plugins:maven-resources-plugin:2.5(default-resources)
[INFO] 
[debug] execute contextualize
[INFO] Using 'UTF-8' encoding to copy filtered resources.
[INFO] Copying 1 resource
[INFO] Copying 3 resources
[INFO] --- maven-resources-plugin:2.5:resources (default-resources) @ airavata-gfac-core ---
mojoSucceeded org.apache.maven.plugins:maven-resources-plugin:2.5(default-resources)
mojoStarted org.apache.maven.plugins:maven-compiler-plugin:2.3.2(default-compile)
[INFO] 
[INFO] Compiling 121 source files to <https://builds.apache.org/job/Apache%20Airavata/ws/modules/gfac-core/target/classes>
[INFO] --- maven-compiler-plugin:2.3.2:compile (default-compile) @ airavata-gfac-core ---
[INFO] -------------------------------------------------------------
[ERROR] COMPILATION ERROR : 
[INFO] -------------------------------------------------------------
[ERROR] error: error reading /export/home/hudson/hudson-slave/maven-repositories/0/eu/unicore/services/use-wsrftypes/2.1.1/use-wsrftypes-2.1.1.jar;
error in opening zip file
[ERROR] error: error reading /export/home/hudson/hudson-slave/maven-repositories/0/net/sf/saxon/saxon/9.1.0.8/saxon-9.1.0.8.jar;
error in opening zip file
[INFO] 2 errors 
[INFO] -------------------------------------------------------------
mojoFailed org.apache.maven.plugins:maven-compiler-plugin:2.3.2(default-compile)
projectFailed org.apache.airavata:airavata-gfac-core:0.7-SNAPSHOT
sessionEnded
[INFO] ------------------------------------------------------------------------
[INFO] Reactor Summary:
[INFO] 
[INFO] Airavata .......................................... SUCCESS [2:25.991s]
[INFO] Airavata Commons .................................. SUCCESS [8.439s]
[INFO] Airavata GFac Schema Utilities .................... SUCCESS [1:11.542s]
[INFO] Airavata Common Utilities ......................... SUCCESS [27.161s]
[INFO] Airavata Registry ................................. SUCCESS [12.336s]
[INFO] Airavata Registry API ............................. SUCCESS [38.061s]
[INFO] Airavata Workflow Model Parent .................... SUCCESS [7.122s]
[INFO] Airavata Workflow Model Core ...................... SUCCESS [24.525s]
[INFO] Airavata WS Messenger ............................. SUCCESS [7.204s]
[INFO] Airavata Messenger Commons ........................ SUCCESS [19.494s]
[INFO] Airavata Messenger Client ......................... SUCCESS [22.855s]
[INFO] Airavata WS Monitor ............................... SUCCESS [20.956s]
[INFO] Airavata Workflow Execution Context ............... SUCCESS [25.018s]
[INFO] Airavata Client ................................... SUCCESS [24.351s]
[INFO] Airavata Workflow Tracking ........................ SUCCESS [34.405s]
[INFO] Airavata GFac Core ................................ FAILURE [31.512s]
[INFO] Airavata Message Box .............................. SKIPPED
[INFO] Airavata Message Broker ........................... SKIPPED
[INFO] Airavata Workflow Component ....................... SKIPPED
[INFO] Airavata Workflow Component Node .................. SKIPPED
[INFO] Airavata JPA Registry ............................. SKIPPED
[INFO] Airavata REST ..................................... SKIPPED
[INFO] airavata-rest-mappings ............................ SKIPPED
[INFO] airavata-rest-client .............................. SKIPPED
[INFO] Airavata XBaya .................................... SKIPPED
[INFO] Airavata Registry Service ......................... SKIPPED
[INFO] Airavata Registry Test ............................ SKIPPED
[INFO] Airavata Security Implementation .................. SKIPPED
[INFO] Airavata Credential Store ......................... SKIPPED
[INFO] airavata-rest-services ............................ SKIPPED
[INFO] airavata-rest-service-webapp ...................... SKIPPED
[INFO] Airavata Tools .................................... SKIPPED
[INFO] Airavata Phoebus Integration ...................... SKIPPED
[INFO] registry-tool ..................................... SKIPPED
[INFO] Simple Math Service ............................... SKIPPED
[INFO] Complex Math Service .............................. SKIPPED
[INFO] Levenshtein Distance Service ...................... SKIPPED
[INFO] Airavata Embedded Tomcat Implementation ........... SKIPPED
[INFO] Airavata Test Suite ............................... SKIPPED
[INFO] distribution ...................................... SKIPPED
[INFO] Samples - Airavata Client Samples ................. SKIPPED
[INFO] Samples - Workflow Create Application ............. SKIPPED
[INFO] Samples - Workflow Execution ...................... SKIPPED
[INFO] Airavata server distribution ...................... SKIPPED
[INFO] Airavata client distribution ...................... SKIPPED
[INFO] Airavata xbaya-gui distribution ................... SKIPPED
[INFO] Airavata release artifacts ........................ SKIPPED
[INFO] Airavata Integration Tests ........................ SKIPPED
[INFO] ------------------------------------------------------------------------
[INFO] BUILD FAILURE
[INFO] ------------------------------------------------------------------------
[INFO] Total time: 9:46.357s
[INFO] Finished at: Fri Feb 08 20:15:31 GMT+00:00 2013
[INFO] Final Memory: 106M/424M
[INFO] ------------------------------------------------------------------------
Projects to build: [MavenProject: org.apache.airavata:airavata:0.7-SNAPSHOT @ <https://builds.apache.org/job/Apache%20Airavata/ws/pom.xml,>
MavenProject: org.apache.airavata:commons:0.7-SNAPSHOT @ <https://builds.apache.org/job/Apache%20Airavata/ws/modules/commons/pom.xml,>
MavenProject: org.apache.airavata:airavata-gfac-schema-utils:0.7-SNAPSHOT @ <https://builds.apache.org/job/Apache%20Airavata/ws/modules/commons/gfac-schema/pom.xml,>
MavenProject: org.apache.airavata:airavata-common-utils:0.7-SNAPSHOT @ <https://builds.apache.org/job/Apache%20Airavata/ws/modules/commons/utils/pom.xml,>
MavenProject: org.apache.airavata:registry:0.7-SNAPSHOT @ <https://builds.apache.org/job/Apache%20Airavata/ws/modules/registry/pom.xml,>
MavenProject: org.apache.airavata:airavata-registry-api:0.7-SNAPSHOT @ <https://builds.apache.org/job/Apache%20Airavata/ws/modules/registry/registry-api/pom.xml,>
MavenProject: org.apache.airavata:airavata-workflow-model-parent:0.7-SNAPSHOT @ <https://builds.apache.org/job/Apache%20Airavata/ws/modules/workflow-model/pom.xml,>
MavenProject: org.apache.airavata:airavata-workflow-model-core:0.7-SNAPSHOT @ <https://builds.apache.org/job/Apache%20Airavata/ws/modules/workflow-model/workflow-model-core/pom.xml,>
MavenProject: org.apache.airavata:airavata-ws-messenger:0.7-SNAPSHOT @ <https://builds.apache.org/job/Apache%20Airavata/ws/modules/ws-messenger/pom.xml,>
MavenProject: org.apache.airavata:airavata-messenger-commons:0.7-SNAPSHOT @ <https://builds.apache.org/job/Apache%20Airavata/ws/modules/ws-messenger/commons/pom.xml,>
MavenProject: org.apache.airavata:airavata-messenger-client:0.7-SNAPSHOT @ <https://builds.apache.org/job/Apache%20Airavata/ws/modules/ws-messenger/client/pom.xml,>
MavenProject: org.apache.airavata:airavata-message-monitor:0.7-SNAPSHOT @ <https://builds.apache.org/job/Apache%20Airavata/ws/modules/ws-messenger/message-monitor/pom.xml,>
MavenProject: org.apache.airavata:airavata-workflow-execution-context:0.7-SNAPSHOT @ <https://builds.apache.org/job/Apache%20Airavata/ws/modules/commons/workflow-execution-context/pom.xml,>
MavenProject: org.apache.airavata:airavata-client-api:0.7-SNAPSHOT @ <https://builds.apache.org/job/Apache%20Airavata/ws/modules/airavata-client/pom.xml,>
MavenProject: org.apache.airavata:airavata-workflow-tracking:0.7-SNAPSHOT @ <https://builds.apache.org/job/Apache%20Airavata/ws/modules/commons/workflow-tracking/pom.xml,>
MavenProject: org.apache.airavata:airavata-gfac-core:0.7-SNAPSHOT @ <https://builds.apache.org/job/Apache%20Airavata/ws/modules/gfac-core/pom.xml,>
MavenProject: org.apache.airavata:airavata-message-box:0.7-SNAPSHOT @ <https://builds.apache.org/job/Apache%20Airavata/ws/modules/ws-messenger/messagebox/pom.xml,>
MavenProject: org.apache.airavata:airavata-message-broker:0.7-SNAPSHOT @ <https://builds.apache.org/job/Apache%20Airavata/ws/modules/ws-messenger/messagebroker/pom.xml,>
MavenProject: org.apache.airavata:airavata-workflow-model-component:0.7-SNAPSHOT @ <https://builds.apache.org/job/Apache%20Airavata/ws/modules/workflow-model/workflow-model-component/pom.xml,>
MavenProject: org.apache.airavata:airavata-workflow-model-component-node:0.7-SNAPSHOT @ <https://builds.apache.org/job/Apache%20Airavata/ws/modules/workflow-model/workflow-model-component-node/pom.xml,>
MavenProject: org.apache.airavata:airavata-jpa-registry:0.7-SNAPSHOT @ <https://builds.apache.org/job/Apache%20Airavata/ws/modules/registry/airavata-jpa-registry/pom.xml,>
MavenProject: org.apache.airavata:rest:0.7-SNAPSHOT @ <https://builds.apache.org/job/Apache%20Airavata/ws/modules/rest/pom.xml,>
MavenProject: org.apache.airavata:airavata-rest-mappings:0.7-SNAPSHOT @ <https://builds.apache.org/job/Apache%20Airavata/ws/modules/rest/mappings/pom.xml,>
MavenProject: org.apache.airavata:airavata-rest-client:0.7-SNAPSHOT @ <https://builds.apache.org/job/Apache%20Airavata/ws/modules/rest/client/pom.xml,>
MavenProject: org.apache.airavata:airavata-xbaya-gui:0.7-SNAPSHOT @ <https://builds.apache.org/job/Apache%20Airavata/ws/modules/xbaya-gui/pom.xml,>
MavenProject: org.apache.airavata:airavata-registry-service:0.7-SNAPSHOT @ <https://builds.apache.org/job/Apache%20Airavata/ws/modules/registry/airavata-registry-service/pom.xml,>
MavenProject: org.apache.airavata:airavata-registry-test:0.7-SNAPSHOT @ <https://builds.apache.org/job/Apache%20Airavata/ws/modules/registry/airavata-registry-test/pom.xml,>
MavenProject: org.apache.airavata:airavata-security:0.7-SNAPSHOT @ <https://builds.apache.org/job/Apache%20Airavata/ws/modules/security/pom.xml,>
MavenProject: org.apache.airavata:airavata-credential-store:0.7-SNAPSHOT @ <https://builds.apache.org/job/Apache%20Airavata/ws/modules/credential-store/pom.xml,>
MavenProject: org.apache.airavata:airavata-rest-services:0.7-SNAPSHOT @ <https://builds.apache.org/job/Apache%20Airavata/ws/modules/rest/service/pom.xml,>
MavenProject: org.apache.airavata:airavata-rest-service-webapp:0.7-SNAPSHOT @ <https://builds.apache.org/job/Apache%20Airavata/ws/modules/rest/webapp/pom.xml,>
MavenProject: org.apache.airavata:airavata-tools-parent:0.7-SNAPSHOT @ <https://builds.apache.org/job/Apache%20Airavata/ws/tools/pom.xml,>
MavenProject: org.apache.airavata:airavata-phoebus-integration:0.7-SNAPSHOT @ <https://builds.apache.org/job/Apache%20Airavata/ws/tools/phoebus-integration/pom.xml,>
MavenProject: org.apache.airavata:registry-tool:0.7-SNAPSHOT @ <https://builds.apache.org/job/Apache%20Airavata/ws/tools/registry-tool/pom.xml,>
MavenProject: org.apache.airavata:airavata-simple-math-service:0.7-SNAPSHOT @ <https://builds.apache.org/job/Apache%20Airavata/ws/samples/simple-math-service/pom.xml,>
MavenProject: org.apache.airavata:airavata-complex-math-service:0.7-SNAPSHOT @ <https://builds.apache.org/job/Apache%20Airavata/ws/samples/complex-math-service/pom.xml,>
MavenProject: org.apache.airavata:airavata-levenshtein-distance-service:0.7-SNAPSHOT @ <https://builds.apache.org/job/Apache%20Airavata/ws/samples/levenshtein-distance-service/pom.xml,>
MavenProject: org.apache.airavata:airavata-embedded-tomcat:0.7-SNAPSHOT @ <https://builds.apache.org/job/Apache%20Airavata/ws/modules/server/pom.xml,>
MavenProject: org.apache.airavata:test-suite:0.7-SNAPSHOT @ <https://builds.apache.org/job/Apache%20Airavata/ws/modules/test-suite/pom.xml,>
MavenProject: org.apache.airavata:distribution:0.7-SNAPSHOT @ <https://builds.apache.org/job/Apache%20Airavata/ws/modules/distribution/pom.xml,>
MavenProject: org.apache.airavata:airavata-client-sample:0.7-SNAPSHOT @ <https://builds.apache.org/job/Apache%20Airavata/ws/samples/airavata-client/pom.xml,>
MavenProject: org.apache.airavata:samples-create-application:0.7-SNAPSHOT @ <https://builds.apache.org/job/Apache%20Airavata/ws/samples/airavata-client/create-application/pom.xml,>
MavenProject: org.apache.airavata:samples-workflow-run:0.7-SNAPSHOT @ <https://builds.apache.org/job/Apache%20Airavata/ws/samples/airavata-client/workflow-run/pom.xml,>
MavenProject: org.apache.airavata:apache-airavata-server:0.7-SNAPSHOT @ <https://builds.apache.org/job/Apache%20Airavata/ws/modules/distribution/airavata-server/pom.xml,>
MavenProject: org.apache.airavata:apache-airavata-client:0.7-SNAPSHOT @ <https://builds.apache.org/job/Apache%20Airavata/ws/modules/distribution/airavata-client/pom.xml,>
MavenProject: org.apache.airavata:apache-airavata-xbaya-gui:0.7-SNAPSHOT @ <https://builds.apache.org/job/Apache%20Airavata/ws/modules/distribution/xbaya-gui/pom.xml,>
MavenProject: org.apache.airavata:apache-airavata-release-artifacts:0.7-SNAPSHOT @ <https://builds.apache.org/job/Apache%20Airavata/ws/modules/distribution/release/pom.xml,>
MavenProject: org.apache.airavata:integration-tests:0.7-SNAPSHOT @ <https://builds.apache.org/job/Apache%20Airavata/ws/modules/integration-tests/pom.xml]>
[JENKINS] Archiving <https://builds.apache.org/job/Apache%20Airavata/ws/modules/distribution/release/pom.xml>
to /home/hudson/hudson/jobs/Apache Airavata/modules/org.apache.airavata$apache-airavata-release-artifacts/builds/2013-02-08_20-02-48/archive/org.apache.airavata/apache-airavata-release-artifacts/0.7-SNAPSHOT/apache-airavata-release-artifacts-0.7-SNAPSHOT.pom
[JENKINS] Archiving <https://builds.apache.org/job/Apache%20Airavata/ws/modules/commons/workflow-tracking/pom.xml>
to /home/hudson/hudson/jobs/Apache Airavata/modules/org.apache.airavata$airavata-workflow-tracking/builds/2013-02-08_20-02-41/archive/org.apache.airavata/airavata-workflow-tracking/0.7-SNAPSHOT/airavata-workflow-tracking-0.7-SNAPSHOT.pom
[JENKINS] Archiving <https://builds.apache.org/job/Apache%20Airavata/ws/modules/commons/workflow-tracking/target/airavata-workflow-tracking-0.7-SNAPSHOT.jar>
to /home/hudson/hudson/jobs/Apache Airavata/modules/org.apache.airavata$airavata-workflow-tracking/builds/2013-02-08_20-02-41/archive/org.apache.airavata/airavata-workflow-tracking/0.7-SNAPSHOT/airavata-workflow-tracking-0.7-SNAPSHOT.jar
[JENKINS] Archiving <https://builds.apache.org/job/Apache%20Airavata/ws/samples/complex-math-service/pom.xml>
to /home/hudson/hudson/jobs/Apache Airavata/modules/org.apache.airavata$airavata-complex-math-service/builds/2013-02-08_20-02-45/archive/org.apache.airavata/airavata-complex-math-service/0.7-SNAPSHOT/airavata-complex-math-service-0.7-SNAPSHOT.pom
[JENKINS] Archiving <https://builds.apache.org/job/Apache%20Airavata/ws/modules/distribution/pom.xml>
to /home/hudson/hudson/jobs/Apache Airavata/modules/org.apache.airavata$distribution/builds/2013-02-08_20-02-47/archive/org.apache.airavata/distribution/0.7-SNAPSHOT/distribution-0.7-SNAPSHOT.pom
[JENKINS] Archiving <https://builds.apache.org/job/Apache%20Airavata/ws/modules/workflow-model/workflow-model-component-node/pom.xml>
to /home/hudson/hudson/jobs/Apache Airavata/modules/org.apache.airavata$airavata-workflow-model-component-node/builds/2013-02-08_20-02-40/archive/org.apache.airavata/airavata-workflow-model-component-node/0.7-SNAPSHOT/airavata-workflow-model-component-node-0.7-SNAPSHOT.pom
[JENKINS] Archiving <https://builds.apache.org/job/Apache%20Airavata/ws/samples/simple-math-service/pom.xml>
to /home/hudson/hudson/jobs/Apache Airavata/modules/org.apache.airavata$airavata-simple-math-service/builds/2013-02-08_20-02-45/archive/org.apache.airavata/airavata-simple-math-service/0.7-SNAPSHOT/airavata-simple-math-service-0.7-SNAPSHOT.pom
[JENKINS] Archiving <https://builds.apache.org/job/Apache%20Airavata/ws/modules/server/pom.xml>
to /home/hudson/hudson/jobs/Apache Airavata/modules/org.apache.airavata$airavata-embedded-tomcat/builds/2013-02-08_20-02-46/archive/org.apache.airavata/airavata-embedded-tomcat/0.7-SNAPSHOT/airavata-embedded-tomcat-0.7-SNAPSHOT.pom
[JENKINS] Archiving <https://builds.apache.org/job/Apache%20Airavata/ws/modules/registry/registry-api/pom.xml>
to /home/hudson/hudson/jobs/Apache Airavata/modules/org.apache.airavata$airavata-registry-api/builds/2013-02-08_20-02-42/archive/org.apache.airavata/airavata-registry-api/0.7-SNAPSHOT/airavata-registry-api-0.7-SNAPSHOT.pom
[JENKINS] Archiving <https://builds.apache.org/job/Apache%20Airavata/ws/modules/registry/registry-api/target/airavata-registry-api-0.7-SNAPSHOT.jar>
to /home/hudson/hudson/jobs/Apache Airavata/modules/org.apache.airavata$airavata-registry-api/builds/2013-02-08_20-02-42/archive/org.apache.airavata/airavata-registry-api/0.7-SNAPSHOT/airavata-registry-api-0.7-SNAPSHOT.jar
[JENKINS] Archiving <https://builds.apache.org/job/Apache%20Airavata/ws/modules/ws-messenger/messagebox/pom.xml>
to /home/hudson/hudson/jobs/Apache Airavata/modules/org.apache.airavata$airavata-message-box/builds/2013-02-08_20-02-37/archive/org.apache.airavata/airavata-message-box/0.7-SNAPSHOT/airavata-message-box-0.7-SNAPSHOT.pom
[JENKINS] Archiving <https://builds.apache.org/job/Apache%20Airavata/ws/modules/security/pom.xml>
to /home/hudson/hudson/jobs/Apache Airavata/modules/org.apache.airavata$airavata-security/builds/2013-02-08_20-02-43/archive/org.apache.airavata/airavata-security/0.7-SNAPSHOT/airavata-security-0.7-SNAPSHOT.pom
[JENKINS] Archiving <https://builds.apache.org/job/Apache%20Airavata/ws/tools/phoebus-integration/pom.xml>
to /home/hudson/hudson/jobs/Apache Airavata/modules/org.apache.airavata$airavata-phoebus-integration/builds/2013-02-08_20-02-45/archive/org.apache.airavata/airavata-phoebus-integration/0.7-SNAPSHOT/airavata-phoebus-integration-0.7-SNAPSHOT.pom
[JENKINS] Archiving <https://builds.apache.org/job/Apache%20Airavata/ws/modules/gfac-core/pom.xml>
to /home/hudson/hudson/jobs/Apache Airavata/modules/org.apache.airavata$airavata-gfac-core/builds/2013-02-08_20-02-35/archive/org.apache.airavata/airavata-gfac-core/0.7-SNAPSHOT/airavata-gfac-core-0.7-SNAPSHOT.pom
[JENKINS] Archiving <https://builds.apache.org/job/Apache%20Airavata/ws/modules/distribution/airavata-server/pom.xml>
to /home/hudson/hudson/jobs/Apache Airavata/modules/org.apache.airavata$apache-airavata-server/builds/2013-02-08_20-02-47/archive/org.apache.airavata/apache-airavata-server/0.7-SNAPSHOT/apache-airavata-server-0.7-SNAPSHOT.pom
[JENKINS] Archiving <https://builds.apache.org/job/Apache%20Airavata/ws/modules/registry/airavata-registry-test/pom.xml>
to /home/hudson/hudson/jobs/Apache Airavata/modules/org.apache.airavata$airavata-registry-test/builds/2013-02-08_20-02-42/archive/org.apache.airavata/airavata-registry-test/0.7-SNAPSHOT/airavata-registry-test-0.7-SNAPSHOT.pom
[JENKINS] Archiving <https://builds.apache.org/job/Apache%20Airavata/ws/modules/workflow-model/workflow-model-component/pom.xml>
to /home/hudson/hudson/jobs/Apache Airavata/modules/org.apache.airavata$airavata-workflow-model-component/builds/2013-02-08_20-02-39/archive/org.apache.airavata/airavata-workflow-model-component/0.7-SNAPSHOT/airavata-workflow-model-component-0.7-SNAPSHOT.pom
[JENKINS] Archiving <https://builds.apache.org/job/Apache%20Airavata/ws/modules/xbaya-gui/pom.xml>
to /home/hudson/hudson/jobs/Apache Airavata/modules/org.apache.airavata$airavata-xbaya-gui/builds/2013-02-08_20-02-40/archive/org.apache.airavata/airavata-xbaya-gui/0.7-SNAPSHOT/airavata-xbaya-gui-0.7-SNAPSHOT.pom
[JENKINS] Archiving <https://builds.apache.org/job/Apache%20Airavata/ws/modules/commons/workflow-execution-context/pom.xml>
to /home/hudson/hudson/jobs/Apache Airavata/modules/org.apache.airavata$airavata-workflow-execution-context/builds/2013-02-08_20-02-41/archive/org.apache.airavata/airavata-workflow-execution-context/0.7-SNAPSHOT/airavata-workflow-execution-context-0.7-SNAPSHOT.pom
[JENKINS] Archiving <https://builds.apache.org/job/Apache%20Airavata/ws/modules/commons/workflow-execution-context/target/airavata-workflow-execution-context-0.7-SNAPSHOT.jar>
to /home/hudson/hudson/jobs/Apache Airavata/modules/org.apache.airavata$airavata-workflow-execution-context/builds/2013-02-08_20-02-41/archive/org.apache.airavata/airavata-workflow-execution-context/0.7-SNAPSHOT/airavata-workflow-execution-context-0.7-SNAPSHOT.jar
[JENKINS] Archiving <https://builds.apache.org/job/Apache%20Airavata/ws/modules/integration-tests/pom.xml>
to /home/hudson/hudson/jobs/Apache Airavata/modules/org.apache.airavata$integration-tests/builds/2013-02-08_20-02-48/archive/org.apache.airavata/integration-tests/0.7-SNAPSHOT/integration-tests-0.7-SNAPSHOT.pom
[JENKINS] Archiving <https://builds.apache.org/job/Apache%20Airavata/ws/samples/airavata-client/workflow-run/pom.xml>
to /home/hudson/hudson/jobs/Apache Airavata/modules/org.apache.airavata$samples-workflow-run/builds/2013-02-08_20-02-46/archive/org.apache.airavata/samples-workflow-run/0.7-SNAPSHOT/samples-workflow-run-0.7-SNAPSHOT.pom
[JENKINS] Archiving <https://builds.apache.org/job/Apache%20Airavata/ws/modules/commons/pom.xml>
to /home/hudson/hudson/jobs/Apache Airavata/modules/org.apache.airavata$commons/builds/2013-02-08_20-02-40/archive/org.apache.airavata/commons/0.7-SNAPSHOT/commons-0.7-SNAPSHOT.pom
[JENKINS] Archiving <https://builds.apache.org/job/Apache%20Airavata/ws/modules/ws-messenger/message-monitor/pom.xml>
to /home/hudson/hudson/jobs/Apache Airavata/modules/org.apache.airavata$airavata-message-monitor/builds/2013-02-08_20-02-38/archive/org.apache.airavata/airavata-message-monitor/0.7-SNAPSHOT/airavata-message-monitor-0.7-SNAPSHOT.pom
[JENKINS] Archiving <https://builds.apache.org/job/Apache%20Airavata/ws/modules/ws-messenger/message-monitor/target/airavata-message-monitor-0.7-SNAPSHOT.jar>
to /home/hudson/hudson/jobs/Apache Airavata/modules/org.apache.airavata$airavata-message-monitor/builds/2013-02-08_20-02-38/archive/org.apache.airavata/airavata-message-monitor/0.7-SNAPSHOT/airavata-message-monitor-0.7-SNAPSHOT.jar
[JENKINS] Archiving <https://builds.apache.org/job/Apache%20Airavata/ws/modules/registry/pom.xml>
to /home/hudson/hudson/jobs/Apache Airavata/modules/org.apache.airavata$registry/builds/2013-02-08_20-02-42/archive/org.apache.airavata/registry/0.7-SNAPSHOT/registry-0.7-SNAPSHOT.pom
[JENKINS] Archiving <https://builds.apache.org/job/Apache%20Airavata/ws/tools/registry-tool/pom.xml>
to /home/hudson/hudson/jobs/Apache Airavata/modules/org.apache.airavata$registry-tool/builds/2013-02-08_20-02-45/archive/org.apache.airavata/registry-tool/0.7-SNAPSHOT/registry-tool-0.7-SNAPSHOT.pom
[JENKINS] Archiving <https://builds.apache.org/job/Apache%20Airavata/ws/tools/pom.xml>
to /home/hudson/hudson/jobs/Apache Airavata/modules/org.apache.airavata$airavata-tools-parent/builds/2013-02-08_20-02-44/archive/org.apache.airavata/airavata-tools-parent/0.7-SNAPSHOT/airavata-tools-parent-0.7-SNAPSHOT.pom
[JENKINS] Archiving <https://builds.apache.org/job/Apache%20Airavata/ws/samples/airavata-client/pom.xml>
to /home/hudson/hudson/jobs/Apache Airavata/modules/org.apache.airavata$airavata-client-sample/builds/2013-02-08_20-02-46/archive/org.apache.airavata/airavata-client-sample/0.7-SNAPSHOT/airavata-client-sample-0.7-SNAPSHOT.pom
[JENKINS] Archiving <https://builds.apache.org/job/Apache%20Airavata/ws/modules/ws-messenger/pom.xml>
to /home/hudson/hudson/jobs/Apache Airavata/modules/org.apache.airavata$airavata-ws-messenger/builds/2013-02-08_20-02-36/archive/org.apache.airavata/airavata-ws-messenger/0.7-SNAPSHOT/airavata-ws-messenger-0.7-SNAPSHOT.pom
[JENKINS] Archiving <https://builds.apache.org/job/Apache%20Airavata/ws/modules/rest/service/pom.xml>
to /home/hudson/hudson/jobs/Apache Airavata/modules/org.apache.airavata$airavata-rest-services/builds/2013-02-08_20-02-44/archive/org.apache.airavata/airavata-rest-services/0.7-SNAPSHOT/airavata-rest-services-0.7-SNAPSHOT.pom
[JENKINS] Archiving <https://builds.apache.org/job/Apache%20Airavata/ws/modules/rest/webapp/pom.xml>
to /home/hudson/hudson/jobs/Apache Airavata/modules/org.apache.airavata$airavata-rest-service-webapp/builds/2013-02-08_20-02-44/archive/org.apache.airavata/airavata-rest-service-webapp/0.7-SNAPSHOT/airavata-rest-service-webapp-0.7-SNAPSHOT.pom
[JENKINS] Archiving <https://builds.apache.org/job/Apache%20Airavata/ws/samples/airavata-client/create-application/pom.xml>
to /home/hudson/hudson/jobs/Apache Airavata/modules/org.apache.airavata$samples-create-application/builds/2013-02-08_20-02-46/archive/org.apache.airavata/samples-create-application/0.7-SNAPSHOT/samples-create-application-0.7-SNAPSHOT.pom
[JENKINS] Archiving <https://builds.apache.org/job/Apache%20Airavata/ws/modules/distribution/airavata-client/pom.xml>
to /home/hudson/hudson/jobs/Apache Airavata/modules/org.apache.airavata$apache-airavata-client/builds/2013-02-08_20-02-47/archive/org.apache.airavata/apache-airavata-client/0.7-SNAPSHOT/apache-airavata-client-0.7-SNAPSHOT.pom
[JENKINS] Archiving <https://builds.apache.org/job/Apache%20Airavata/ws/modules/registry/airavata-jpa-registry/pom.xml>
to /home/hudson/hudson/jobs/Apache Airavata/modules/org.apache.airavata$airavata-jpa-registry/builds/2013-02-08_20-02-42/archive/org.apache.airavata/airavata-jpa-registry/0.7-SNAPSHOT/airavata-jpa-registry-0.7-SNAPSHOT.pom
[JENKINS] Archiving <https://builds.apache.org/job/Apache%20Airavata/ws/modules/commons/utils/pom.xml>
to /home/hudson/hudson/jobs/Apache Airavata/modules/org.apache.airavata$airavata-common-utils/builds/2013-02-08_20-02-41/archive/org.apache.airavata/airavata-common-utils/0.7-SNAPSHOT/airavata-common-utils-0.7-SNAPSHOT.pom
[JENKINS] Archiving <https://builds.apache.org/job/Apache%20Airavata/ws/modules/commons/utils/target/airavata-common-utils-0.7-SNAPSHOT.jar>
to /home/hudson/hudson/jobs/Apache Airavata/modules/org.apache.airavata$airavata-common-utils/builds/2013-02-08_20-02-41/archive/org.apache.airavata/airavata-common-utils/0.7-SNAPSHOT/airavata-common-utils-0.7-SNAPSHOT.jar
[JENKINS] Archiving <https://builds.apache.org/job/Apache%20Airavata/ws/samples/levenshtein-distance-service/pom.xml>
to /home/hudson/hudson/jobs/Apache Airavata/modules/org.apache.airavata$airavata-levenshtein-distance-service/builds/2013-02-08_20-02-45/archive/org.apache.airavata/airavata-levenshtein-distance-service/0.7-SNAPSHOT/airavata-levenshtein-distance-service-0.7-SNAPSHOT.pom
[JENKINS] Archiving <https://builds.apache.org/job/Apache%20Airavata/ws/modules/rest/pom.xml>
to /home/hudson/hudson/jobs/Apache Airavata/modules/org.apache.airavata$rest/builds/2013-02-08_20-02-43/archive/org.apache.airavata/rest/0.7-SNAPSHOT/rest-0.7-SNAPSHOT.pom
[JENKINS] Archiving <https://builds.apache.org/job/Apache%20Airavata/ws/modules/distribution/xbaya-gui/pom.xml>
to /home/hudson/hudson/jobs/Apache Airavata/modules/org.apache.airavata$apache-airavata-xbaya-gui/builds/2013-02-08_20-02-48/archive/org.apache.airavata/apache-airavata-xbaya-gui/0.7-SNAPSHOT/apache-airavata-xbaya-gui-0.7-SNAPSHOT.pom
[JENKINS] Archiving <https://builds.apache.org/job/Apache%20Airavata/ws/modules/airavata-client/pom.xml>
to /home/hudson/hudson/jobs/Apache Airavata/modules/org.apache.airavata$airavata-client-api/builds/2013-02-08_20-02-43/archive/org.apache.airavata/airavata-client-api/0.7-SNAPSHOT/airavata-client-api-0.7-SNAPSHOT.pom
[JENKINS] Archiving <https://builds.apache.org/job/Apache%20Airavata/ws/modules/airavata-client/target/airavata-client-api-0.7-SNAPSHOT.jar>
to /home/hudson/hudson/jobs/Apache Airavata/modules/org.apache.airavata$airavata-client-api/builds/2013-02-08_20-02-43/archive/org.apache.airavata/airavata-client-api/0.7-SNAPSHOT/airavata-client-api-0.7-SNAPSHOT.jar
[JENKINS] Archiving <https://builds.apache.org/job/Apache%20Airavata/ws/modules/ws-messenger/messagebroker/pom.xml>
to /home/hudson/hudson/jobs/Apache Airavata/modules/org.apache.airavata$airavata-message-broker/builds/2013-02-08_20-02-38/archive/org.apache.airavata/airavata-message-broker/0.7-SNAPSHOT/airavata-message-broker-0.7-SNAPSHOT.pom
[JENKINS] Archiving <https://builds.apache.org/job/Apache%20Airavata/ws/modules/commons/gfac-schema/pom.xml>
to /home/hudson/hudson/jobs/Apache Airavata/modules/org.apache.airavata$airavata-gfac-schema-utils/builds/2013-02-08_20-02-41/archive/org.apache.airavata/airavata-gfac-schema-utils/0.7-SNAPSHOT/airavata-gfac-schema-utils-0.7-SNAPSHOT.pom
[JENKINS] Archiving <https://builds.apache.org/job/Apache%20Airavata/ws/modules/commons/gfac-schema/target/airavata-gfac-schema-utils-0.7-SNAPSHOT.jar>
to /home/hudson/hudson/jobs/Apache Airavata/modules/org.apache.airavata$airavata-gfac-schema-utils/builds/2013-02-08_20-02-41/archive/org.apache.airavata/airavata-gfac-schema-utils/0.7-SNAPSHOT/airavata-gfac-schema-utils-0.7-SNAPSHOT.jar
[JENKINS] Archiving <https://builds.apache.org/job/Apache%20Airavata/ws/modules/rest/mappings/pom.xml>
to /home/hudson/hudson/jobs/Apache Airavata/modules/org.apache.airavata$airavata-rest-mappings/builds/2013-02-08_20-02-44/archive/org.apache.airavata/airavata-rest-mappings/0.7-SNAPSHOT/airavata-rest-mappings-0.7-SNAPSHOT.pom
[JENKINS] Archiving <https://builds.apache.org/job/Apache%20Airavata/ws/modules/workflow-model/pom.xml>
to /home/hudson/hudson/jobs/Apache Airavata/modules/org.apache.airavata$airavata-workflow-model-parent/builds/2013-02-08_20-02-39/archive/org.apache.airavata/airavata-workflow-model-parent/0.7-SNAPSHOT/airavata-workflow-model-parent-0.7-SNAPSHOT.pom
[JENKINS] Archiving <https://builds.apache.org/job/Apache%20Airavata/ws/modules/registry/airavata-registry-service/pom.xml>
to /home/hudson/hudson/jobs/Apache Airavata/modules/org.apache.airavata$airavata-registry-service/builds/2013-02-08_20-02-42/archive/org.apache.airavata/airavata-registry-service/0.7-SNAPSHOT/airavata-registry-service-0.7-SNAPSHOT.pom
[JENKINS] Archiving <https://builds.apache.org/job/Apache%20Airavata/ws/modules/rest/client/pom.xml>
to /home/hudson/hudson/jobs/Apache Airavata/modules/org.apache.airavata$airavata-rest-client/builds/2013-02-08_20-02-44/archive/org.apache.airavata/airavata-rest-client/0.7-SNAPSHOT/airavata-rest-client-0.7-SNAPSHOT.pom
[JENKINS] Archiving <https://builds.apache.org/job/Apache%20Airavata/ws/modules/credential-store/pom.xml>
to /home/hudson/hudson/jobs/Apache Airavata/modules/org.apache.airavata$airavata-credential-store/builds/2013-02-08_20-02-43/archive/org.apache.airavata/airavata-credential-store/0.7-SNAPSHOT/airavata-credential-store-0.7-SNAPSHOT.pom
[JENKINS] Archiving <https://builds.apache.org/job/Apache%20Airavata/ws/modules/ws-messenger/client/pom.xml>
to /home/hudson/hudson/jobs/Apache Airavata/modules/org.apache.airavata$airavata-messenger-client/builds/2013-02-08_20-02-37/archive/org.apache.airavata/airavata-messenger-client/0.7-SNAPSHOT/airavata-messenger-client-0.7-SNAPSHOT.pom
[JENKINS] Archiving <https://builds.apache.org/job/Apache%20Airavata/ws/modules/ws-messenger/client/target/airavata-messenger-client-0.7-SNAPSHOT.jar>
to /home/hudson/hudson/jobs/Apache Airavata/modules/org.apache.airavata$airavata-messenger-client/builds/2013-02-08_20-02-37/archive/org.apache.airavata/airavata-messenger-client/0.7-SNAPSHOT/airavata-messenger-client-0.7-SNAPSHOT.jar
[JENKINS] Archiving <https://builds.apache.org/job/Apache%20Airavata/ws/modules/ws-messenger/commons/pom.xml>
to /home/hudson/hudson/jobs/Apache Airavata/modules/org.apache.airavata$airavata-messenger-commons/builds/2013-02-08_20-02-37/archive/org.apache.airavata/airavata-messenger-commons/0.7-SNAPSHOT/airavata-messenger-commons-0.7-SNAPSHOT.pom
[JENKINS] Archiving <https://builds.apache.org/job/Apache%20Airavata/ws/modules/ws-messenger/commons/target/airavata-messenger-commons-0.7-SNAPSHOT.jar>
to /home/hudson/hudson/jobs/Apache Airavata/modules/org.apache.airavata$airavata-messenger-commons/builds/2013-02-08_20-02-37/archive/org.apache.airavata/airavata-messenger-commons/0.7-SNAPSHOT/airavata-messenger-commons-0.7-SNAPSHOT.jar
[JENKINS] Archiving <https://builds.apache.org/job/Apache%20Airavata/ws/modules/workflow-model/workflow-model-core/pom.xml>
to /home/hudson/hudson/jobs/Apache Airavata/modules/org.apache.airavata$airavata-workflow-model-core/builds/2013-02-08_20-02-39/archive/org.apache.airavata/airavata-workflow-model-core/0.7-SNAPSHOT/airavata-workflow-model-core-0.7-SNAPSHOT.pom
[JENKINS] Archiving <https://builds.apache.org/job/Apache%20Airavata/ws/modules/workflow-model/workflow-model-core/target/airavata-workflow-model-core-0.7-SNAPSHOT.jar>
to /home/hudson/hudson/jobs/Apache Airavata/modules/org.apache.airavata$airavata-workflow-model-core/builds/2013-02-08_20-02-39/archive/org.apache.airavata/airavata-workflow-model-core/0.7-SNAPSHOT/airavata-workflow-model-core-0.7-SNAPSHOT.jar
[JENKINS] Archiving <https://builds.apache.org/job/Apache%20Airavata/ws/modules/test-suite/pom.xml>
to /home/hudson/hudson/jobs/Apache Airavata/modules/org.apache.airavata$test-suite/builds/2013-02-08_20-02-46/archive/org.apache.airavata/test-suite/0.7-SNAPSHOT/test-suite-0.7-SNAPSHOT.pom
[JENKINS] Archiving <https://builds.apache.org/job/Apache%20Airavata/ws/pom.xml> to
/home/hudson/hudson/jobs/Apache Airavata/modules/org.apache.airavata$airavata/builds/2013-02-08_20-02-35/archive/org.apache.airavata/airavata/0.7-SNAPSHOT/airavata-0.7-SNAPSHOT.pom
Waiting for Jenkins to finish collecting data
mavenExecutionResult exceptions not empty
message : Failed to execute goal org.apache.maven.plugins:maven-compiler-plugin:2.3.2:compile
(default-compile) on project airavata-gfac-core: Compilation failure
cause : Compilation failure
Stack trace : 
org.apache.maven.lifecycle.LifecycleExecutionException: Failed to execute goal org.apache.maven.plugins:maven-compiler-plugin:2.3.2:compile
(default-compile) on project airavata-gfac-core: Compilation failure
	at org.apache.maven.lifecycle.internal.MojoExecutor.execute(MojoExecutor.java:213)
	at org.apache.maven.lifecycle.internal.MojoExecutor.execute(MojoExecutor.java:153)
	at org.apache.maven.lifecycle.internal.MojoExecutor.execute(MojoExecutor.java:145)
	at org.apache.maven.lifecycle.internal.LifecycleModuleBuilder.buildProject(LifecycleModuleBuilder.java:84)
	at org.apache.maven.lifecycle.internal.LifecycleModuleBuilder.buildProject(LifecycleModuleBuilder.java:59)
	at org.apache.maven.lifecycle.internal.LifecycleStarter.singleThreadedBuild(LifecycleStarter.java:183)
	at org.apache.maven.lifecycle.internal.LifecycleStarter.execute(LifecycleStarter.java:161)
	at org.apache.maven.DefaultMaven.doExecute(DefaultMaven.java:319)
	at org.apache.maven.DefaultMaven.execute(DefaultMaven.java:156)
	at org.jvnet.hudson.maven3.launcher.Maven3Launcher.main(Maven3Launcher.java:79)
	at sun.reflect.NativeMethodAccessorImpl.invoke0(Native Method)
	at sun.reflect.NativeMethodAccessorImpl.invoke(NativeMethodAccessorImpl.java:39)
	at sun.reflect.DelegatingMethodAccessorImpl.invoke(DelegatingMethodAccessorImpl.java:25)
	at java.lang.reflect.Method.invoke(Method.java:597)
	at org.codehaus.plexus.classworlds.launcher.Launcher.launchStandard(Launcher.java:329)
	at org.codehaus.plexus.classworlds.launcher.Launcher.launch(Launcher.java:239)
	at org.jvnet.hudson.maven3.agent.Maven3Main.launch(Maven3Main.java:158)
	at hudson.maven.Maven3Builder.call(Maven3Builder.java:100)
	at hudson.maven.Maven3Builder.call(Maven3Builder.java:66)
	at hudson.remoting.UserRequest.perform(UserRequest.java:118)
	at hudson.remoting.UserRequest.perform(UserRequest.java:48)
	at hudson.remoting.Request$2.run(Request.java:326)
	at hudson.remoting.InterceptingExecutorService$1.call(InterceptingExecutorService.java:72)
	at java.util.concurrent.FutureTask$Sync.innerRun(FutureTask.java:303)
	at java.util.concurrent.FutureTask.run(FutureTask.java:138)
	at java.util.concurrent.ThreadPoolExecutor$Worker.runTask(ThreadPoolExecutor.java:886)
	at java.util.concurrent.ThreadPoolExecutor$Worker.run(ThreadPoolExecutor.java:908)
	at java.lang.Thread.run(Thread.java:662)
Caused by: org.apache.maven.plugin.CompilationFailureException: Compilation failure
	at org.apache.maven.plugin.AbstractCompilerMojo.execute(AbstractCompilerMojo.java:656)
	at org.apache.maven.plugin.CompilerMojo.execute(CompilerMojo.java:128)
	at org.apache.maven.plugin.DefaultBuildPluginManager.executeMojo(DefaultBuildPluginManager.java:101)
	at org.apache.maven.lifecycle.internal.MojoExecutor.execute(MojoExecutor.java:209)
	... 27 more
Sending e-mails to: dev@airavata.apache.org
channel stopped

Mime
View raw message