airavata-dev mailing list archives

Site index · List index
Message view « Date » · « Thread »
Top « Date » · « Thread »
From Apache Jenkins Server <jenk...@builds.apache.org>
Subject Build failed in Jenkins: Apache Airavata » Airavata GFac Core #1056
Date Thu, 28 Feb 2013 03:02:39 GMT
See <https://builds.apache.org/job/Apache%20Airavata/org.apache.airavata$airavata-gfac-core/1056/>

------------------------------------------
[...truncated 229 lines...]
Downloading: http://repo1.maven.org/maven2/net/sf/jopt-simple/jopt-simple/3.2/jopt-simple-3.2.pom
Downloaded: http://repo1.maven.org/maven2/net/sf/jopt-simple/jopt-simple/3.2/jopt-simple-3.2.pom
(11 KB at 94.2 KB/sec)
Downloading: http://repo1.maven.org/maven2/org/apache/whirr/whirr-hadoop/0.7.1/whirr-hadoop-0.7.1.pom
Downloaded: http://repo1.maven.org/maven2/org/apache/whirr/whirr-hadoop/0.7.1/whirr-hadoop-0.7.1.pom
(5 KB at 6.5 KB/sec)
Downloading: http://repo1.maven.org/maven2/org/hamcrest/hamcrest-all/1.1/hamcrest-all-1.1.pom
Downloaded: http://repo1.maven.org/maven2/org/hamcrest/hamcrest-all/1.1/hamcrest-all-1.1.pom
(479 B at 10.9 KB/sec)
Downloading: http://repo1.maven.org/maven2/cog-jglobus/cog-jglobus/1.8.0_bc/cog-jglobus-1.8.0_bc.jar
Downloading: http://repo1.maven.org/maven2/org/mortbay/jetty/jetty/6.1.26/jetty-6.1.26.jar
Downloading: http://repo1.maven.org/maven2/org/apache/commons/commons-math/2.1/commons-math-2.1.jar
Downloading: http://repo1.maven.org/maven2/xmlenc/xmlenc/0.52/xmlenc-0.52.jar
Downloading: http://repo1.maven.org/maven2/org/apache/hadoop/hadoop-core/1.0.3/hadoop-core-1.0.3.jar
Downloaded: http://repo1.maven.org/maven2/org/apache/commons/commons-math/2.1/commons-math-2.1.jar
(813 KB at 11449.3 KB/sec)
Downloading: http://repo1.maven.org/maven2/org/mortbay/jetty/jetty-util/6.1.26/jetty-util-6.1.26.jar
Downloaded: http://repo1.maven.org/maven2/xmlenc/xmlenc/0.52/xmlenc-0.52.jar (15 KB at 155.9
KB/sec)
Downloading: http://repo1.maven.org/maven2/tomcat/jasper-runtime/5.5.12/jasper-runtime-5.5.12.jar
Downloaded: http://repo1.maven.org/maven2/org/mortbay/jetty/jetty/6.1.26/jetty-6.1.26.jar
(528 KB at 4666.0 KB/sec)
Downloading: http://repo1.maven.org/maven2/tomcat/jasper-compiler/5.5.12/jasper-compiler-5.5.12.jar
Downloaded: http://repo1.maven.org/maven2/org/mortbay/jetty/jetty-util/6.1.26/jetty-util-6.1.26.jar
(173 KB at 2931.9 KB/sec)
Downloading: http://repo1.maven.org/maven2/org/mortbay/jetty/jsp-api-2.1/6.1.14/jsp-api-2.1-6.1.14.jar
Downloaded: http://repo1.maven.org/maven2/tomcat/jasper-runtime/5.5.12/jasper-runtime-5.5.12.jar
(75 KB at 1117.9 KB/sec)
Downloading: http://repo1.maven.org/maven2/org/mortbay/jetty/servlet-api-2.5/6.1.14/servlet-api-2.5-6.1.14.jar
Downloading: http://repo1.maven.org/maven2/org/mortbay/jetty/jsp-2.1/6.1.14/jsp-2.1-6.1.14.jar
Downloaded: http://repo1.maven.org/maven2/org/apache/hadoop/hadoop-core/1.0.3/hadoop-core-1.0.3.jar
(3837 KB at 22835.0 KB/sec)
Downloading: http://repo1.maven.org/maven2/net/java/dev/jets3t/jets3t/0.7.1/jets3t-0.7.1.jar
Downloaded: http://repo1.maven.org/maven2/tomcat/jasper-compiler/5.5.12/jasper-compiler-5.5.12.jar
(396 KB at 6181.1 KB/sec)
Downloading: http://repo1.maven.org/maven2/net/sf/kosmosfs/kfs/0.3/kfs-0.3.jar
Downloaded: http://repo1.maven.org/maven2/org/mortbay/jetty/jsp-api-2.1/6.1.14/jsp-api-2.1-6.1.14.jar
(132 KB at 1756.6 KB/sec)
Downloading: http://repo1.maven.org/maven2/hsqldb/hsqldb/1.8.0.10/hsqldb-1.8.0.10.jar
Downloaded: http://repo1.maven.org/maven2/net/sf/kosmosfs/kfs/0.3/kfs-0.3.jar (12 KB at 225.0
KB/sec)
Downloading: http://repo1.maven.org/maven2/org/apache/hadoop/hadoop-client/1.0.3/hadoop-client-1.0.3.jar
Downloaded: http://repo1.maven.org/maven2/org/mortbay/jetty/servlet-api-2.5/6.1.14/servlet-api-2.5-6.1.14.jar
(130 KB at 1746.8 KB/sec)
Downloading: http://repo1.maven.org/maven2/org/apache/whirr/whirr-core/0.7.1/whirr-core-0.7.1.jar
Downloaded: http://repo1.maven.org/maven2/org/mortbay/jetty/jsp-2.1/6.1.14/jsp-2.1-6.1.14.jar
(1001 KB at 10107.7 KB/sec)
Downloading: http://repo1.maven.org/maven2/org/jclouds/jclouds-compute/1.2.1/jclouds-compute-1.2.1.jar
Downloaded: http://repo1.maven.org/maven2/net/java/dev/jets3t/jets3t/0.7.1/jets3t-0.7.1.jar
(369 KB at 2975.2 KB/sec)
Downloading: http://repo1.maven.org/maven2/org/jclouds/jclouds-scriptbuilder/1.2.1/jclouds-scriptbuilder-1.2.1.jar
Downloaded: http://repo1.maven.org/maven2/hsqldb/hsqldb/1.8.0.10/hsqldb-1.8.0.10.jar (691
KB at 7420.9 KB/sec)
Downloading: http://repo1.maven.org/maven2/org/jclouds/jclouds-core/1.2.1/jclouds-core-1.2.1.jar
Downloaded: http://repo1.maven.org/maven2/org/apache/hadoop/hadoop-client/1.0.3/hadoop-client-1.0.3.jar
(410 B at 2.5 KB/sec)
Downloading: http://repo1.maven.org/maven2/com/sun/jersey/jersey-core/1.6/jersey-core-1.6.jar
Downloaded: http://repo1.maven.org/maven2/com/sun/jersey/jersey-core/1.6/jersey-core-1.6.jar
(447 KB at 8431.3 KB/sec)
Downloading: http://repo1.maven.org/maven2/com/google/inject/extensions/guice-assistedinject/3.0/guice-assistedinject-3.0.jar
Downloaded: http://repo1.maven.org/maven2/com/google/inject/extensions/guice-assistedinject/3.0/guice-assistedinject-3.0.jar
(37 KB at 539.3 KB/sec)
Downloading: http://repo1.maven.org/maven2/javax/annotation/jsr250-api/1.0/jsr250-api-1.0.jar
Downloaded: http://repo1.maven.org/maven2/javax/annotation/jsr250-api/1.0/jsr250-api-1.0.jar
(6 KB at 1142.2 KB/sec)
Downloading: http://repo1.maven.org/maven2/com/google/code/gson/gson/1.7.2/gson-1.7.2.jar
Downloaded: http://repo1.maven.org/maven2/org/jclouds/jclouds-compute/1.2.1/jclouds-compute-1.2.1.jar
(372 KB at 871.3 KB/sec)
Downloading: http://repo1.maven.org/maven2/org/jclouds/api/byon/1.2.1/byon-1.2.1.jar
Downloaded: http://repo1.maven.org/maven2/org/apache/whirr/whirr-core/0.7.1/whirr-core-0.7.1.jar
(163 KB at 347.9 KB/sec)
Downloading: http://repo1.maven.org/maven2/org/yaml/snakeyaml/1.8/snakeyaml-1.8.jar
Downloaded: http://repo1.maven.org/maven2/org/yaml/snakeyaml/1.8/snakeyaml-1.8.jar (252 KB
at 4194.9 KB/sec)
Downloading: http://repo1.maven.org/maven2/org/jclouds/driver/jclouds-enterprise/1.2.1/jclouds-enterprise-1.2.1.jar
Downloaded: http://repo1.maven.org/maven2/com/google/code/gson/gson/1.7.2/gson-1.7.2.jar (170
KB at 662.3 KB/sec)
Downloading: http://repo1.maven.org/maven2/org/jclouds/driver/jclouds-joda/1.2.1/jclouds-joda-1.2.1.jar
Downloaded: http://repo1.maven.org/maven2/org/jclouds/jclouds-scriptbuilder/1.2.1/jclouds-scriptbuilder-1.2.1.jar
(100 KB at 205.8 KB/sec)
Downloading: http://repo1.maven.org/maven2/org/jclouds/driver/jclouds-netty/1.2.1/jclouds-netty-1.2.1.jar
Downloaded: http://repo1.maven.org/maven2/org/jclouds/jclouds-core/1.2.1/jclouds-core-1.2.1.jar
(709 KB at 1286.0 KB/sec)
Downloading: http://repo1.maven.org/maven2/org/jboss/netty/netty/3.2.4.Final/netty-3.2.4.Final.jar
Downloaded: http://repo1.maven.org/maven2/org/jboss/netty/netty/3.2.4.Final/netty-3.2.4.Final.jar
(772 KB at 7566.0 KB/sec)
Downloading: http://repo1.maven.org/maven2/org/jclouds/driver/jclouds-bouncycastle/1.2.1/jclouds-bouncycastle-1.2.1.jar
Downloaded: http://repo1.maven.org/maven2/org/jclouds/api/byon/1.2.1/byon-1.2.1.jar (51 KB
at 135.5 KB/sec)
Downloading: http://repo1.maven.org/maven2/org/jclouds/driver/jclouds-sshj/1.2.1/jclouds-sshj-1.2.1.jar
Downloaded: http://repo1.maven.org/maven2/org/jclouds/driver/jclouds-joda/1.2.1/jclouds-joda-1.2.1.jar
(11 KB at 30.2 KB/sec)
Downloading: http://repo1.maven.org/maven2/org/jclouds/driver/jclouds-slf4j/1.2.1/jclouds-slf4j-1.2.1.jar
Downloaded: http://repo1.maven.org/maven2/org/jclouds/driver/jclouds-enterprise/1.2.1/jclouds-enterprise-1.2.1.jar
(10 KB at 24.8 KB/sec)
Downloading: http://repo1.maven.org/maven2/org/jclouds/jclouds-allcompute/1.2.1/jclouds-allcompute-1.2.1.jar
Downloaded: http://repo1.maven.org/maven2/org/jclouds/driver/jclouds-netty/1.2.1/jclouds-netty-1.2.1.jar
(12 KB at 25.1 KB/sec)
Downloading: http://repo1.maven.org/maven2/org/jclouds/provider/greenhousedata-element-vcloud/1.2.1/greenhousedata-element-vcloud-1.2.1.jar
Downloaded: http://repo1.maven.org/maven2/org/jclouds/driver/jclouds-bouncycastle/1.2.1/jclouds-bouncycastle-1.2.1.jar
(11 KB at 22.4 KB/sec)
Downloading: http://repo1.maven.org/maven2/org/jclouds/provider/savvis-symphonyvpdc/1.2.1/savvis-symphonyvpdc-1.2.1.jar
Downloaded: http://repo1.maven.org/maven2/org/jclouds/jclouds-allcompute/1.2.1/jclouds-allcompute-1.2.1.jar
(8 KB at 23.4 KB/sec)
Downloading: http://repo1.maven.org/maven2/com/jamesmurty/utils/java-xmlbuilder/0.3/java-xmlbuilder-0.3.jar
Downloaded: http://repo1.maven.org/maven2/org/jclouds/driver/jclouds-sshj/1.2.1/jclouds-sshj-1.2.1.jar
(28 KB at 64.4 KB/sec)
Downloading: http://repo1.maven.org/maven2/org/jclouds/provider/eucalyptus-partnercloud-ec2/1.2.1/eucalyptus-partnercloud-ec2-1.2.1.jar
Downloaded: http://repo1.maven.org/maven2/org/jclouds/driver/jclouds-slf4j/1.2.1/jclouds-slf4j-1.2.1.jar
(11 KB at 27.3 KB/sec)
Downloading: http://repo1.maven.org/maven2/org/jclouds/api/eucalyptus/1.2.1/eucalyptus-1.2.1.jar
Downloaded: http://repo1.maven.org/maven2/com/jamesmurty/utils/java-xmlbuilder/0.3/java-xmlbuilder-0.3.jar
(18 KB at 103.4 KB/sec)
Downloading: http://repo1.maven.org/maven2/org/jclouds/api/deltacloud/1.2.1/deltacloud-1.2.1.jar
Downloaded: http://repo1.maven.org/maven2/org/jclouds/provider/greenhousedata-element-vcloud/1.2.1/greenhousedata-element-vcloud-1.2.1.jar
(14 KB at 32.6 KB/sec)
Downloading: http://repo1.maven.org/maven2/org/jclouds/provider/aws-ec2/1.2.1/aws-ec2-1.2.1.jar
Downloaded: http://repo1.maven.org/maven2/org/jclouds/api/eucalyptus/1.2.1/eucalyptus-1.2.1.jar
(10 KB at 9.9 KB/sec)
Downloading: http://repo1.maven.org/maven2/org/jclouds/common/aws-common/1.2.1/aws-common-1.2.1.jar
Downloaded: http://repo1.maven.org/maven2/org/jclouds/provider/eucalyptus-partnercloud-ec2/1.2.1/eucalyptus-partnercloud-ec2-1.2.1.jar
(15 KB at 15.4 KB/sec)
Downloading: http://repo1.maven.org/maven2/org/jclouds/provider/rimuhosting/1.2.1/rimuhosting-1.2.1.jar
Downloaded: http://repo1.maven.org/maven2/org/jclouds/provider/savvis-symphonyvpdc/1.2.1/savvis-symphonyvpdc-1.2.1.jar
(146 KB at 123.1 KB/sec)
Downloading: http://repo1.maven.org/maven2/org/jclouds/api/nova/1.2.1/nova-1.2.1.jar
Downloaded: http://repo1.maven.org/maven2/org/jclouds/api/deltacloud/1.2.1/deltacloud-1.2.1.jar
(97 KB at 90.6 KB/sec)
Downloading: http://repo1.maven.org/maven2/org/jclouds/common/openstack-common/1.2.1/openstack-common-1.2.1.jar
Downloaded: http://repo1.maven.org/maven2/org/jclouds/common/aws-common/1.2.1/aws-common-1.2.1.jar
(40 KB at 105.0 KB/sec)
Downloading: http://repo1.maven.org/maven2/org/jclouds/api/ec2/1.2.1/ec2-1.2.1.jar
Downloaded: http://repo1.maven.org/maven2/org/jclouds/provider/aws-ec2/1.2.1/aws-ec2-1.2.1.jar
(183 KB at 152.2 KB/sec)
Downloading: http://repo1.maven.org/maven2/org/jclouds/provider/cloudservers-us/1.2.1/cloudservers-us-1.2.1.jar
Downloaded: http://repo1.maven.org/maven2/org/jclouds/provider/rimuhosting/1.2.1/rimuhosting-1.2.1.jar
(92 KB at 202.2 KB/sec)
Downloading: http://repo1.maven.org/maven2/org/jclouds/provider/cloudservers-uk/1.2.1/cloudservers-uk-1.2.1.jar
Downloaded: http://repo1.maven.org/maven2/org/jclouds/common/openstack-common/1.2.1/openstack-common-1.2.1.jar
(23 KB at 72.7 KB/sec)
Downloading: http://repo1.maven.org/maven2/org/jclouds/api/cloudservers/1.2.1/cloudservers-1.2.1.jar
Downloaded: http://repo1.maven.org/maven2/org/jclouds/api/nova/1.2.1/nova-1.2.1.jar (75 KB
at 131.5 KB/sec)
Downloading: http://repo1.maven.org/maven2/org/jclouds/api/vcloud/1.2.1/vcloud-1.2.1.jar
Downloaded: http://repo1.maven.org/maven2/org/jclouds/provider/cloudservers-us/1.2.1/cloudservers-us-1.2.1.jar
(11 KB at 35.4 KB/sec)
Downloading: http://repo1.maven.org/maven2/org/jclouds/api/cloudsigma/1.2.1/cloudsigma-1.2.1.jar
Downloaded: http://repo1.maven.org/maven2/org/jclouds/api/ec2/1.2.1/ec2-1.2.1.jar (300 KB
at 594.4 KB/sec)
Downloading: http://repo1.maven.org/maven2/org/jclouds/provider/trmk-vcloudexpress/1.2.1/trmk-vcloudexpress-1.2.1.jar
Downloaded: http://repo1.maven.org/maven2/org/jclouds/api/cloudservers/1.2.1/cloudservers-1.2.1.jar
(84 KB at 239.9 KB/sec)
Downloading: http://repo1.maven.org/maven2/org/jclouds/common/trmk-common/1.2.1/trmk-common-1.2.1.jar
Downloaded: http://repo1.maven.org/maven2/org/jclouds/provider/cloudservers-uk/1.2.1/cloudservers-uk-1.2.1.jar
(11 KB at 22.6 KB/sec)
Downloading: http://repo1.maven.org/maven2/org/jclouds/provider/trmk-ecloud/1.2.1/trmk-ecloud-1.2.1.jar
Downloaded: http://repo1.maven.org/maven2/org/jclouds/api/cloudsigma/1.2.1/cloudsigma-1.2.1.jar
(159 KB at 283.4 KB/sec)
Downloading: http://repo1.maven.org/maven2/org/jclouds/provider/bluelock-vcloud-zone01/1.2.1/bluelock-vcloud-zone01-1.2.1.jar
Downloaded: http://repo1.maven.org/maven2/org/jclouds/provider/trmk-ecloud/1.2.1/trmk-ecloud-1.2.1.jar
(35 KB at 100.6 KB/sec)
Downloading: http://repo1.maven.org/maven2/org/jclouds/provider/stratogen-vcloud-mycloud/1.2.1/stratogen-vcloud-mycloud-1.2.1.jar
Downloaded: http://repo1.maven.org/maven2/org/jclouds/api/vcloud/1.2.1/vcloud-1.2.1.jar (365
KB at 596.0 KB/sec)
Downloading: http://repo1.maven.org/maven2/org/jclouds/provider/gogrid/1.2.1/gogrid-1.2.1.jar
Downloaded: http://repo1.maven.org/maven2/org/jclouds/common/trmk-common/1.2.1/trmk-common-1.2.1.jar
(339 KB at 812.8 KB/sec)
Downloading: http://repo1.maven.org/maven2/org/jclouds/provider/slicehost/1.2.1/slicehost-1.2.1.jar
Downloaded: http://repo1.maven.org/maven2/org/jclouds/provider/trmk-vcloudexpress/1.2.1/trmk-vcloudexpress-1.2.1.jar
(19 KB at 33.2 KB/sec)
Downloading: http://repo1.maven.org/maven2/org/jclouds/api/elasticstack/1.2.1/elasticstack-1.2.1.jar
Downloaded: http://repo1.maven.org/maven2/org/jclouds/provider/stratogen-vcloud-mycloud/1.2.1/stratogen-vcloud-mycloud-1.2.1.jar
(14 KB at 41.7 KB/sec)
Downloading: http://repo1.maven.org/maven2/org/jclouds/provider/elastichosts-lon-p/1.2.1/elastichosts-lon-p-1.2.1.jar
Downloaded: http://repo1.maven.org/maven2/org/jclouds/provider/bluelock-vcloud-zone01/1.2.1/bluelock-vcloud-zone01-1.2.1.jar
(13 KB at 37.2 KB/sec)
Downloading: http://repo1.maven.org/maven2/org/jclouds/provider/elastichosts-sat-p/1.2.1/elastichosts-sat-p-1.2.1.jar
Downloaded: http://repo1.maven.org/maven2/org/jclouds/provider/slicehost/1.2.1/slicehost-1.2.1.jar
(72 KB at 205.3 KB/sec)
Downloading: http://repo1.maven.org/maven2/org/jclouds/provider/elastichosts-lon-b/1.2.1/elastichosts-lon-b-1.2.1.jar
Downloaded: http://repo1.maven.org/maven2/org/jclouds/api/elasticstack/1.2.1/elasticstack-1.2.1.jar
(137 KB at 375.3 KB/sec)
Downloading: http://repo1.maven.org/maven2/org/jclouds/provider/openhosting-east1/1.2.1/openhosting-east1-1.2.1.jar
Downloaded: http://repo1.maven.org/maven2/org/jclouds/provider/gogrid/1.2.1/gogrid-1.2.1.jar
(149 KB at 264.8 KB/sec)
Downloading: http://repo1.maven.org/maven2/org/jclouds/provider/serverlove-z1-man/1.2.1/serverlove-z1-man-1.2.1.jar
Downloaded: http://repo1.maven.org/maven2/org/jclouds/provider/elastichosts-lon-p/1.2.1/elastichosts-lon-p-1.2.1.jar
(12 KB at 25.8 KB/sec)
Downloading: http://repo1.maven.org/maven2/org/jclouds/provider/skalicloud-sdg-my/1.2.1/skalicloud-sdg-my-1.2.1.jar
Downloaded: http://repo1.maven.org/maven2/org/jclouds/provider/elastichosts-sat-p/1.2.1/elastichosts-sat-p-1.2.1.jar
(12 KB at 25.7 KB/sec)
Downloading: http://repo1.maven.org/maven2/org/jclouds/provider/cloudsigma-zrh/1.2.1/cloudsigma-zrh-1.2.1.jar
Downloaded: http://repo1.maven.org/maven2/org/jclouds/provider/openhosting-east1/1.2.1/openhosting-east1-1.2.1.jar
(13 KB at 38.0 KB/sec)
Downloading: http://repo1.maven.org/maven2/org/jclouds/provider/cloudsigma-lvs/1.2.1/cloudsigma-lvs-1.2.1.jar
Downloaded: http://repo1.maven.org/maven2/org/jclouds/provider/elastichosts-lon-b/1.2.1/elastichosts-lon-b-1.2.1.jar
(12 KB at 23.0 KB/sec)
Downloading: http://repo1.maven.org/maven2/org/jclouds/provider/go2cloud-jhb1/1.2.1/go2cloud-jhb1-1.2.1.jar
Downloaded: http://repo1.maven.org/maven2/org/jclouds/provider/serverlove-z1-man/1.2.1/serverlove-z1-man-1.2.1.jar
(13 KB at 40.8 KB/sec)
Downloading: http://repo1.maven.org/maven2/org/jclouds/provider/softlayer/1.2.1/softlayer-1.2.1.jar
Downloaded: http://repo1.maven.org/maven2/org/jclouds/provider/skalicloud-sdg-my/1.2.1/skalicloud-sdg-my-1.2.1.jar
(13 KB at 41.5 KB/sec)
Downloading: http://repo1.maven.org/maven2/org/jclouds/jclouds-allblobstore/1.2.1/jclouds-allblobstore-1.2.1.jar
Downloaded: http://repo1.maven.org/maven2/org/jclouds/provider/cloudsigma-lvs/1.2.1/cloudsigma-lvs-1.2.1.jar
(16 KB at 46.4 KB/sec)
Downloading: http://repo1.maven.org/maven2/org/jclouds/api/s3/1.2.1/s3-1.2.1.jar
Downloaded: http://repo1.maven.org/maven2/org/jclouds/provider/cloudsigma-zrh/1.2.1/cloudsigma-zrh-1.2.1.jar
(27 KB at 57.6 KB/sec)
Downloading: http://repo1.maven.org/maven2/org/jclouds/jclouds-blobstore/1.2.1/jclouds-blobstore-1.2.1.jar
Downloaded: http://repo1.maven.org/maven2/org/jclouds/provider/softlayer/1.2.1/softlayer-1.2.1.jar
(123 KB at 307.3 KB/sec)
Downloading: http://repo1.maven.org/maven2/org/jclouds/provider/aws-s3/1.2.1/aws-s3-1.2.1.jar
Downloaded: http://repo1.maven.org/maven2/org/jclouds/provider/go2cloud-jhb1/1.2.1/go2cloud-jhb1-1.2.1.jar
(13 KB at 29.7 KB/sec)
Downloading: http://repo1.maven.org/maven2/org/jclouds/provider/ninefold-storage/1.2.1/ninefold-storage-1.2.1.jar
Downloaded: http://repo1.maven.org/maven2/org/jclouds/jclouds-allblobstore/1.2.1/jclouds-allblobstore-1.2.1.jar
(8 KB at 23.7 KB/sec)
Downloading: http://repo1.maven.org/maven2/org/jclouds/provider/synaptic-storage/1.2.1/synaptic-storage-1.2.1.jar
Downloaded: http://repo1.maven.org/maven2/org/jclouds/api/s3/1.2.1/s3-1.2.1.jar (135 KB at
312.4 KB/sec)
Downloading: http://repo1.maven.org/maven2/org/jclouds/provider/cloudonestorage/1.2.1/cloudonestorage-1.2.1.jar
Downloaded: http://repo1.maven.org/maven2/org/jclouds/provider/aws-s3/1.2.1/aws-s3-1.2.1.jar
(45 KB at 137.4 KB/sec)
Downloading: http://repo1.maven.org/maven2/org/jclouds/api/walrus/1.2.1/walrus-1.2.1.jar
Downloaded: http://repo1.maven.org/maven2/org/jclouds/provider/ninefold-storage/1.2.1/ninefold-storage-1.2.1.jar
(11 KB at 33.4 KB/sec)
Downloading: http://repo1.maven.org/maven2/org/jclouds/provider/eucalyptus-partnercloud-s3/1.2.1/eucalyptus-partnercloud-s3-1.2.1.jar
Downloaded: http://repo1.maven.org/maven2/org/jclouds/jclouds-blobstore/1.2.1/jclouds-blobstore-1.2.1.jar
(191 KB at 386.0 KB/sec)
Downloading: http://repo1.maven.org/maven2/org/jclouds/provider/azureblob/1.2.1/azureblob-1.2.1.jar
Downloaded: http://repo1.maven.org/maven2/org/jclouds/provider/synaptic-storage/1.2.1/synaptic-storage-1.2.1.jar
(11 KB at 30.8 KB/sec)
Downloading: http://repo1.maven.org/maven2/org/jclouds/common/azure-common/1.2.1/azure-common-1.2.1.jar
Downloaded: http://repo1.maven.org/maven2/org/jclouds/provider/eucalyptus-partnercloud-s3/1.2.1/eucalyptus-partnercloud-s3-1.2.1.jar
(11 KB at 31.8 KB/sec)
Downloading: http://repo1.maven.org/maven2/org/jclouds/api/atmos/1.2.1/atmos-1.2.1.jar
Downloaded: http://repo1.maven.org/maven2/org/jclouds/api/walrus/1.2.1/walrus-1.2.1.jar (12
KB at 30.0 KB/sec)
Downloading: http://repo1.maven.org/maven2/org/jclouds/api/swift/1.2.1/swift-1.2.1.jar
Downloaded: http://repo1.maven.org/maven2/org/jclouds/provider/cloudonestorage/1.2.1/cloudonestorage-1.2.1.jar
(11 KB at 22.9 KB/sec)
Downloading: http://repo1.maven.org/maven2/org/jclouds/api/cloudfiles/1.2.1/cloudfiles-1.2.1.jar
Downloaded: http://repo1.maven.org/maven2/org/jclouds/provider/azureblob/1.2.1/azureblob-1.2.1.jar
(86 KB at 257.3 KB/sec)
Downloading: http://repo1.maven.org/maven2/org/jclouds/provider/cloudfiles-us/1.2.1/cloudfiles-us-1.2.1.jar
Downloaded: http://repo1.maven.org/maven2/org/jclouds/api/atmos/1.2.1/atmos-1.2.1.jar (99
KB at 269.7 KB/sec)
Downloaded: http://repo1.maven.org/maven2/org/jclouds/api/swift/1.2.1/swift-1.2.1.jar (76
KB at 220.9 KB/sec)
Downloading: http://repo1.maven.org/maven2/org/jclouds/provider/cloudfiles-uk/1.2.1/cloudfiles-uk-1.2.1.jar
Downloading: http://repo1.maven.org/maven2/org/jclouds/api/filesystem/1.2.1/filesystem-1.2.1.jar
Downloaded: http://repo1.maven.org/maven2/org/jclouds/api/cloudfiles/1.2.1/cloudfiles-1.2.1.jar
(30 KB at 87.0 KB/sec)
Downloading: http://repo1.maven.org/maven2/org/apache/whirr/whirr-hadoop/0.7.1/whirr-hadoop-0.7.1.jar
Downloaded: http://repo1.maven.org/maven2/org/jclouds/provider/cloudfiles-us/1.2.1/cloudfiles-us-1.2.1.jar
(11 KB at 27.6 KB/sec)
Downloading: http://repo1.maven.org/maven2/org/hamcrest/hamcrest-all/1.1/hamcrest-all-1.1.jar
Downloaded: http://repo1.maven.org/maven2/org/jclouds/common/azure-common/1.2.1/azure-common-1.2.1.jar
(34 KB at 44.3 KB/sec)
Downloading: http://repo1.maven.org/maven2/org/mockito/mockito-all/1.8.5/mockito-all-1.8.5.jar
Downloaded: http://repo1.maven.org/maven2/org/hamcrest/hamcrest-all/1.1/hamcrest-all-1.1.jar
(530 KB at 8267.8 KB/sec)
Downloading: http://repo1.maven.org/maven2/net/sf/jopt-simple/jopt-simple/3.2/jopt-simple-3.2.jar
Downloaded: http://repo1.maven.org/maven2/org/mockito/mockito-all/1.8.5/mockito-all-1.8.5.jar
(1387 KB at 18737.7 KB/sec)
Downloaded: http://repo1.maven.org/maven2/org/jclouds/provider/cloudfiles-uk/1.2.1/cloudfiles-uk-1.2.1.jar
(11 KB at 33.6 KB/sec)
Downloaded: http://repo1.maven.org/maven2/org/jclouds/api/filesystem/1.2.1/filesystem-1.2.1.jar
(47 KB at 122.7 KB/sec)
Downloaded: http://repo1.maven.org/maven2/net/sf/jopt-simple/jopt-simple/3.2/jopt-simple-3.2.jar
(52 KB at 206.3 KB/sec)
Downloaded: http://repo1.maven.org/maven2/org/apache/whirr/whirr-hadoop/0.7.1/whirr-hadoop-0.7.1.jar
(33 KB at 81.8 KB/sec)
Downloading: http://community.ucs.indiana.edu:9090/archiva/repository/ogce.m2.all/cog-jglobus/cog-jglobus/1.8.0_bc/cog-jglobus-1.8.0_bc.jar
[WARNING] Checksum validation failed, expected 21d62647581d94a7b56398934262d19d4d23a123 but
is a6a051abb41857eeaa33579a963f82c5c9897c5e for http://community.ucs.indiana.edu:9090/archiva/repository/ogce.m2.all/cog-jglobus/cog-jglobus/1.8.0_bc/cog-jglobus-1.8.0_bc.jar
[WARNING] Checksum validation failed, expected 21d62647581d94a7b56398934262d19d4d23a123 but
is a6a051abb41857eeaa33579a963f82c5c9897c5e for http://community.ucs.indiana.edu:9090/archiva/repository/ogce.m2.all/cog-jglobus/cog-jglobus/1.8.0_bc/cog-jglobus-1.8.0_bc.jar
Downloaded: http://community.ucs.indiana.edu:9090/archiva/repository/ogce.m2.all/cog-jglobus/cog-jglobus/1.8.0_bc/cog-jglobus-1.8.0_bc.jar
(1018 KB at 136.7 KB/sec)
[INFO] 
[INFO] --- maven-clean-plugin:2.5:clean (default-clean) @ airavata-gfac-core ---
[INFO] 
[INFO] --- maven-resources-plugin:2.5:copy-resources (copy-resources) @ airavata-gfac-core
---[debug] execute contextualize
[INFO] Using 'UTF-8' encoding to copy filtered resources.
[INFO] skip non existing resourceDirectory <https://builds.apache.org/job/Apache%20Airavata/org.apache.airavata$airavata-gfac-core/ws/src/main/assembly/dist>

[INFO] 
[INFO] --- maven-remote-resources-plugin:1.4:process (default) @ airavata-gfac-core ---
Downloading: http://repo1.maven.org/maven2/net/sf/saxon/saxon/9/saxon-9.pom
Downloading: http://community.ucs.indiana.edu:9090/archiva/repository/ogce.m2.all/net/sf/saxon/saxon/9/saxon-9.pom
Downloading: http://cilogon.svn.sourceforge.net/viewvc/cilogon/m2-repo/snapshots/net/sf/saxon/saxon/9/saxon-9.pom
Downloading: http://people.apache.org/repo/m2-snapshot-repository/net/sf/saxon/saxon/9/saxon-9.pom
Downloading: http://unicore-dev.zam.kfa-juelich.de/maven/net/sf/saxon/saxon/9/saxon-9.pom
[WARNING] Missing POM for net.sf.saxon:saxon:jar:9
[INFO] 
[INFO] --- maven-resources-plugin:2.5:resources (default-resources) @ airavata-gfac-core ---[debug]
execute contextualize
[INFO] Using 'UTF-8' encoding to copy filtered resources.

[INFO] Copying 1 resource
[INFO] Copying 3 resources
[INFO] 
[INFO] --- maven-compiler-plugin:2.3.2:compile (default-compile) @ airavata-gfac-core ---
[INFO] Compiling 140 source files to <https://builds.apache.org/job/Apache%20Airavata/org.apache.airavata$airavata-gfac-core/ws/target/classes>
[INFO] -------------------------------------------------------------
[WARNING] COMPILATION WARNING : 
[INFO] -------------------------------------------------------------
[WARNING] <https://builds.apache.org/job/Apache%20Airavata/org.apache.airavata$airavata-gfac-core/ws/src/main/java/org/apache/airavata/gfac/GFacConfiguration.java>:[4,47]
com.sun.org.apache.bcel.internal.generic.NEW is Sun proprietary API and may be removed in
a future release
[INFO] 1 warning
[INFO] -------------------------------------------------------------
[INFO] -------------------------------------------------------------
[ERROR] COMPILATION ERROR : 
[INFO] -------------------------------------------------------------
[ERROR] <https://builds.apache.org/job/Apache%20Airavata/org.apache.airavata$airavata-gfac-core/ws/src/main/java/org/apache/airavata/gfac/provider/utils/ApplicationProcessor.java>:[16,46]
package org.ogf.schemas.jsdl.x2007.x02.jsdlSpmd does not exist
[ERROR] <https://builds.apache.org/job/Apache%20Airavata/org.apache.airavata$airavata-gfac-core/ws/src/main/java/org/apache/airavata/gfac/provider/utils/ApplicationProcessor.java>:[17,46]
package org.ogf.schemas.jsdl.x2007.x02.jsdlSpmd does not exist
[ERROR] <https://builds.apache.org/job/Apache%20Airavata/org.apache.airavata$airavata-gfac-core/ws/src/main/java/org/apache/airavata/gfac/provider/utils/ApplicationProcessor.java>:[18,46]
package org.ogf.schemas.jsdl.x2007.x02.jsdlSpmd does not exist
[ERROR] <https://builds.apache.org/job/Apache%20Airavata/org.apache.airavata$airavata-gfac-core/ws/src/main/java/org/apache/airavata/gfac/provider/utils/JSDLUtils.java>:[30,46]
package org.ogf.schemas.jsdl.x2007.x02.jsdlSpmd does not exist
[ERROR] <https://builds.apache.org/job/Apache%20Airavata/org.apache.airavata$airavata-gfac-core/ws/src/main/java/org/apache/airavata/gfac/provider/utils/JSDLUtils.java>:[31,46]
package org.ogf.schemas.jsdl.x2007.x02.jsdlSpmd does not exist
[ERROR] <https://builds.apache.org/job/Apache%20Airavata/org.apache.airavata$airavata-gfac-core/ws/src/main/java/org/apache/airavata/gfac/provider/utils/JSDLUtils.java>:[283,15]
cannot find symbol
symbol  : class SPMDApplicationType
location: class org.apache.airavata.gfac.provider.utils.JSDLUtils
[ERROR] <https://builds.apache.org/job/Apache%20Airavata/org.apache.airavata$airavata-gfac-core/ws/src/main/java/org/apache/airavata/gfac/provider/utils/JSDLUtils.java>:[296,15]
cannot find symbol
symbol  : class SPMDApplicationType
location: class org.apache.airavata.gfac.provider.utils.JSDLUtils
[ERROR] <https://builds.apache.org/job/Apache%20Airavata/org.apache.airavata$airavata-gfac-core/ws/src/main/java/org/apache/airavata/gfac/provider/utils/ApplicationProcessor.java>:[63,5]
cannot find symbol
symbol  : class NumberOfProcessesType
location: class org.apache.airavata.gfac.provider.utils.ApplicationProcessor
[ERROR] <https://builds.apache.org/job/Apache%20Airavata/org.apache.airavata$airavata-gfac-core/ws/src/main/java/org/apache/airavata/gfac/provider/utils/ApplicationProcessor.java>:[63,54]
package NumberOfProcessesType does not exist
[ERROR] <https://builds.apache.org/job/Apache%20Airavata/org.apache.airavata$airavata-gfac-core/ws/src/main/java/org/apache/airavata/gfac/provider/utils/ApplicationProcessor.java>:[69,5]
cannot find symbol
symbol  : class ProcessesPerHostType
location: class org.apache.airavata.gfac.provider.utils.ApplicationProcessor
[ERROR] <https://builds.apache.org/job/Apache%20Airavata/org.apache.airavata$airavata-gfac-core/ws/src/main/java/org/apache/airavata/gfac/provider/utils/ApplicationProcessor.java>:[69,52]
package ProcessesPerHostType does not exist
[ERROR] <https://builds.apache.org/job/Apache%20Airavata/org.apache.airavata$airavata-gfac-core/ws/src/main/java/org/apache/airavata/gfac/provider/utils/ApplicationProcessor.java>:[75,5]
cannot find symbol
symbol  : class ThreadsPerProcessType
location: class org.apache.airavata.gfac.provider.utils.ApplicationProcessor
[ERROR] <https://builds.apache.org/job/Apache%20Airavata/org.apache.airavata$airavata-gfac-core/ws/src/main/java/org/apache/airavata/gfac/provider/utils/ApplicationProcessor.java>:[75,54]
package ThreadsPerProcessType does not exist
[ERROR] <https://builds.apache.org/job/Apache%20Airavata/org.apache.airavata$airavata-gfac-core/ws/src/main/java/org/apache/airavata/gfac/provider/utils/JSDLUtils.java>:[50,67]
package SPMDApplicationDocument does not exist
[ERROR] <https://builds.apache.org/job/Apache%20Airavata/org.apache.airavata$airavata-gfac-core/ws/src/main/java/org/apache/airavata/gfac/provider/utils/JSDLUtils.java>:[306,14]
cannot find symbol
symbol  : class SPMDApplicationType
location: class org.apache.airavata.gfac.provider.utils.JSDLUtils
[INFO] 15 errors 
[INFO] -------------------------------------------------------------

Mime
View raw message