airavata-dev mailing list archives

Site index · List index
Message view « Date » · « Thread »
Top « Date » · « Thread »
From Apache Jenkins Server <jenk...@builds.apache.org>
Subject Build failed in Jenkins: Apache Airavata #1028
Date Sat, 26 Jan 2013 03:30:23 GMT
See <https://builds.apache.org/job/Apache%20Airavata/1028/changes>

Changes:

[samindaw] [maven-release-plugin] prepare for next development iteration

[samindaw] [maven-release-plugin] prepare release airavata-0.6

------------------------------------------
[...truncated 4205 lines...]
Downloading: http://people.apache.org/repo/m2-snapshot-repository/pl/edu/icm/saml/samly2/1.3.6/samly2-1.3.6.jar
Downloading: http://people.apache.org/repo/m2-snapshot-repository/eu/unicore/security/SAMLtypes/1.2/SAMLtypes-1.2.jar
Downloading: http://people.apache.org/repo/m2-snapshot-repository/eu/unicore/security/crl-checking/1.4/crl-checking-1.4.jar
Downloading: http://people.apache.org/repo/m2-snapshot-repository/eu/unicore/uftp/1.2.1/uftp-1.2.1.jar
Downloading: http://unicore-dev.zam.kfa-juelich.de/maven/eu/unicore/ogsabes-types/1.5.1-rc3/ogsabes-types-1.5.1-rc3.jar
Downloading: http://unicore-dev.zam.kfa-juelich.de/maven/de/fzj/unicore/jsdl-xmlbeans/2.1.0/jsdl-xmlbeans-2.1.0.jar
Downloading: http://unicore-dev.zam.kfa-juelich.de/maven/net/schmizz/sshj/0.5.0/sshj-0.5.0.jar
Downloading: http://unicore-dev.zam.kfa-juelich.de/maven/eu/unicore/ogsabes-client/1.5.1-rc3/ogsabes-client-1.5.1-rc3.jar
Downloading: http://unicore-dev.zam.kfa-juelich.de/maven/eu/unicore/uas-client/1.5.1-rc3/uas-client-1.5.1-rc3.jar
Downloading: http://unicore-dev.zam.kfa-juelich.de/maven/eu/unicore/cis-u6-infoprovider-types/1.5.1-rc3/cis-u6-infoprovider-types-1.5.1-rc3.jar
Downloaded: http://unicore-dev.zam.kfa-juelich.de/maven/eu/unicore/ogsabes-client/1.5.1-rc3/ogsabes-client-1.5.1-rc3.jar
(27 KB at 499.7 KB/sec)
Downloading: http://unicore-dev.zam.kfa-juelich.de/maven/eu/unicore/uas-types/1.5.1-rc3/uas-types-1.5.1-rc3.jar
Downloaded: http://unicore-dev.zam.kfa-juelich.de/maven/eu/unicore/uas-client/1.5.1-rc3/uas-client-1.5.1-rc3.jar
(142 KB at 1361.7 KB/sec)
Downloading: http://unicore-dev.zam.kfa-juelich.de/maven/eu/unicore/services/use-wsrfclient/2.1.1/use-wsrfclient-2.1.1.jar
[WARNING] Checksum validation failed, expected 659c48dd7183b7264213ebd577dbe146f86e3eb8 but
is 0b92259737f3fe45ecf89318916108742f094538 for http://unicore-dev.zam.kfa-juelich.de/maven/eu/unicore/services/use-wsrfclient/2.1.1/use-wsrfclient-2.1.1.jar
Downloaded: http://unicore-dev.zam.kfa-juelich.de/maven/eu/unicore/ogsabes-types/1.5.1-rc3/ogsabes-types-1.5.1-rc3.jar
(372 KB at 2334.3 KB/sec)
Downloading: http://unicore-dev.zam.kfa-juelich.de/maven/net/sf/saxon/saxon-dom/9.1.0.8/saxon-dom-9.1.0.8.jar
[WARNING] Checksum validation failed, expected 659c48dd7183b7264213ebd577dbe146f86e3eb8 but
is 0b92259737f3fe45ecf89318916108742f094538 for http://unicore-dev.zam.kfa-juelich.de/maven/eu/unicore/services/use-wsrfclient/2.1.1/use-wsrfclient-2.1.1.jar
Downloaded: http://unicore-dev.zam.kfa-juelich.de/maven/eu/unicore/services/use-wsrfclient/2.1.1/use-wsrfclient-2.1.1.jar
(86 KB at 1105.3 KB/sec)
Downloading: http://unicore-dev.zam.kfa-juelich.de/maven/net/sf/saxon/saxon-xpath/9.1.0.8/saxon-xpath-9.1.0.8.jar
Downloaded: http://unicore-dev.zam.kfa-juelich.de/maven/net/sf/saxon/saxon-xpath/9.1.0.8/saxon-xpath-9.1.0.8.jar
(46 KB at 1203.8 KB/sec)
Downloading: http://unicore-dev.zam.kfa-juelich.de/maven/eu/unicore/security/secutils-xfire/1.1.0/secutils-xfire-1.1.0.jar
Downloaded: http://unicore-dev.zam.kfa-juelich.de/maven/net/sf/saxon/saxon-dom/9.1.0.8/saxon-dom-9.1.0.8.jar
(127 KB at 2035.6 KB/sec)
Downloading: http://unicore-dev.zam.kfa-juelich.de/maven/eu/unicore/security/securityLibrary/2.1.1/securityLibrary-2.1.1.jar
Downloaded: http://unicore-dev.zam.kfa-juelich.de/maven/eu/unicore/security/secutils-xfire/1.1.0/secutils-xfire-1.1.0.jar
(69 KB at 1752.2 KB/sec)
Downloading: http://unicore-dev.zam.kfa-juelich.de/maven/pl/edu/icm/saml/samly2/1.3.6/samly2-1.3.6.jar
[WARNING] Checksum validation failed, expected 2f3b74c4c1134f059e1d8d676a5eb7fdb9444da5 but
is 8d33fe335468ec292b36600ea56a3498d3000928 for http://unicore-dev.zam.kfa-juelich.de/maven/eu/unicore/security/securityLibrary/2.1.1/securityLibrary-2.1.1.jar
[WARNING] Checksum validation failed, expected 2f3b74c4c1134f059e1d8d676a5eb7fdb9444da5 but
is 8d33fe335468ec292b36600ea56a3498d3000928 for http://unicore-dev.zam.kfa-juelich.de/maven/eu/unicore/security/securityLibrary/2.1.1/securityLibrary-2.1.1.jar
Downloaded: http://unicore-dev.zam.kfa-juelich.de/maven/eu/unicore/security/securityLibrary/2.1.1/securityLibrary-2.1.1.jar
(73 KB at 944.9 KB/sec)
Downloading: http://unicore-dev.zam.kfa-juelich.de/maven/eu/unicore/security/SAMLtypes/1.2/SAMLtypes-1.2.jar
[WARNING] Checksum validation failed, expected 339cb3933b390870713fb9f9438c5ae61aa3f979 but
is 1accfa7fac1802d9c8de6380ba4699b6ba5f6975 for http://unicore-dev.zam.kfa-juelich.de/maven/pl/edu/icm/saml/samly2/1.3.6/samly2-1.3.6.jar
[WARNING] Checksum validation failed, expected 5b44d08f942c186b9b9de492f5e6637f3cc8a0e7 but
is e9ac6a9ecaa0b623fdbb62f399c32fa9e39c34a8 for http://unicore-dev.zam.kfa-juelich.de/maven/de/fzj/unicore/jsdl-xmlbeans/2.1.0/jsdl-xmlbeans-2.1.0.jar
Downloaded: http://unicore-dev.zam.kfa-juelich.de/maven/eu/unicore/cis-u6-infoprovider-types/1.5.1-rc3/cis-u6-infoprovider-types-1.5.1-rc3.jar
(864 KB at 2663.9 KB/sec)
Downloading: http://unicore-dev.zam.kfa-juelich.de/maven/eu/unicore/security/crl-checking/1.4/crl-checking-1.4.jar
[WARNING] Checksum validation failed, expected 339cb3933b390870713fb9f9438c5ae61aa3f979 but
is 1accfa7fac1802d9c8de6380ba4699b6ba5f6975 for http://unicore-dev.zam.kfa-juelich.de/maven/pl/edu/icm/saml/samly2/1.3.6/samly2-1.3.6.jar
Downloaded: http://unicore-dev.zam.kfa-juelich.de/maven/pl/edu/icm/saml/samly2/1.3.6/samly2-1.3.6.jar
(104 KB at 1042.1 KB/sec)
Downloading: http://unicore-dev.zam.kfa-juelich.de/maven/eu/unicore/uftp/1.2.1/uftp-1.2.1.jar
[WARNING] Checksum validation failed, expected fbe63d835183c4dc45734000d87da1a36ed3f8a4 but
is 772a60751d5ceda92a38952953b4d49b7d644543 for http://unicore-dev.zam.kfa-juelich.de/maven/eu/unicore/security/crl-checking/1.4/crl-checking-1.4.jar
[WARNING] Checksum validation failed, expected 8853145d7bd2b7c198ff74399b8b400c5449682b but
is 0c6d79f630fb45904102766508267f85eaaf451c for http://unicore-dev.zam.kfa-juelich.de/maven/eu/unicore/uftp/1.2.1/uftp-1.2.1.jar
[WARNING] Checksum validation failed, expected fbe63d835183c4dc45734000d87da1a36ed3f8a4 but
is 772a60751d5ceda92a38952953b4d49b7d644543 for http://unicore-dev.zam.kfa-juelich.de/maven/eu/unicore/security/crl-checking/1.4/crl-checking-1.4.jar
Downloaded: http://unicore-dev.zam.kfa-juelich.de/maven/eu/unicore/security/crl-checking/1.4/crl-checking-1.4.jar
(17 KB at 308.3 KB/sec)
[WARNING] Checksum validation failed, expected 8853145d7bd2b7c198ff74399b8b400c5449682b but
is 0c6d79f630fb45904102766508267f85eaaf451c for http://unicore-dev.zam.kfa-juelich.de/maven/eu/unicore/uftp/1.2.1/uftp-1.2.1.jar
Downloaded: http://unicore-dev.zam.kfa-juelich.de/maven/eu/unicore/uftp/1.2.1/uftp-1.2.1.jar
(75 KB at 985.0 KB/sec)
Downloaded: http://unicore-dev.zam.kfa-juelich.de/maven/eu/unicore/security/SAMLtypes/1.2/SAMLtypes-1.2.jar
(993 KB at 3190.8 KB/sec)
[WARNING] Checksum validation failed, expected 5b44d08f942c186b9b9de492f5e6637f3cc8a0e7 but
is e9ac6a9ecaa0b623fdbb62f399c32fa9e39c34a8 for http://unicore-dev.zam.kfa-juelich.de/maven/de/fzj/unicore/jsdl-xmlbeans/2.1.0/jsdl-xmlbeans-2.1.0.jar
Downloaded: http://unicore-dev.zam.kfa-juelich.de/maven/de/fzj/unicore/jsdl-xmlbeans/2.1.0/jsdl-xmlbeans-2.1.0.jar
(879 KB at 1430.6 KB/sec)
Downloaded: http://unicore-dev.zam.kfa-juelich.de/maven/eu/unicore/uas-types/1.5.1-rc3/uas-types-1.5.1-rc3.jar
(2053 KB at 2932.4 KB/sec)
projectFailed org.apache.airavata:airavata-gfac-core:0.7-SNAPSHOT
sessionEnded
[INFO] ------------------------------------------------------------------------
[INFO] Reactor Summary:
[INFO] 
[INFO] Airavata .......................................... SUCCESS [1:48.795s]
[INFO] Airavata Commons .................................. SUCCESS [6.338s]
[INFO] Airavata GFac Schema Utilities .................... SUCCESS [1:18.080s]
[INFO] Airavata Common Utilities ......................... SUCCESS [35.905s]
[INFO] Airavata Registry ................................. SUCCESS [7.251s]
[INFO] Airavata Registry API ............................. SUCCESS [18.099s]
[INFO] Airavata Workflow Model Parent .................... SUCCESS [7.646s]
[INFO] Airavata Workflow Model Core ...................... SUCCESS [29.134s]
[INFO] Airavata WS Messenger ............................. SUCCESS [7.016s]
[INFO] Airavata Messenger Commons ........................ SUCCESS [19.456s]
[INFO] Airavata Messenger Client ......................... SUCCESS [20.400s]
[INFO] Airavata WS Monitor ............................... SUCCESS [32.785s]
[INFO] Airavata Workflow Execution Context ............... SUCCESS [53.115s]
[INFO] Airavata Client ................................... SUCCESS [56.497s]
[INFO] Airavata Workflow Tracking ........................ SUCCESS [1:02.157s]
[INFO] Airavata GFac Core ................................ FAILURE [6:18.411s]
[INFO] Airavata GFac Axis2 Interface ..................... SKIPPED
[INFO] Airavata Message Box .............................. SKIPPED
[INFO] Airavata Message Broker ........................... SKIPPED
[INFO] Airavata Workflow Component ....................... SKIPPED
[INFO] Airavata Workflow Component Node .................. SKIPPED
[INFO] Airavata JPA Registry ............................. SKIPPED
[INFO] Airavata REST ..................................... SKIPPED
[INFO] airavata-rest-mappings ............................ SKIPPED
[INFO] airavata-rest-client .............................. SKIPPED
[INFO] Airavata XBaya .................................... SKIPPED
[INFO] Airavata Registry Service ......................... SKIPPED
[INFO] Airavata Registry Test ............................ SKIPPED
[INFO] Airavata Security Implementation .................. SKIPPED
[INFO] airavata-rest-services ............................ SKIPPED
[INFO] airavata-rest-service-webapp ...................... SKIPPED
[INFO] Airavata Tools .................................... SKIPPED
[INFO] Airavata Phoebus Integration ...................... SKIPPED
[INFO] registry-tool ..................................... SKIPPED
[INFO] Simple Math Service ............................... SKIPPED
[INFO] Complex Math Service .............................. SKIPPED
[INFO] Levenshtein Distance Service ...................... SKIPPED
[INFO] Airavata Embedded Tomcat Implementation ........... SKIPPED
[INFO] Airavata Test Suite ............................... SKIPPED
[INFO] distribution ...................................... SKIPPED
[INFO] Samples - Airavata Client Samples ................. SKIPPED
[INFO] Samples - Workflow Create Application ............. SKIPPED
[INFO] Samples - Workflow Execution ...................... SKIPPED
[INFO] Airavata server distribution ...................... SKIPPED
[INFO] Airavata client distribution ...................... SKIPPED
[INFO] Airavata xbaya-gui distribution ................... SKIPPED
[INFO] Airavata release artifacts ........................ SKIPPED
[INFO] Airavata Integration Tests ........................ SKIPPED
[INFO] ------------------------------------------------------------------------
[INFO] BUILD FAILURE
[INFO] ------------------------------------------------------------------------
[INFO] Total time: 16:08.329s
[INFO] Finished at: Sat Jan 26 03:26:13 GMT+00:00 2013
[INFO] Final Memory: 103M/421M
[INFO] ------------------------------------------------------------------------
Projects to build: [MavenProject: org.apache.airavata:airavata:0.7-SNAPSHOT @ <https://builds.apache.org/job/Apache%20Airavata/ws/pom.xml,>
MavenProject: org.apache.airavata:commons:0.7-SNAPSHOT @ <https://builds.apache.org/job/Apache%20Airavata/ws/modules/commons/pom.xml,>
MavenProject: org.apache.airavata:airavata-gfac-schema-utils:0.7-SNAPSHOT @ <https://builds.apache.org/job/Apache%20Airavata/ws/modules/commons/gfac-schema/pom.xml,>
MavenProject: org.apache.airavata:airavata-common-utils:0.7-SNAPSHOT @ <https://builds.apache.org/job/Apache%20Airavata/ws/modules/commons/utils/pom.xml,>
MavenProject: org.apache.airavata:registry:0.7-SNAPSHOT @ <https://builds.apache.org/job/Apache%20Airavata/ws/modules/registry/pom.xml,>
MavenProject: org.apache.airavata:airavata-registry-api:0.7-SNAPSHOT @ <https://builds.apache.org/job/Apache%20Airavata/ws/modules/registry/registry-api/pom.xml,>
MavenProject: org.apache.airavata:airavata-workflow-model-parent:0.7-SNAPSHOT @ <https://builds.apache.org/job/Apache%20Airavata/ws/modules/workflow-model/pom.xml,>
MavenProject: org.apache.airavata:airavata-workflow-model-core:0.7-SNAPSHOT @ <https://builds.apache.org/job/Apache%20Airavata/ws/modules/workflow-model/workflow-model-core/pom.xml,>
MavenProject: org.apache.airavata:airavata-ws-messenger:0.7-SNAPSHOT @ <https://builds.apache.org/job/Apache%20Airavata/ws/modules/ws-messenger/pom.xml,>
MavenProject: org.apache.airavata:airavata-messenger-commons:0.7-SNAPSHOT @ <https://builds.apache.org/job/Apache%20Airavata/ws/modules/ws-messenger/commons/pom.xml,>
MavenProject: org.apache.airavata:airavata-messenger-client:0.7-SNAPSHOT @ <https://builds.apache.org/job/Apache%20Airavata/ws/modules/ws-messenger/client/pom.xml,>
MavenProject: org.apache.airavata:airavata-message-monitor:0.7-SNAPSHOT @ <https://builds.apache.org/job/Apache%20Airavata/ws/modules/ws-messenger/message-monitor/pom.xml,>
MavenProject: org.apache.airavata:airavata-workflow-execution-context:0.7-SNAPSHOT @ <https://builds.apache.org/job/Apache%20Airavata/ws/modules/commons/workflow-execution-context/pom.xml,>
MavenProject: org.apache.airavata:airavata-client-api:0.7-SNAPSHOT @ <https://builds.apache.org/job/Apache%20Airavata/ws/modules/airavata-client/pom.xml,>
MavenProject: org.apache.airavata:airavata-workflow-tracking:0.7-SNAPSHOT @ <https://builds.apache.org/job/Apache%20Airavata/ws/modules/commons/workflow-tracking/pom.xml,>
MavenProject: org.apache.airavata:airavata-gfac-core:0.7-SNAPSHOT @ <https://builds.apache.org/job/Apache%20Airavata/ws/modules/gfac-core/pom.xml,>
MavenProject: org.apache.airavata:airavata-gfac-axis2-interface:0.7-SNAPSHOT @ <https://builds.apache.org/job/Apache%20Airavata/ws/modules/gfac-axis2/pom.xml,>
MavenProject: org.apache.airavata:airavata-message-box:0.7-SNAPSHOT @ <https://builds.apache.org/job/Apache%20Airavata/ws/modules/ws-messenger/messagebox/pom.xml,>
MavenProject: org.apache.airavata:airavata-message-broker:0.7-SNAPSHOT @ <https://builds.apache.org/job/Apache%20Airavata/ws/modules/ws-messenger/messagebroker/pom.xml,>
MavenProject: org.apache.airavata:airavata-workflow-model-component:0.7-SNAPSHOT @ <https://builds.apache.org/job/Apache%20Airavata/ws/modules/workflow-model/workflow-model-component/pom.xml,>
MavenProject: org.apache.airavata:airavata-workflow-model-component-node:0.7-SNAPSHOT @ <https://builds.apache.org/job/Apache%20Airavata/ws/modules/workflow-model/workflow-model-component-node/pom.xml,>
MavenProject: org.apache.airavata:airavata-jpa-registry:0.7-SNAPSHOT @ <https://builds.apache.org/job/Apache%20Airavata/ws/modules/registry/airavata-jpa-registry/pom.xml,>
MavenProject: org.apache.airavata:rest:0.7-SNAPSHOT @ <https://builds.apache.org/job/Apache%20Airavata/ws/modules/rest/pom.xml,>
MavenProject: org.apache.airavata:airavata-rest-mappings:0.7-SNAPSHOT @ <https://builds.apache.org/job/Apache%20Airavata/ws/modules/rest/mappings/pom.xml,>
MavenProject: org.apache.airavata:airavata-rest-client:0.7-SNAPSHOT @ <https://builds.apache.org/job/Apache%20Airavata/ws/modules/rest/client/pom.xml,>
MavenProject: org.apache.airavata:airavata-xbaya-gui:0.7-SNAPSHOT @ <https://builds.apache.org/job/Apache%20Airavata/ws/modules/xbaya-gui/pom.xml,>
MavenProject: org.apache.airavata:airavata-registry-service:0.7-SNAPSHOT @ <https://builds.apache.org/job/Apache%20Airavata/ws/modules/registry/airavata-registry-service/pom.xml,>
MavenProject: org.apache.airavata:airavata-registry-test:0.7-SNAPSHOT @ <https://builds.apache.org/job/Apache%20Airavata/ws/modules/registry/airavata-registry-test/pom.xml,>
MavenProject: org.apache.airavata:airavata-security:0.7-SNAPSHOT @ <https://builds.apache.org/job/Apache%20Airavata/ws/modules/security/pom.xml,>
MavenProject: org.apache.airavata:airavata-rest-services:0.7-SNAPSHOT @ <https://builds.apache.org/job/Apache%20Airavata/ws/modules/rest/service/pom.xml,>
MavenProject: org.apache.airavata:airavata-rest-service-webapp:0.7-SNAPSHOT @ <https://builds.apache.org/job/Apache%20Airavata/ws/modules/rest/webapp/pom.xml,>
MavenProject: org.apache.airavata:airavata-tools-parent:0.7-SNAPSHOT @ <https://builds.apache.org/job/Apache%20Airavata/ws/tools/pom.xml,>
MavenProject: org.apache.airavata:airavata-phoebus-integration:0.7-SNAPSHOT @ <https://builds.apache.org/job/Apache%20Airavata/ws/tools/phoebus-integration/pom.xml,>
MavenProject: org.apache.airavata:registry-tool:0.7-SNAPSHOT @ <https://builds.apache.org/job/Apache%20Airavata/ws/tools/registry-tool/pom.xml,>
MavenProject: org.apache.airavata:airavata-simple-math-service:0.7-SNAPSHOT @ <https://builds.apache.org/job/Apache%20Airavata/ws/samples/simple-math-service/pom.xml,>
MavenProject: org.apache.airavata:airavata-complex-math-service:0.7-SNAPSHOT @ <https://builds.apache.org/job/Apache%20Airavata/ws/samples/complex-math-service/pom.xml,>
MavenProject: org.apache.airavata:airavata-levenshtein-distance-service:0.7-SNAPSHOT @ <https://builds.apache.org/job/Apache%20Airavata/ws/samples/levenshtein-distance-service/pom.xml,>
MavenProject: org.apache.airavata:airavata-embedded-tomcat:0.7-SNAPSHOT @ <https://builds.apache.org/job/Apache%20Airavata/ws/modules/server/pom.xml,>
MavenProject: org.apache.airavata:test-suite:0.7-SNAPSHOT @ <https://builds.apache.org/job/Apache%20Airavata/ws/modules/test-suite/pom.xml,>
MavenProject: org.apache.airavata:distribution:0.7-SNAPSHOT @ <https://builds.apache.org/job/Apache%20Airavata/ws/modules/distribution/pom.xml,>
MavenProject: org.apache.airavata:airavata-client-sample:0.7-SNAPSHOT @ <https://builds.apache.org/job/Apache%20Airavata/ws/samples/airavata-client/pom.xml,>
MavenProject: org.apache.airavata:samples-create-application:0.7-SNAPSHOT @ <https://builds.apache.org/job/Apache%20Airavata/ws/samples/airavata-client/create-application/pom.xml,>
MavenProject: org.apache.airavata:samples-workflow-run:0.7-SNAPSHOT @ <https://builds.apache.org/job/Apache%20Airavata/ws/samples/airavata-client/workflow-run/pom.xml,>
MavenProject: org.apache.airavata:apache-airavata-server:0.7-SNAPSHOT @ <https://builds.apache.org/job/Apache%20Airavata/ws/modules/distribution/airavata-server/pom.xml,>
MavenProject: org.apache.airavata:apache-airavata-client:0.7-SNAPSHOT @ <https://builds.apache.org/job/Apache%20Airavata/ws/modules/distribution/airavata-client/pom.xml,>
MavenProject: org.apache.airavata:apache-airavata-xbaya-gui:0.7-SNAPSHOT @ <https://builds.apache.org/job/Apache%20Airavata/ws/modules/distribution/xbaya-gui/pom.xml,>
MavenProject: org.apache.airavata:apache-airavata-release-artifacts:0.7-SNAPSHOT @ <https://builds.apache.org/job/Apache%20Airavata/ws/modules/distribution/release/pom.xml,>
MavenProject: org.apache.airavata:integration-tests:0.7-SNAPSHOT @ <https://builds.apache.org/job/Apache%20Airavata/ws/modules/integration-tests/pom.xml]>
[JENKINS] Archiving <https://builds.apache.org/job/Apache%20Airavata/ws/modules/distribution/release/pom.xml>
to /home/hudson/hudson/jobs/Apache Airavata/modules/org.apache.airavata$apache-airavata-release-artifacts/builds/2013-01-26_03-07-35/archive/org.apache.airavata/apache-airavata-release-artifacts/0.7-SNAPSHOT/apache-airavata-release-artifacts-0.7-SNAPSHOT.pom
[JENKINS] Archiving <https://builds.apache.org/job/Apache%20Airavata/ws/modules/commons/workflow-tracking/pom.xml>
to /home/hudson/hudson/jobs/Apache Airavata/modules/org.apache.airavata$airavata-workflow-tracking/builds/2013-01-26_03-07-26/archive/org.apache.airavata/airavata-workflow-tracking/0.7-SNAPSHOT/airavata-workflow-tracking-0.7-SNAPSHOT.pom
[JENKINS] Archiving <https://builds.apache.org/job/Apache%20Airavata/ws/modules/commons/workflow-tracking/target/airavata-workflow-tracking-0.7-SNAPSHOT.jar>
to /home/hudson/hudson/jobs/Apache Airavata/modules/org.apache.airavata$airavata-workflow-tracking/builds/2013-01-26_03-07-26/archive/org.apache.airavata/airavata-workflow-tracking/0.7-SNAPSHOT/airavata-workflow-tracking-0.7-SNAPSHOT.jar
[JENKINS] Archiving <https://builds.apache.org/job/Apache%20Airavata/ws/samples/complex-math-service/pom.xml>
to /home/hudson/hudson/jobs/Apache Airavata/modules/org.apache.airavata$airavata-complex-math-service/builds/2013-01-26_03-07-32/archive/org.apache.airavata/airavata-complex-math-service/0.7-SNAPSHOT/airavata-complex-math-service-0.7-SNAPSHOT.pom
[JENKINS] Archiving <https://builds.apache.org/job/Apache%20Airavata/ws/modules/distribution/pom.xml>
to /home/hudson/hudson/jobs/Apache Airavata/modules/org.apache.airavata$distribution/builds/2013-01-26_03-07-34/archive/org.apache.airavata/distribution/0.7-SNAPSHOT/distribution-0.7-SNAPSHOT.pom
[JENKINS] Archiving <https://builds.apache.org/job/Apache%20Airavata/ws/modules/workflow-model/workflow-model-component-node/pom.xml>
to /home/hudson/hudson/jobs/Apache Airavata/modules/org.apache.airavata$airavata-workflow-model-component-node/builds/2013-01-26_03-07-25/archive/org.apache.airavata/airavata-workflow-model-component-node/0.7-SNAPSHOT/airavata-workflow-model-component-node-0.7-SNAPSHOT.pom
[JENKINS] Archiving <https://builds.apache.org/job/Apache%20Airavata/ws/samples/simple-math-service/pom.xml>
to /home/hudson/hudson/jobs/Apache Airavata/modules/org.apache.airavata$airavata-simple-math-service/builds/2013-01-26_03-07-32/archive/org.apache.airavata/airavata-simple-math-service/0.7-SNAPSHOT/airavata-simple-math-service-0.7-SNAPSHOT.pom
[JENKINS] Archiving <https://builds.apache.org/job/Apache%20Airavata/ws/modules/server/pom.xml>
to /home/hudson/hudson/jobs/Apache Airavata/modules/org.apache.airavata$airavata-embedded-tomcat/builds/2013-01-26_03-07-32/archive/org.apache.airavata/airavata-embedded-tomcat/0.7-SNAPSHOT/airavata-embedded-tomcat-0.7-SNAPSHOT.pom
[JENKINS] Archiving <https://builds.apache.org/job/Apache%20Airavata/ws/modules/registry/registry-api/pom.xml>
to /home/hudson/hudson/jobs/Apache Airavata/modules/org.apache.airavata$airavata-registry-api/builds/2013-01-26_03-07-27/archive/org.apache.airavata/airavata-registry-api/0.7-SNAPSHOT/airavata-registry-api-0.7-SNAPSHOT.pom
[JENKINS] Archiving <https://builds.apache.org/job/Apache%20Airavata/ws/modules/registry/registry-api/target/airavata-registry-api-0.7-SNAPSHOT.jar>
to /home/hudson/hudson/jobs/Apache Airavata/modules/org.apache.airavata$airavata-registry-api/builds/2013-01-26_03-07-27/archive/org.apache.airavata/airavata-registry-api/0.7-SNAPSHOT/airavata-registry-api-0.7-SNAPSHOT.jar
[JENKINS] Archiving <https://builds.apache.org/job/Apache%20Airavata/ws/modules/ws-messenger/messagebox/pom.xml>
to /home/hudson/hudson/jobs/Apache Airavata/modules/org.apache.airavata$airavata-message-box/builds/2013-01-26_03-07-23/archive/org.apache.airavata/airavata-message-box/0.7-SNAPSHOT/airavata-message-box-0.7-SNAPSHOT.pom
[JENKINS] Archiving <https://builds.apache.org/job/Apache%20Airavata/ws/modules/security/pom.xml>
to /home/hudson/hudson/jobs/Apache Airavata/modules/org.apache.airavata$airavata-security/builds/2013-01-26_03-07-29/archive/org.apache.airavata/airavata-security/0.7-SNAPSHOT/airavata-security-0.7-SNAPSHOT.pom
[JENKINS] Archiving <https://builds.apache.org/job/Apache%20Airavata/ws/tools/phoebus-integration/pom.xml>
to /home/hudson/hudson/jobs/Apache Airavata/modules/org.apache.airavata$airavata-phoebus-integration/builds/2013-01-26_03-07-31/archive/org.apache.airavata/airavata-phoebus-integration/0.7-SNAPSHOT/airavata-phoebus-integration-0.7-SNAPSHOT.pom
[JENKINS] Archiving <https://builds.apache.org/job/Apache%20Airavata/ws/modules/gfac-core/pom.xml>
to /home/hudson/hudson/jobs/Apache Airavata/modules/org.apache.airavata$airavata-gfac-core/builds/2013-01-26_03-07-21/archive/org.apache.airavata/airavata-gfac-core/0.7-SNAPSHOT/airavata-gfac-core-0.7-SNAPSHOT.pom
[JENKINS] Archiving <https://builds.apache.org/job/Apache%20Airavata/ws/modules/distribution/airavata-server/pom.xml>
to /home/hudson/hudson/jobs/Apache Airavata/modules/org.apache.airavata$apache-airavata-server/builds/2013-01-26_03-07-34/archive/org.apache.airavata/apache-airavata-server/0.7-SNAPSHOT/apache-airavata-server-0.7-SNAPSHOT.pom
[JENKINS] Archiving <https://builds.apache.org/job/Apache%20Airavata/ws/modules/registry/airavata-registry-test/pom.xml>
to /home/hudson/hudson/jobs/Apache Airavata/modules/org.apache.airavata$airavata-registry-test/builds/2013-01-26_03-07-28/archive/org.apache.airavata/airavata-registry-test/0.7-SNAPSHOT/airavata-registry-test-0.7-SNAPSHOT.pom
[JENKINS] Archiving <https://builds.apache.org/job/Apache%20Airavata/ws/modules/workflow-model/workflow-model-component/pom.xml>
to /home/hudson/hudson/jobs/Apache Airavata/modules/org.apache.airavata$airavata-workflow-model-component/builds/2013-01-26_03-07-25/archive/org.apache.airavata/airavata-workflow-model-component/0.7-SNAPSHOT/airavata-workflow-model-component-0.7-SNAPSHOT.pom
[JENKINS] Archiving <https://builds.apache.org/job/Apache%20Airavata/ws/modules/xbaya-gui/pom.xml>
to /home/hudson/hudson/jobs/Apache Airavata/modules/org.apache.airavata$airavata-xbaya-gui/builds/2013-01-26_03-07-25/archive/org.apache.airavata/airavata-xbaya-gui/0.7-SNAPSHOT/airavata-xbaya-gui-0.7-SNAPSHOT.pom
[JENKINS] Archiving <https://builds.apache.org/job/Apache%20Airavata/ws/modules/commons/workflow-execution-context/pom.xml>
to /home/hudson/hudson/jobs/Apache Airavata/modules/org.apache.airavata$airavata-workflow-execution-context/builds/2013-01-26_03-07-27/archive/org.apache.airavata/airavata-workflow-execution-context/0.7-SNAPSHOT/airavata-workflow-execution-context-0.7-SNAPSHOT.pom
[JENKINS] Archiving <https://builds.apache.org/job/Apache%20Airavata/ws/modules/commons/workflow-execution-context/target/airavata-workflow-execution-context-0.7-SNAPSHOT.jar>
to /home/hudson/hudson/jobs/Apache Airavata/modules/org.apache.airavata$airavata-workflow-execution-context/builds/2013-01-26_03-07-27/archive/org.apache.airavata/airavata-workflow-execution-context/0.7-SNAPSHOT/airavata-workflow-execution-context-0.7-SNAPSHOT.jar
[JENKINS] Archiving <https://builds.apache.org/job/Apache%20Airavata/ws/modules/integration-tests/pom.xml>
to /home/hudson/hudson/jobs/Apache Airavata/modules/org.apache.airavata$integration-tests/builds/2013-01-26_03-07-35/archive/org.apache.airavata/integration-tests/0.7-SNAPSHOT/integration-tests-0.7-SNAPSHOT.pom
[JENKINS] Archiving <https://builds.apache.org/job/Apache%20Airavata/ws/modules/gfac-axis2/pom.xml>
to /home/hudson/hudson/jobs/Apache Airavata/modules/org.apache.airavata$airavata-gfac-axis2-interface/builds/2013-01-26_03-07-21/archive/org.apache.airavata/airavata-gfac-axis2-interface/0.7-SNAPSHOT/airavata-gfac-axis2-interface-0.7-SNAPSHOT.pom
[JENKINS] Archiving <https://builds.apache.org/job/Apache%20Airavata/ws/samples/airavata-client/workflow-run/pom.xml>
to /home/hudson/hudson/jobs/Apache Airavata/modules/org.apache.airavata$samples-workflow-run/builds/2013-01-26_03-07-33/archive/org.apache.airavata/samples-workflow-run/0.7-SNAPSHOT/samples-workflow-run-0.7-SNAPSHOT.pom
[JENKINS] Archiving <https://builds.apache.org/job/Apache%20Airavata/ws/modules/commons/pom.xml>
to /home/hudson/hudson/jobs/Apache Airavata/modules/org.apache.airavata$commons/builds/2013-01-26_03-07-26/archive/org.apache.airavata/commons/0.7-SNAPSHOT/commons-0.7-SNAPSHOT.pom
[JENKINS] Archiving <https://builds.apache.org/job/Apache%20Airavata/ws/modules/ws-messenger/message-monitor/pom.xml>
to /home/hudson/hudson/jobs/Apache Airavata/modules/org.apache.airavata$airavata-message-monitor/builds/2013-01-26_03-07-23/archive/org.apache.airavata/airavata-message-monitor/0.7-SNAPSHOT/airavata-message-monitor-0.7-SNAPSHOT.pom
[JENKINS] Archiving <https://builds.apache.org/job/Apache%20Airavata/ws/modules/ws-messenger/message-monitor/target/airavata-message-monitor-0.7-SNAPSHOT.jar>
to /home/hudson/hudson/jobs/Apache Airavata/modules/org.apache.airavata$airavata-message-monitor/builds/2013-01-26_03-07-23/archive/org.apache.airavata/airavata-message-monitor/0.7-SNAPSHOT/airavata-message-monitor-0.7-SNAPSHOT.jar
[JENKINS] Archiving <https://builds.apache.org/job/Apache%20Airavata/ws/modules/registry/pom.xml>
to /home/hudson/hudson/jobs/Apache Airavata/modules/org.apache.airavata$registry/builds/2013-01-26_03-07-27/archive/org.apache.airavata/registry/0.7-SNAPSHOT/registry-0.7-SNAPSHOT.pom
[JENKINS] Archiving <https://builds.apache.org/job/Apache%20Airavata/ws/tools/registry-tool/pom.xml>
to /home/hudson/hudson/jobs/Apache Airavata/modules/org.apache.airavata$registry-tool/builds/2013-01-26_03-07-32/archive/org.apache.airavata/registry-tool/0.7-SNAPSHOT/registry-tool-0.7-SNAPSHOT.pom
[JENKINS] Archiving <https://builds.apache.org/job/Apache%20Airavata/ws/tools/pom.xml>
to /home/hudson/hudson/jobs/Apache Airavata/modules/org.apache.airavata$airavata-tools-parent/builds/2013-01-26_03-07-31/archive/org.apache.airavata/airavata-tools-parent/0.7-SNAPSHOT/airavata-tools-parent-0.7-SNAPSHOT.pom
[JENKINS] Archiving <https://builds.apache.org/job/Apache%20Airavata/ws/samples/airavata-client/pom.xml>
to /home/hudson/hudson/jobs/Apache Airavata/modules/org.apache.airavata$airavata-client-sample/builds/2013-01-26_03-07-33/archive/org.apache.airavata/airavata-client-sample/0.7-SNAPSHOT/airavata-client-sample-0.7-SNAPSHOT.pom
[JENKINS] Archiving <https://builds.apache.org/job/Apache%20Airavata/ws/modules/ws-messenger/pom.xml>
to /home/hudson/hudson/jobs/Apache Airavata/modules/org.apache.airavata$airavata-ws-messenger/builds/2013-01-26_03-07-22/archive/org.apache.airavata/airavata-ws-messenger/0.7-SNAPSHOT/airavata-ws-messenger-0.7-SNAPSHOT.pom
[JENKINS] Archiving <https://builds.apache.org/job/Apache%20Airavata/ws/modules/rest/service/pom.xml>
to /home/hudson/hudson/jobs/Apache Airavata/modules/org.apache.airavata$airavata-rest-services/builds/2013-01-26_03-07-30/archive/org.apache.airavata/airavata-rest-services/0.7-SNAPSHOT/airavata-rest-services-0.7-SNAPSHOT.pom
[JENKINS] Archiving <https://builds.apache.org/job/Apache%20Airavata/ws/modules/rest/webapp/pom.xml>
to /home/hudson/hudson/jobs/Apache Airavata/modules/org.apache.airavata$airavata-rest-service-webapp/builds/2013-01-26_03-07-30/archive/org.apache.airavata/airavata-rest-service-webapp/0.7-SNAPSHOT/airavata-rest-service-webapp-0.7-SNAPSHOT.pom
[JENKINS] Archiving <https://builds.apache.org/job/Apache%20Airavata/ws/samples/airavata-client/create-application/pom.xml>
to /home/hudson/hudson/jobs/Apache Airavata/modules/org.apache.airavata$samples-create-application/builds/2013-01-26_03-07-33/archive/org.apache.airavata/samples-create-application/0.7-SNAPSHOT/samples-create-application-0.7-SNAPSHOT.pom
[JENKINS] Archiving <https://builds.apache.org/job/Apache%20Airavata/ws/modules/distribution/airavata-client/pom.xml>
to /home/hudson/hudson/jobs/Apache Airavata/modules/org.apache.airavata$apache-airavata-client/builds/2013-01-26_03-07-34/archive/org.apache.airavata/apache-airavata-client/0.7-SNAPSHOT/apache-airavata-client-0.7-SNAPSHOT.pom
[JENKINS] Archiving <https://builds.apache.org/job/Apache%20Airavata/ws/modules/registry/airavata-jpa-registry/pom.xml>
to /home/hudson/hudson/jobs/Apache Airavata/modules/org.apache.airavata$airavata-jpa-registry/builds/2013-01-26_03-07-28/archive/org.apache.airavata/airavata-jpa-registry/0.7-SNAPSHOT/airavata-jpa-registry-0.7-SNAPSHOT.pom
[JENKINS] Archiving <https://builds.apache.org/job/Apache%20Airavata/ws/modules/commons/utils/pom.xml>
to /home/hudson/hudson/jobs/Apache Airavata/modules/org.apache.airavata$airavata-common-utils/builds/2013-01-26_03-07-26/archive/org.apache.airavata/airavata-common-utils/0.7-SNAPSHOT/airavata-common-utils-0.7-SNAPSHOT.pom
[JENKINS] Archiving <https://builds.apache.org/job/Apache%20Airavata/ws/modules/commons/utils/target/airavata-common-utils-0.7-SNAPSHOT.jar>
to /home/hudson/hudson/jobs/Apache Airavata/modules/org.apache.airavata$airavata-common-utils/builds/2013-01-26_03-07-26/archive/org.apache.airavata/airavata-common-utils/0.7-SNAPSHOT/airavata-common-utils-0.7-SNAPSHOT.jar
[JENKINS] Archiving <https://builds.apache.org/job/Apache%20Airavata/ws/samples/levenshtein-distance-service/pom.xml>
to /home/hudson/hudson/jobs/Apache Airavata/modules/org.apache.airavata$airavata-levenshtein-distance-service/builds/2013-01-26_03-07-32/archive/org.apache.airavata/airavata-levenshtein-distance-service/0.7-SNAPSHOT/airavata-levenshtein-distance-service-0.7-SNAPSHOT.pom
[JENKINS] Archiving <https://builds.apache.org/job/Apache%20Airavata/ws/modules/rest/pom.xml>
to /home/hudson/hudson/jobs/Apache Airavata/modules/org.apache.airavata$rest/builds/2013-01-26_03-07-29/archive/org.apache.airavata/rest/0.7-SNAPSHOT/rest-0.7-SNAPSHOT.pom
[JENKINS] Archiving <https://builds.apache.org/job/Apache%20Airavata/ws/modules/distribution/xbaya-gui/pom.xml>
to /home/hudson/hudson/jobs/Apache Airavata/modules/org.apache.airavata$apache-airavata-xbaya-gui/builds/2013-01-26_03-07-34/archive/org.apache.airavata/apache-airavata-xbaya-gui/0.7-SNAPSHOT/apache-airavata-xbaya-gui-0.7-SNAPSHOT.pom
[JENKINS] Archiving <https://builds.apache.org/job/Apache%20Airavata/ws/modules/airavata-client/pom.xml>
to /home/hudson/hudson/jobs/Apache Airavata/modules/org.apache.airavata$airavata-client-api/builds/2013-01-26_03-07-29/archive/org.apache.airavata/airavata-client-api/0.7-SNAPSHOT/airavata-client-api-0.7-SNAPSHOT.pom
[JENKINS] Archiving <https://builds.apache.org/job/Apache%20Airavata/ws/modules/airavata-client/target/airavata-client-api-0.7-SNAPSHOT.jar>
to /home/hudson/hudson/jobs/Apache Airavata/modules/org.apache.airavata$airavata-client-api/builds/2013-01-26_03-07-29/archive/org.apache.airavata/airavata-client-api/0.7-SNAPSHOT/airavata-client-api-0.7-SNAPSHOT.jar
[JENKINS] Archiving <https://builds.apache.org/job/Apache%20Airavata/ws/modules/ws-messenger/messagebroker/pom.xml>
to /home/hudson/hudson/jobs/Apache Airavata/modules/org.apache.airavata$airavata-message-broker/builds/2013-01-26_03-07-23/archive/org.apache.airavata/airavata-message-broker/0.7-SNAPSHOT/airavata-message-broker-0.7-SNAPSHOT.pom
[JENKINS] Archiving <https://builds.apache.org/job/Apache%20Airavata/ws/modules/commons/gfac-schema/pom.xml>
to /home/hudson/hudson/jobs/Apache Airavata/modules/org.apache.airavata$airavata-gfac-schema-utils/builds/2013-01-26_03-07-26/archive/org.apache.airavata/airavata-gfac-schema-utils/0.7-SNAPSHOT/airavata-gfac-schema-utils-0.7-SNAPSHOT.pom
[JENKINS] Archiving <https://builds.apache.org/job/Apache%20Airavata/ws/modules/commons/gfac-schema/target/airavata-gfac-schema-utils-0.7-SNAPSHOT.jar>
to /home/hudson/hudson/jobs/Apache Airavata/modules/org.apache.airavata$airavata-gfac-schema-utils/builds/2013-01-26_03-07-26/archive/org.apache.airavata/airavata-gfac-schema-utils/0.7-SNAPSHOT/airavata-gfac-schema-utils-0.7-SNAPSHOT.jar
[JENKINS] Archiving <https://builds.apache.org/job/Apache%20Airavata/ws/modules/rest/mappings/pom.xml>
to /home/hudson/hudson/jobs/Apache Airavata/modules/org.apache.airavata$airavata-rest-mappings/builds/2013-01-26_03-07-29/archive/org.apache.airavata/airavata-rest-mappings/0.7-SNAPSHOT/airavata-rest-mappings-0.7-SNAPSHOT.pom
[JENKINS] Archiving <https://builds.apache.org/job/Apache%20Airavata/ws/modules/workflow-model/pom.xml>
to /home/hudson/hudson/jobs/Apache Airavata/modules/org.apache.airavata$airavata-workflow-model-parent/builds/2013-01-26_03-07-24/archive/org.apache.airavata/airavata-workflow-model-parent/0.7-SNAPSHOT/airavata-workflow-model-parent-0.7-SNAPSHOT.pom
[JENKINS] Archiving <https://builds.apache.org/job/Apache%20Airavata/ws/modules/registry/airavata-registry-service/pom.xml>
to /home/hudson/hudson/jobs/Apache Airavata/modules/org.apache.airavata$airavata-registry-service/builds/2013-01-26_03-07-28/archive/org.apache.airavata/airavata-registry-service/0.7-SNAPSHOT/airavata-registry-service-0.7-SNAPSHOT.pom
[JENKINS] Archiving <https://builds.apache.org/job/Apache%20Airavata/ws/modules/rest/client/pom.xml>
to /home/hudson/hudson/jobs/Apache Airavata/modules/org.apache.airavata$airavata-rest-client/builds/2013-01-26_03-07-30/archive/org.apache.airavata/airavata-rest-client/0.7-SNAPSHOT/airavata-rest-client-0.7-SNAPSHOT.pom
[JENKINS] Archiving <https://builds.apache.org/job/Apache%20Airavata/ws/modules/ws-messenger/client/pom.xml>
to /home/hudson/hudson/jobs/Apache Airavata/modules/org.apache.airavata$airavata-messenger-client/builds/2013-01-26_03-07-22/archive/org.apache.airavata/airavata-messenger-client/0.7-SNAPSHOT/airavata-messenger-client-0.7-SNAPSHOT.pom
[JENKINS] Archiving <https://builds.apache.org/job/Apache%20Airavata/ws/modules/ws-messenger/client/target/airavata-messenger-client-0.7-SNAPSHOT.jar>
to /home/hudson/hudson/jobs/Apache Airavata/modules/org.apache.airavata$airavata-messenger-client/builds/2013-01-26_03-07-22/archive/org.apache.airavata/airavata-messenger-client/0.7-SNAPSHOT/airavata-messenger-client-0.7-SNAPSHOT.jar
[JENKINS] Archiving <https://builds.apache.org/job/Apache%20Airavata/ws/modules/ws-messenger/commons/pom.xml>
to /home/hudson/hudson/jobs/Apache Airavata/modules/org.apache.airavata$airavata-messenger-commons/builds/2013-01-26_03-07-22/archive/org.apache.airavata/airavata-messenger-commons/0.7-SNAPSHOT/airavata-messenger-commons-0.7-SNAPSHOT.pom
[JENKINS] Archiving <https://builds.apache.org/job/Apache%20Airavata/ws/modules/ws-messenger/commons/target/airavata-messenger-commons-0.7-SNAPSHOT.jar>
to /home/hudson/hudson/jobs/Apache Airavata/modules/org.apache.airavata$airavata-messenger-commons/builds/2013-01-26_03-07-22/archive/org.apache.airavata/airavata-messenger-commons/0.7-SNAPSHOT/airavata-messenger-commons-0.7-SNAPSHOT.jar
[JENKINS] Archiving <https://builds.apache.org/job/Apache%20Airavata/ws/modules/workflow-model/workflow-model-core/pom.xml>
to /home/hudson/hudson/jobs/Apache Airavata/modules/org.apache.airavata$airavata-workflow-model-core/builds/2013-01-26_03-07-24/archive/org.apache.airavata/airavata-workflow-model-core/0.7-SNAPSHOT/airavata-workflow-model-core-0.7-SNAPSHOT.pom
[JENKINS] Archiving <https://builds.apache.org/job/Apache%20Airavata/ws/modules/workflow-model/workflow-model-core/target/airavata-workflow-model-core-0.7-SNAPSHOT.jar>
to /home/hudson/hudson/jobs/Apache Airavata/modules/org.apache.airavata$airavata-workflow-model-core/builds/2013-01-26_03-07-24/archive/org.apache.airavata/airavata-workflow-model-core/0.7-SNAPSHOT/airavata-workflow-model-core-0.7-SNAPSHOT.jar
[JENKINS] Archiving <https://builds.apache.org/job/Apache%20Airavata/ws/modules/test-suite/pom.xml>
to /home/hudson/hudson/jobs/Apache Airavata/modules/org.apache.airavata$test-suite/builds/2013-01-26_03-07-32/archive/org.apache.airavata/test-suite/0.7-SNAPSHOT/test-suite-0.7-SNAPSHOT.pom
[JENKINS] Archiving <https://builds.apache.org/job/Apache%20Airavata/ws/pom.xml> to
/home/hudson/hudson/jobs/Apache Airavata/modules/org.apache.airavata$airavata/builds/2013-01-26_03-07-21/archive/org.apache.airavata/airavata/0.7-SNAPSHOT/airavata-0.7-SNAPSHOT.pom
Waiting for Jenkins to finish collecting data
mavenExecutionResult exceptions not empty
message : Failed to execute goal on project airavata-gfac-core: Could not resolve dependencies
for project org.apache.airavata:airavata-gfac-core:jar:0.7-SNAPSHOT: Could not transfer artifact
net.schmizz:sshj:jar:0.5.0 from/to central (http://repo1.maven.org/maven2): Error transferring
file: Server returned HTTP response code: 504 for URL: http://repo1.maven.org/maven2/net/schmizz/sshj/0.5.0/sshj-0.5.0.jar
cause : Could not resolve dependencies for project org.apache.airavata:airavata-gfac-core:jar:0.7-SNAPSHOT:
Could not transfer artifact net.schmizz:sshj:jar:0.5.0 from/to central (http://repo1.maven.org/maven2):
Error transferring file: Server returned HTTP response code: 504 for URL: http://repo1.maven.org/maven2/net/schmizz/sshj/0.5.0/sshj-0.5.0.jar
Stack trace : 
org.apache.maven.lifecycle.LifecycleExecutionException: Failed to execute goal on project
airavata-gfac-core: Could not resolve dependencies for project org.apache.airavata:airavata-gfac-core:jar:0.7-SNAPSHOT:
Could not transfer artifact net.schmizz:sshj:jar:0.5.0 from/to central (http://repo1.maven.org/maven2):
Error transferring file: Server returned HTTP response code: 504 for URL: http://repo1.maven.org/maven2/net/schmizz/sshj/0.5.0/sshj-0.5.0.jar
	at org.apache.maven.lifecycle.internal.LifecycleDependencyResolver.getDependencies(LifecycleDependencyResolver.java:196)
	at org.apache.maven.lifecycle.internal.LifecycleDependencyResolver.resolveProjectDependencies(LifecycleDependencyResolver.java:108)
	at org.apache.maven.lifecycle.internal.MojoExecutor.ensureDependenciesAreResolved(MojoExecutor.java:258)
	at org.apache.maven.lifecycle.internal.MojoExecutor.execute(MojoExecutor.java:201)
	at org.apache.maven.lifecycle.internal.MojoExecutor.execute(MojoExecutor.java:153)
	at org.apache.maven.lifecycle.internal.MojoExecutor.execute(MojoExecutor.java:145)
	at org.apache.maven.lifecycle.internal.LifecycleModuleBuilder.buildProject(LifecycleModuleBuilder.java:84)
	at org.apache.maven.lifecycle.internal.LifecycleModuleBuilder.buildProject(LifecycleModuleBuilder.java:59)
	at org.apache.maven.lifecycle.internal.LifecycleStarter.singleThreadedBuild(LifecycleStarter.java:183)
	at org.apache.maven.lifecycle.internal.LifecycleStarter.execute(LifecycleStarter.java:161)
	at org.apache.maven.DefaultMaven.doExecute(DefaultMaven.java:319)
	at org.apache.maven.DefaultMaven.execute(DefaultMaven.java:156)
	at org.jvnet.hudson.maven3.launcher.Maven3Launcher.main(Maven3Launcher.java:79)
	at sun.reflect.NativeMethodAccessorImpl.invoke0(Native Method)
	at sun.reflect.NativeMethodAccessorImpl.invoke(NativeMethodAccessorImpl.java:39)
	at sun.reflect.DelegatingMethodAccessorImpl.invoke(DelegatingMethodAccessorImpl.java:25)
	at java.lang.reflect.Method.invoke(Method.java:597)
	at org.codehaus.plexus.classworlds.launcher.Launcher.launchStandard(Launcher.java:329)
	at org.codehaus.plexus.classworlds.launcher.Launcher.launch(Launcher.java:239)
	at org.jvnet.hudson.maven3.agent.Maven3Main.launch(Maven3Main.java:158)
	at hudson.maven.Maven3Builder.call(Maven3Builder.java:100)
	at hudson.maven.Maven3Builder.call(Maven3Builder.java:66)
	at hudson.remoting.UserRequest.perform(UserRequest.java:118)
	at hudson.remoting.UserRequest.perform(UserRequest.java:48)
	at hudson.remoting.Request$2.run(Request.java:326)
	at hudson.remoting.InterceptingExecutorService$1.call(InterceptingExecutorService.java:72)
	at java.util.concurrent.FutureTask$Sync.innerRun(FutureTask.java:303)
	at java.util.concurrent.FutureTask.run(FutureTask.java:138)
	at java.util.concurrent.ThreadPoolExecutor$Worker.runTask(ThreadPoolExecutor.java:886)
	at java.util.concurrent.ThreadPoolExecutor$Worker.run(ThreadPoolExecutor.java:908)
	at java.lang.Thread.run(Thread.java:662)
Caused by: org.apache.maven.project.DependencyResolutionException: Could not resolve dependencies
for project org.apache.airavata:airavata-gfac-core:jar:0.7-SNAPSHOT: Could not transfer artifact
net.schmizz:sshj:jar:0.5.0 from/to central (http://repo1.maven.org/maven2): Error transferring
file: Server returned HTTP response code: 504 for URL: http://repo1.maven.org/maven2/net/schmizz/sshj/0.5.0/sshj-0.5.0.jar
	at org.apache.maven.project.DefaultProjectDependenciesResolver.resolve(DefaultProjectDependenciesResolver.java:170)
	at org.apache.maven.lifecycle.internal.LifecycleDependencyResolver.getDependencies(LifecycleDependencyResolver.java:171)
	... 30 more
Caused by: org.sonatype.aether.resolution.DependencyResolutionException: Could not transfer
artifact net.schmizz:sshj:jar:0.5.0 from/to central (http://repo1.maven.org/maven2): Error
transferring file: Server returned HTTP response code: 504 for URL: http://repo1.maven.org/maven2/net/schmizz/sshj/0.5.0/sshj-0.5.0.jar
	at org.sonatype.aether.impl.internal.DefaultRepositorySystem.resolveDependencies(DefaultRepositorySystem.java:412)
	at org.apache.maven.project.DefaultProjectDependenciesResolver.resolve(DefaultProjectDependenciesResolver.java:164)
	... 31 more
Caused by: org.sonatype.aether.resolution.ArtifactResolutionException: Could not transfer
artifact net.schmizz:sshj:jar:0.5.0 from/to central (http://repo1.maven.org/maven2): Error
transferring file: Server returned HTTP response code: 504 for URL: http://repo1.maven.org/maven2/net/schmizz/sshj/0.5.0/sshj-0.5.0.jar
	at org.sonatype.aether.impl.internal.DefaultArtifactResolver.resolve(DefaultArtifactResolver.java:541)
	at org.sonatype.aether.impl.internal.DefaultArtifactResolver.resolveArtifacts(DefaultArtifactResolver.java:220)
	at org.sonatype.aether.impl.internal.DefaultRepositorySystem.resolveDependencies(DefaultRepositorySystem.java:395)
	... 32 more
Caused by: org.sonatype.aether.transfer.ArtifactTransferException: Could not transfer artifact
net.schmizz:sshj:jar:0.5.0 from/to central (http://repo1.maven.org/maven2): Error transferring
file: Server returned HTTP response code: 504 for URL: http://repo1.maven.org/maven2/net/schmizz/sshj/0.5.0/sshj-0.5.0.jar
	at org.sonatype.aether.connector.wagon.WagonRepositoryConnector$4.wrap(WagonRepositoryConnector.java:949)
	at org.sonatype.aether.connector.wagon.WagonRepositoryConnector$4.wrap(WagonRepositoryConnector.java:940)
	at org.sonatype.aether.connector.wagon.WagonRepositoryConnector$GetTask.flush(WagonRepositoryConnector.java:695)
	at org.sonatype.aether.connector.wagon.WagonRepositoryConnector$GetTask.flush(WagonRepositoryConnector.java:689)
	at org.sonatype.aether.connector.wagon.WagonRepositoryConnector.get(WagonRepositoryConnector.java:445)
	at org.sonatype.aether.impl.internal.DefaultArtifactResolver.resolve(DefaultArtifactResolver.java:460)
	... 34 more
Caused by: org.apache.maven.wagon.TransferFailedException: Error transferring file: Server
returned HTTP response code: 504 for URL: http://repo1.maven.org/maven2/net/schmizz/sshj/0.5.0/sshj-0.5.0.jar
	at org.apache.maven.wagon.providers.http.LightweightHttpWagon.fillInputData(LightweightHttpWagon.java:143)
	at org.apache.maven.wagon.StreamWagon.getInputStream(StreamWagon.java:116)
	at org.apache.maven.wagon.StreamWagon.getIfNewer(StreamWagon.java:88)
	at org.apache.maven.wagon.StreamWagon.get(StreamWagon.java:61)
	at org.sonatype.aether.connector.wagon.WagonRepositoryConnector$GetTask.run(WagonRepositoryConnector.java:608)
	at org.sonatype.aether.util.concurrency.RunnableErrorForwarder$1.run(RunnableErrorForwarder.java:64)
	... 3 more
Caused by: java.io.IOException: Server returned HTTP response code: 504 for URL: http://repo1.maven.org/maven2/net/schmizz/sshj/0.5.0/sshj-0.5.0.jar
	at sun.reflect.GeneratedConstructorAccessor25.newInstance(Unknown Source)
	at sun.reflect.DelegatingConstructorAccessorImpl.newInstance(DelegatingConstructorAccessorImpl.java:27)
	at java.lang.reflect.Constructor.newInstance(Constructor.java:513)
	at sun.net.www.protocol.http.HttpURLConnection$6.run(HttpURLConnection.java:1491)
	at java.security.AccessController.doPrivileged(Native Method)
	at sun.net.www.protocol.http.HttpURLConnection.getChainedException(HttpURLConnection.java:1485)
	at sun.net.www.protocol.http.HttpURLConnection.getInputStream(HttpURLConnection.java:1139)
	at org.apache.maven.wagon.providers.http.LightweightHttpWagon.fillInputData(LightweightHttpWagon.java:122)
	... 8 more
Caused by: java.io.IOException: Server returned HTTP response code: 504 for URL: http://repo1.maven.org/maven2/net/schmizz/sshj/0.5.0/sshj-0.5.0.jar
	at sun.net.www.protocol.http.HttpURLConnection.getInputStream(HttpURLConnection.java:1436)
	at java.net.HttpURLConnection.getResponseCode(HttpURLConnection.java:379)
	at org.apache.maven.wagon.providers.http.LightweightHttpWagon.fillInputData(LightweightHttpWagon.java:115)
	... 8 more
Sending e-mails to: dev@airavata.apache.org samindaw@gmail.com
channel stopped

Mime
View raw message