airavata-dev mailing list archives

Site index · List index
Message view « Date » · « Thread »
Top « Date » · « Thread »
From Apache Jenkins Server <jenk...@builds.apache.org>
Subject Build failed in Jenkins: Apache Airavata #886
Date Mon, 03 Dec 2012 19:27:32 GMT
See <https://builds.apache.org/job/Apache%20Airavata/886/changes>

Changes:

[lahiru] changing property name to port.

[lahiru] changing the property name.

[lahiru] changing the build to have embedded tomcat as default server.

[lahiru] using same servlet-api version.

[lahiru] new paramter to airavata-server.properties to handle embedded tomecat.

[lahiru] adding new server module to handle embedded tomcat startup.

------------------------------------------
[...truncated 3274 lines...]
mojoSucceeded org.apache.maven.plugins:maven-resources-plugin:2.5(copy-resources)
mojoStarted org.apache.maven.plugins:maven-remote-resources-plugin:1.2.1(default)
[INFO] 
[INFO] --- maven-remote-resources-plugin:1.2.1:process (default) @ airavata-client-api ---
mojoSucceeded org.apache.maven.plugins:maven-remote-resources-plugin:1.2.1(default)
mojoStarted org.apache.maven.plugins:maven-resources-plugin:2.5(default-resources)[debug]
execute contextualize
[INFO] Using 'UTF-8' encoding to copy filtered resources.
[INFO] Copying 1 resource
[INFO] Copying 3 resources

[INFO] 
[INFO] --- maven-resources-plugin:2.5:resources (default-resources) @ airavata-client-api
---
mojoSucceeded org.apache.maven.plugins:maven-resources-plugin:2.5(default-resources)
mojoStarted org.apache.maven.plugins:maven-compiler-plugin:2.3.2(default-compile)[INFO] Compiling
23 source files to <https://builds.apache.org/job/Apache%20Airavata/ws/modules/airavata-client/target/classes>

[INFO] 
[INFO] --- maven-compiler-plugin:2.3.2:compile (default-compile) @ airavata-client-api ---
mojoSucceeded org.apache.maven.plugins:maven-compiler-plugin:2.3.2(default-compile)
mojoStarted org.apache.maven.plugins:maven-resources-plugin:2.5(default-testResources)[debug]
execute contextualize
[INFO] Using 'UTF-8' encoding to copy filtered resources.
[INFO] Copying 1 resource
[INFO] Copying 3 resources

[INFO] 
[INFO] --- maven-resources-plugin:2.5:testResources (default-testResources) @ airavata-client-api
---
mojoSucceeded org.apache.maven.plugins:maven-resources-plugin:2.5(default-testResources)
mojoStarted org.apache.maven.plugins:maven-compiler-plugin:2.3.2(default-testCompile)[INFO]
Compiling 1 source file to <https://builds.apache.org/job/Apache%20Airavata/ws/modules/airavata-client/target/test-classes>

[INFO] 
[INFO] --- maven-compiler-plugin:2.3.2:testCompile (default-testCompile) @ airavata-client-api
---
mojoSucceeded org.apache.maven.plugins:maven-compiler-plugin:2.3.2(default-testCompile)
mojoStarted org.apache.maven.plugins:maven-surefire-plugin:2.12(default-test)[INFO] Surefire
report directory: <https://builds.apache.org/job/Apache%20Airavata/ws/modules/airavata-client/target/surefire-reports>

-------------------------------------------------------
 T E S T S
-------------------------------------------------------

[INFO] 
[INFO] --- maven-surefire-plugin:2.12:test (default-test) @ airavata-client-api ---
Running org.apache.airavata.client.airavata.AiravataClientTest
Tests run: 2, Failures: 0, Errors: 0, Skipped: 0, Time elapsed: 0.038 sec

Results :

Tests run: 2, Failures: 0, Errors: 0, Skipped: 0

mojoSucceeded org.apache.maven.plugins:maven-surefire-plugin:2.12(default-test)
[JENKINS] Recording test results
mojoStarted org.apache.maven.plugins:maven-jar-plugin:2.3.1(default-jar)
[INFO] 
[INFO] [INFO] Building jar: <https://builds.apache.org/job/Apache%20Airavata/ws/modules/airavata-client/target/airavata-client-api-0.6-SNAPSHOT.jar>
--- maven-jar-plugin:2.3.1:jar (default-jar) @ airavata-client-api ---
mojoSucceeded org.apache.maven.plugins:maven-jar-plugin:2.3.1(default-jar)
mojoStarted org.apache.maven.plugins:maven-site-plugin:3.0(attach-descriptor)
[INFO] 
[INFO] --- maven-site-plugin:3.0:attach-descriptor (attach-descriptor) @ airavata-client-api
---
mojoSucceeded org.apache.maven.plugins:maven-site-plugin:3.0(attach-descriptor)
mojoStarted org.apache.maven.plugins:maven-install-plugin:2.3.1(default-install)[INFO] Installing
<https://builds.apache.org/job/Apache%20Airavata/ws/modules/airavata-client/target/airavata-client-api-0.6-SNAPSHOT.jar>
to /home/jenkins/jenkins-slave/maven-repositories/1/org/apache/airavata/airavata-client-api/0.6-SNAPSHOT/airavata-client-api-0.6-SNAPSHOT.jar

[INFO] 
[INFO] --- maven-install-plugin:2.3.1:install (default-install) @ airavata-client-api ---
[INFO] Installing <https://builds.apache.org/job/Apache%20Airavata/ws/modules/airavata-client/pom.xml>
to /home/jenkins/jenkins-slave/maven-repositories/1/org/apache/airavata/airavata-client-api/0.6-SNAPSHOT/airavata-client-api-0.6-SNAPSHOT.pom
mojoSucceeded org.apache.maven.plugins:maven-install-plugin:2.3.1(default-install)
projectSucceeded org.apache.airavata:airavata-client-api:0.6-SNAPSHOT
projectStarted org.apache.airavata:airavata-gfac-core:0.6-SNAPSHOT
[INFO]                                                                         
[INFO] ------------------------------------------------------------------------
[INFO] Building Airavata GFac Core 0.6-SNAPSHOT
[INFO] ------------------------------------------------------------------------
Downloading: http://repository.jboss.com/maven2/net/sf/saxon/saxon/9/saxon-9.pom
Downloading: http://repo1.maven.org/maven2/net/sf/saxon/saxon/9/saxon-9.pom
Downloading: http://community.ucs.indiana.edu:9090/archiva/repository/ogce.m2.all/net/sf/saxon/saxon/9/saxon-9.pom
Downloading: http://people.apache.org/repo/m2-snapshot-repository/net/sf/saxon/saxon/9/saxon-9.pom
Downloading: http://unicore-dev.zam.kfa-juelich.de/maven/net/sf/saxon/saxon/9/saxon-9.pom
projectFailed org.apache.airavata:airavata-gfac-core:0.6-SNAPSHOT
sessionEnded
[INFO] ------------------------------------------------------------------------
[INFO] Reactor Summary:
[INFO] 
[INFO] Airavata .......................................... SUCCESS [29.183s]
[INFO] Airavata Commons .................................. SUCCESS [0.862s]
[INFO] Airavata GFac Schema Utilities .................... SUCCESS [18.228s]
[INFO] Airavata Common Utilities ......................... SUCCESS [8.762s]
[INFO] Airavata Registry ................................. SUCCESS [0.826s]
[INFO] Airavata Registry API ............................. SUCCESS [3.692s]
[INFO] Airavata WS Messenger ............................. SUCCESS [1.290s]
[INFO] Airavata Messenger Commons ........................ SUCCESS [4.171s]
[INFO] Airavata Messenger Client ......................... SUCCESS [5.188s]
[INFO] Airavata Workflow Tracking ........................ SUCCESS [7.405s]
[INFO] Airavata Workflow Execution Context ............... SUCCESS [6.351s]
[INFO] Airavata Workflow Model Parent .................... SUCCESS [1.321s]
[INFO] Airavata Workflow Model Core ...................... SUCCESS [7.683s]
[INFO] Airavata WS Monitor ............................... SUCCESS [3.948s]
[INFO] Airavata Client ................................... SUCCESS [5.641s]
[INFO] Airavata GFac Core ................................ FAILURE [3.652s]
[INFO] Airavata JPA Registry ............................. SKIPPED
[INFO] Airavata GFac Axis2 Interface ..................... SKIPPED
[INFO] Airavata Message Box .............................. SKIPPED
[INFO] Airavata Message Broker ........................... SKIPPED
[INFO] Airavata Workflow Component ....................... SKIPPED
[INFO] Airavata Workflow Component Node .................. SKIPPED
[INFO] Airavata REST ..................................... SKIPPED
[INFO] airavata-rest-mappings ............................ SKIPPED
[INFO] airavata-rest-client .............................. SKIPPED
[INFO] Airavata XBaya .................................... SKIPPED
[INFO] Airavata Registry Service ......................... SKIPPED
[INFO] Airavata Registry Test ............................ SKIPPED
[INFO] Airavata Security Implementation .................. SKIPPED
[INFO] airavata-rest-services ............................ SKIPPED
[INFO] Simple Math Service ............................... SKIPPED
[INFO] Complex Math Service .............................. SKIPPED
[INFO] Levenshtein Distance Service ...................... SKIPPED
[INFO] Airavata Embedded Tomcat Implementation ........... SKIPPED
[INFO] distribution ...................................... SKIPPED
[INFO] Airavata Test Suite ............................... SKIPPED
[INFO] ------------------------------------------------------------------------
[INFO] BUILD FAILURE
[INFO] ------------------------------------------------------------------------
[INFO] Total time: 1:54.472s
[INFO] Finished at: Mon Dec 03 19:26:52 UTC 2012
[INFO] Final Memory: 98M/216M
[INFO] ------------------------------------------------------------------------
Projects to build: [MavenProject: org.apache.airavata:airavata:0.6-SNAPSHOT @ <https://builds.apache.org/job/Apache%20Airavata/ws/pom.xml,>
MavenProject: org.apache.airavata:commons:0.6-SNAPSHOT @ <https://builds.apache.org/job/Apache%20Airavata/ws/modules/commons/pom.xml,>
MavenProject: org.apache.airavata:airavata-gfac-schema-utils:0.6-SNAPSHOT @ <https://builds.apache.org/job/Apache%20Airavata/ws/modules/commons/gfac-schema/pom.xml,>
MavenProject: org.apache.airavata:airavata-common-utils:0.6-SNAPSHOT @ <https://builds.apache.org/job/Apache%20Airavata/ws/modules/commons/utils/pom.xml,>
MavenProject: org.apache.airavata:registry:0.6-SNAPSHOT @ <https://builds.apache.org/job/Apache%20Airavata/ws/modules/registry/pom.xml,>
MavenProject: org.apache.airavata:airavata-registry-api:0.6-SNAPSHOT @ <https://builds.apache.org/job/Apache%20Airavata/ws/modules/registry/registry-api/pom.xml,>
MavenProject: org.apache.airavata:airavata-ws-messenger:0.6-SNAPSHOT @ <https://builds.apache.org/job/Apache%20Airavata/ws/modules/ws-messenger/pom.xml,>
MavenProject: org.apache.airavata:airavata-messenger-commons:0.6-SNAPSHOT @ <https://builds.apache.org/job/Apache%20Airavata/ws/modules/ws-messenger/commons/pom.xml,>
MavenProject: org.apache.airavata:airavata-messenger-client:0.6-SNAPSHOT @ <https://builds.apache.org/job/Apache%20Airavata/ws/modules/ws-messenger/client/pom.xml,>
MavenProject: org.apache.airavata:airavata-workflow-tracking:0.6-SNAPSHOT @ <https://builds.apache.org/job/Apache%20Airavata/ws/modules/commons/workflow-tracking/pom.xml,>
MavenProject: org.apache.airavata:airavata-workflow-execution-context:0.6-SNAPSHOT @ <https://builds.apache.org/job/Apache%20Airavata/ws/modules/commons/workflow-execution-context/pom.xml,>
MavenProject: org.apache.airavata:airavata-workflow-model-parent:0.6-SNAPSHOT @ <https://builds.apache.org/job/Apache%20Airavata/ws/modules/workflow-model/pom.xml,>
MavenProject: org.apache.airavata:airavata-workflow-model-core:0.6-SNAPSHOT @ <https://builds.apache.org/job/Apache%20Airavata/ws/modules/workflow-model/workflow-model-core/pom.xml,>
MavenProject: org.apache.airavata:airavata-message-monitor:0.6-SNAPSHOT @ <https://builds.apache.org/job/Apache%20Airavata/ws/modules/ws-messenger/message-monitor/pom.xml,>
MavenProject: org.apache.airavata:airavata-client-api:0.6-SNAPSHOT @ <https://builds.apache.org/job/Apache%20Airavata/ws/modules/airavata-client/pom.xml,>
MavenProject: org.apache.airavata:airavata-gfac-core:0.6-SNAPSHOT @ <https://builds.apache.org/job/Apache%20Airavata/ws/modules/gfac-core/pom.xml,>
MavenProject: org.apache.airavata:airavata-jpa-registry:0.6-SNAPSHOT @ <https://builds.apache.org/job/Apache%20Airavata/ws/modules/registry/airavata-jpa-registry/pom.xml,>
MavenProject: org.apache.airavata:airavata-gfac-axis2-interface:0.6-SNAPSHOT @ <https://builds.apache.org/job/Apache%20Airavata/ws/modules/gfac-axis2/pom.xml,>
MavenProject: org.apache.airavata:airavata-message-box:0.6-SNAPSHOT @ <https://builds.apache.org/job/Apache%20Airavata/ws/modules/ws-messenger/messagebox/pom.xml,>
MavenProject: org.apache.airavata:airavata-message-broker:0.6-SNAPSHOT @ <https://builds.apache.org/job/Apache%20Airavata/ws/modules/ws-messenger/messagebroker/pom.xml,>
MavenProject: org.apache.airavata:airavata-workflow-model-component:0.6-SNAPSHOT @ <https://builds.apache.org/job/Apache%20Airavata/ws/modules/workflow-model/workflow-model-component/pom.xml,>
MavenProject: org.apache.airavata:airavata-workflow-model-component-node:0.6-SNAPSHOT @ <https://builds.apache.org/job/Apache%20Airavata/ws/modules/workflow-model/workflow-model-component-node/pom.xml,>
MavenProject: org.apache.airavata:rest:0.6-SNAPSHOT @ <https://builds.apache.org/job/Apache%20Airavata/ws/modules/rest/pom.xml,>
MavenProject: org.apache.airavata:airavata-rest-mappings:0.6-SNAPSHOT @ <https://builds.apache.org/job/Apache%20Airavata/ws/modules/rest/mappings/pom.xml,>
MavenProject: org.apache.airavata:airavata-rest-client:0.6-SNAPSHOT @ <https://builds.apache.org/job/Apache%20Airavata/ws/modules/rest/client/pom.xml,>
MavenProject: org.apache.airavata:airavata-xbaya-gui:0.6-SNAPSHOT @ <https://builds.apache.org/job/Apache%20Airavata/ws/modules/xbaya-gui/pom.xml,>
MavenProject: org.apache.airavata:airavata-registry-service:0.6-SNAPSHOT @ <https://builds.apache.org/job/Apache%20Airavata/ws/modules/registry/airavata-registry-service/pom.xml,>
MavenProject: org.apache.airavata:airavata-registry-test:0.6-SNAPSHOT @ <https://builds.apache.org/job/Apache%20Airavata/ws/modules/registry/airavata-registry-test/pom.xml,>
MavenProject: org.apache.airavata:airavata-security:0.6-SNAPSHOT @ <https://builds.apache.org/job/Apache%20Airavata/ws/modules/security/pom.xml,>
MavenProject: org.apache.airavata:airavata-rest-services:0.6-SNAPSHOT @ <https://builds.apache.org/job/Apache%20Airavata/ws/modules/rest/service/pom.xml,>
MavenProject: org.apache.airavata:airavata-simple-math-service:0.6-SNAPSHOT @ <https://builds.apache.org/job/Apache%20Airavata/ws/samples/simple-math-service/pom.xml,>
MavenProject: org.apache.airavata:airavata-complex-math-service:0.6-SNAPSHOT @ <https://builds.apache.org/job/Apache%20Airavata/ws/samples/complex-math-service/pom.xml,>
MavenProject: org.apache.airavata:airavata-levenshtein-distance-service:0.6-SNAPSHOT @ <https://builds.apache.org/job/Apache%20Airavata/ws/samples/levenshtein-distance-service/pom.xml,>
MavenProject: org.apache.airavata:airavata-server:0.6-SNAPSHOT @ <https://builds.apache.org/job/Apache%20Airavata/ws/modules/server/pom.xml,>
MavenProject: org.apache.airavata:distribution:0.6-SNAPSHOT @ <https://builds.apache.org/job/Apache%20Airavata/ws/modules/distribution/pom.xml,>
MavenProject: org.apache.airavata:test-suite:0.6-SNAPSHOT @ <https://builds.apache.org/job/Apache%20Airavata/ws/modules/test-suite/pom.xml]>
[JENKINS] Archiving <https://builds.apache.org/job/Apache%20Airavata/ws/modules/commons/workflow-tracking/pom.xml>
to /home/hudson/hudson/jobs/Apache Airavata/modules/org.apache.airavata$airavata-workflow-tracking/builds/2012-12-03_19-24-37/archive/org.apache.airavata/airavata-workflow-tracking/0.6-SNAPSHOT/airavata-workflow-tracking-0.6-SNAPSHOT.pom
[JENKINS] Archiving <https://builds.apache.org/job/Apache%20Airavata/ws/modules/commons/workflow-tracking/target/airavata-workflow-tracking-0.6-SNAPSHOT.jar>
to /home/hudson/hudson/jobs/Apache Airavata/modules/org.apache.airavata$airavata-workflow-tracking/builds/2012-12-03_19-24-37/archive/org.apache.airavata/airavata-workflow-tracking/0.6-SNAPSHOT/airavata-workflow-tracking-0.6-SNAPSHOT.jar
[JENKINS] Archiving <https://builds.apache.org/job/Apache%20Airavata/ws/samples/complex-math-service/pom.xml>
to /home/hudson/hudson/jobs/Apache Airavata/modules/org.apache.airavata$airavata-complex-math-service/builds/2012-12-03_19-24-38/archive/org.apache.airavata/airavata-complex-math-service/0.6-SNAPSHOT/airavata-complex-math-service-0.6-SNAPSHOT.pom
[JENKINS] Archiving <https://builds.apache.org/job/Apache%20Airavata/ws/modules/workflow-model/workflow-model-component-node/pom.xml>
to /home/hudson/hudson/jobs/Apache Airavata/modules/org.apache.airavata$airavata-workflow-model-component-node/builds/2012-12-03_19-24-37/archive/org.apache.airavata/airavata-workflow-model-component-node/0.6-SNAPSHOT/airavata-workflow-model-component-node-0.6-SNAPSHOT.pom
[JENKINS] Archiving <https://builds.apache.org/job/Apache%20Airavata/ws/samples/simple-math-service/pom.xml>
to /home/hudson/hudson/jobs/Apache Airavata/modules/org.apache.airavata$airavata-simple-math-service/builds/2012-12-03_19-24-38/archive/org.apache.airavata/airavata-simple-math-service/0.6-SNAPSHOT/airavata-simple-math-service-0.6-SNAPSHOT.pom
[JENKINS] Archiving <https://builds.apache.org/job/Apache%20Airavata/ws/modules/distribution/pom.xml>
to /home/hudson/hudson/jobs/Apache Airavata/modules/org.apache.airavata$distribution/builds/2012-12-03_19-24-38/archive/org.apache.airavata/distribution/0.6-SNAPSHOT/distribution-0.6-SNAPSHOT.pom
[JENKINS] Archiving <https://builds.apache.org/job/Apache%20Airavata/ws/modules/registry/registry-api/pom.xml>
to /home/hudson/hudson/jobs/Apache Airavata/modules/org.apache.airavata$airavata-registry-api/builds/2012-12-03_19-24-37/archive/org.apache.airavata/airavata-registry-api/0.6-SNAPSHOT/airavata-registry-api-0.6-SNAPSHOT.pom
[JENKINS] Archiving <https://builds.apache.org/job/Apache%20Airavata/ws/modules/registry/registry-api/target/airavata-registry-api-0.6-SNAPSHOT.jar>
to /home/hudson/hudson/jobs/Apache Airavata/modules/org.apache.airavata$airavata-registry-api/builds/2012-12-03_19-24-37/archive/org.apache.airavata/airavata-registry-api/0.6-SNAPSHOT/airavata-registry-api-0.6-SNAPSHOT.jar
[JENKINS] Archiving <https://builds.apache.org/job/Apache%20Airavata/ws/modules/ws-messenger/messagebox/pom.xml>
to /home/hudson/hudson/jobs/Apache Airavata/modules/org.apache.airavata$airavata-message-box/builds/2012-12-03_19-24-37/archive/org.apache.airavata/airavata-message-box/0.6-SNAPSHOT/airavata-message-box-0.6-SNAPSHOT.pom
[JENKINS] Archiving <https://builds.apache.org/job/Apache%20Airavata/ws/modules/gfac-core/pom.xml>
to /home/hudson/hudson/jobs/Apache Airavata/modules/org.apache.airavata$airavata-gfac-core/builds/2012-12-03_19-24-36/archive/org.apache.airavata/airavata-gfac-core/0.6-SNAPSHOT/airavata-gfac-core-0.6-SNAPSHOT.pom
[JENKINS] Archiving <https://builds.apache.org/job/Apache%20Airavata/ws/modules/registry/airavata-registry-test/pom.xml>
to /home/hudson/hudson/jobs/Apache Airavata/modules/org.apache.airavata$airavata-registry-test/builds/2012-12-03_19-24-38/archive/org.apache.airavata/airavata-registry-test/0.6-SNAPSHOT/airavata-registry-test-0.6-SNAPSHOT.pom
[JENKINS] Archiving <https://builds.apache.org/job/Apache%20Airavata/ws/modules/xbaya-gui/pom.xml>
to /home/hudson/hudson/jobs/Apache Airavata/modules/org.apache.airavata$airavata-xbaya-gui/builds/2012-12-03_19-24-37/archive/org.apache.airavata/airavata-xbaya-gui/0.6-SNAPSHOT/airavata-xbaya-gui-0.6-SNAPSHOT.pom
[JENKINS] Archiving <https://builds.apache.org/job/Apache%20Airavata/ws/modules/workflow-model/workflow-model-component/pom.xml>
to /home/hudson/hudson/jobs/Apache Airavata/modules/org.apache.airavata$airavata-workflow-model-component/builds/2012-12-03_19-24-37/archive/org.apache.airavata/airavata-workflow-model-component/0.6-SNAPSHOT/airavata-workflow-model-component-0.6-SNAPSHOT.pom
[JENKINS] Archiving <https://builds.apache.org/job/Apache%20Airavata/ws/modules/security/pom.xml>
to /home/hudson/hudson/jobs/Apache Airavata/modules/org.apache.airavata$airavata-security/builds/2012-12-03_19-24-38/archive/org.apache.airavata/airavata-security/0.6-SNAPSHOT/airavata-security-0.6-SNAPSHOT.pom
[JENKINS] Archiving <https://builds.apache.org/job/Apache%20Airavata/ws/modules/commons/workflow-execution-context/pom.xml>
to /home/hudson/hudson/jobs/Apache Airavata/modules/org.apache.airavata$airavata-workflow-execution-context/builds/2012-12-03_19-24-37/archive/org.apache.airavata/airavata-workflow-execution-context/0.6-SNAPSHOT/airavata-workflow-execution-context-0.6-SNAPSHOT.pom
[JENKINS] Archiving <https://builds.apache.org/job/Apache%20Airavata/ws/modules/commons/workflow-execution-context/target/airavata-workflow-execution-context-0.6-SNAPSHOT.jar>
to /home/hudson/hudson/jobs/Apache Airavata/modules/org.apache.airavata$airavata-workflow-execution-context/builds/2012-12-03_19-24-37/archive/org.apache.airavata/airavata-workflow-execution-context/0.6-SNAPSHOT/airavata-workflow-execution-context-0.6-SNAPSHOT.jar
[JENKINS] Archiving <https://builds.apache.org/job/Apache%20Airavata/ws/modules/gfac-axis2/pom.xml>
to /home/hudson/hudson/jobs/Apache Airavata/modules/org.apache.airavata$airavata-gfac-axis2-interface/builds/2012-12-03_19-24-36/archive/org.apache.airavata/airavata-gfac-axis2-interface/0.6-SNAPSHOT/airavata-gfac-axis2-interface-0.6-SNAPSHOT.pom
[JENKINS] Archiving <https://builds.apache.org/job/Apache%20Airavata/ws/modules/commons/pom.xml>
to /home/hudson/hudson/jobs/Apache Airavata/modules/org.apache.airavata$commons/builds/2012-12-03_19-24-37/archive/org.apache.airavata/commons/0.6-SNAPSHOT/commons-0.6-SNAPSHOT.pom
[JENKINS] Archiving <https://builds.apache.org/job/Apache%20Airavata/ws/modules/ws-messenger/message-monitor/pom.xml>
to /home/hudson/hudson/jobs/Apache Airavata/modules/org.apache.airavata$airavata-message-monitor/builds/2012-12-03_19-24-37/archive/org.apache.airavata/airavata-message-monitor/0.6-SNAPSHOT/airavata-message-monitor-0.6-SNAPSHOT.pom
[JENKINS] Archiving <https://builds.apache.org/job/Apache%20Airavata/ws/modules/ws-messenger/message-monitor/target/airavata-message-monitor-0.6-SNAPSHOT.jar>
to /home/hudson/hudson/jobs/Apache Airavata/modules/org.apache.airavata$airavata-message-monitor/builds/2012-12-03_19-24-37/archive/org.apache.airavata/airavata-message-monitor/0.6-SNAPSHOT/airavata-message-monitor-0.6-SNAPSHOT.jar
[JENKINS] Archiving <https://builds.apache.org/job/Apache%20Airavata/ws/modules/registry/pom.xml>
to /home/hudson/hudson/jobs/Apache Airavata/modules/org.apache.airavata$registry/builds/2012-12-03_19-24-37/archive/org.apache.airavata/registry/0.6-SNAPSHOT/registry-0.6-SNAPSHOT.pom
[JENKINS] Archiving <https://builds.apache.org/job/Apache%20Airavata/ws/modules/ws-messenger/pom.xml>
to /home/hudson/hudson/jobs/Apache Airavata/modules/org.apache.airavata$airavata-ws-messenger/builds/2012-12-03_19-24-36/archive/org.apache.airavata/airavata-ws-messenger/0.6-SNAPSHOT/airavata-ws-messenger-0.6-SNAPSHOT.pom
[JENKINS] Archiving <https://builds.apache.org/job/Apache%20Airavata/ws/modules/rest/service/pom.xml>
to /home/hudson/hudson/jobs/Apache Airavata/modules/org.apache.airavata$airavata-rest-services/builds/2012-12-03_19-24-38/archive/org.apache.airavata/airavata-rest-services/0.6-SNAPSHOT/airavata-rest-services-0.6-SNAPSHOT.pom
[JENKINS] Archiving <https://builds.apache.org/job/Apache%20Airavata/ws/samples/levenshtein-distance-service/pom.xml>
to /home/hudson/hudson/jobs/Apache Airavata/modules/org.apache.airavata$airavata-levenshtein-distance-service/builds/2012-12-03_19-24-38/archive/org.apache.airavata/airavata-levenshtein-distance-service/0.6-SNAPSHOT/airavata-levenshtein-distance-service-0.6-SNAPSHOT.pom
[JENKINS] Archiving <https://builds.apache.org/job/Apache%20Airavata/ws/modules/registry/airavata-jpa-registry/pom.xml>
to /home/hudson/hudson/jobs/Apache Airavata/modules/org.apache.airavata$airavata-jpa-registry/builds/2012-12-03_19-24-37/archive/org.apache.airavata/airavata-jpa-registry/0.6-SNAPSHOT/airavata-jpa-registry-0.6-SNAPSHOT.pom
[JENKINS] Archiving <https://builds.apache.org/job/Apache%20Airavata/ws/modules/commons/utils/pom.xml>
to /home/hudson/hudson/jobs/Apache Airavata/modules/org.apache.airavata$airavata-common-utils/builds/2012-12-03_19-24-37/archive/org.apache.airavata/airavata-common-utils/0.6-SNAPSHOT/airavata-common-utils-0.6-SNAPSHOT.pom
[JENKINS] Archiving <https://builds.apache.org/job/Apache%20Airavata/ws/modules/commons/utils/target/airavata-common-utils-0.6-SNAPSHOT.jar>
to /home/hudson/hudson/jobs/Apache Airavata/modules/org.apache.airavata$airavata-common-utils/builds/2012-12-03_19-24-37/archive/org.apache.airavata/airavata-common-utils/0.6-SNAPSHOT/airavata-common-utils-0.6-SNAPSHOT.jar
[JENKINS] Archiving <https://builds.apache.org/job/Apache%20Airavata/ws/modules/server/pom.xml>
to /home/hudson/hudson/jobs/Apache Airavata/modules/org.apache.airavata$airavata-server/builds/2012-12-03_19-24-38/archive/org.apache.airavata/airavata-server/0.6-SNAPSHOT/airavata-server-0.6-SNAPSHOT.pom
[JENKINS] Archiving <https://builds.apache.org/job/Apache%20Airavata/ws/modules/rest/pom.xml>
to /home/hudson/hudson/jobs/Apache Airavata/modules/org.apache.airavata$rest/builds/2012-12-03_19-24-38/archive/org.apache.airavata/rest/0.6-SNAPSHOT/rest-0.6-SNAPSHOT.pom
[JENKINS] Archiving <https://builds.apache.org/job/Apache%20Airavata/ws/modules/airavata-client/pom.xml>
to /home/hudson/hudson/jobs/Apache Airavata/modules/org.apache.airavata$airavata-client-api/builds/2012-12-03_19-24-38/archive/org.apache.airavata/airavata-client-api/0.6-SNAPSHOT/airavata-client-api-0.6-SNAPSHOT.pom
[JENKINS] Archiving <https://builds.apache.org/job/Apache%20Airavata/ws/modules/airavata-client/target/airavata-client-api-0.6-SNAPSHOT.jar>
to /home/hudson/hudson/jobs/Apache Airavata/modules/org.apache.airavata$airavata-client-api/builds/2012-12-03_19-24-38/archive/org.apache.airavata/airavata-client-api/0.6-SNAPSHOT/airavata-client-api-0.6-SNAPSHOT.jar
[JENKINS] Archiving <https://builds.apache.org/job/Apache%20Airavata/ws/modules/ws-messenger/messagebroker/pom.xml>
to /home/hudson/hudson/jobs/Apache Airavata/modules/org.apache.airavata$airavata-message-broker/builds/2012-12-03_19-24-37/archive/org.apache.airavata/airavata-message-broker/0.6-SNAPSHOT/airavata-message-broker-0.6-SNAPSHOT.pom
[JENKINS] Archiving <https://builds.apache.org/job/Apache%20Airavata/ws/modules/commons/gfac-schema/pom.xml>
to /home/hudson/hudson/jobs/Apache Airavata/modules/org.apache.airavata$airavata-gfac-schema-utils/builds/2012-12-03_19-24-37/archive/org.apache.airavata/airavata-gfac-schema-utils/0.6-SNAPSHOT/airavata-gfac-schema-utils-0.6-SNAPSHOT.pom
[JENKINS] Archiving <https://builds.apache.org/job/Apache%20Airavata/ws/modules/commons/gfac-schema/target/airavata-gfac-schema-utils-0.6-SNAPSHOT.jar>
to /home/hudson/hudson/jobs/Apache Airavata/modules/org.apache.airavata$airavata-gfac-schema-utils/builds/2012-12-03_19-24-37/archive/org.apache.airavata/airavata-gfac-schema-utils/0.6-SNAPSHOT/airavata-gfac-schema-utils-0.6-SNAPSHOT.jar
[JENKINS] Archiving <https://builds.apache.org/job/Apache%20Airavata/ws/modules/rest/mappings/pom.xml>
to /home/hudson/hudson/jobs/Apache Airavata/modules/org.apache.airavata$airavata-rest-mappings/builds/2012-12-03_19-24-38/archive/org.apache.airavata/airavata-rest-mappings/0.6-SNAPSHOT/airavata-rest-mappings-0.6-SNAPSHOT.pom
[JENKINS] Archiving <https://builds.apache.org/job/Apache%20Airavata/ws/modules/workflow-model/pom.xml>
to /home/hudson/hudson/jobs/Apache Airavata/modules/org.apache.airavata$airavata-workflow-model-parent/builds/2012-12-03_19-24-37/archive/org.apache.airavata/airavata-workflow-model-parent/0.6-SNAPSHOT/airavata-workflow-model-parent-0.6-SNAPSHOT.pom
[JENKINS] Archiving <https://builds.apache.org/job/Apache%20Airavata/ws/modules/registry/airavata-registry-service/pom.xml>
to /home/hudson/hudson/jobs/Apache Airavata/modules/org.apache.airavata$airavata-registry-service/builds/2012-12-03_19-24-38/archive/org.apache.airavata/airavata-registry-service/0.6-SNAPSHOT/airavata-registry-service-0.6-SNAPSHOT.pom
[JENKINS] Archiving <https://builds.apache.org/job/Apache%20Airavata/ws/modules/rest/client/pom.xml>
to /home/hudson/hudson/jobs/Apache Airavata/modules/org.apache.airavata$airavata-rest-client/builds/2012-12-03_19-24-38/archive/org.apache.airavata/airavata-rest-client/0.6-SNAPSHOT/airavata-rest-client-0.6-SNAPSHOT.pom
[JENKINS] Archiving <https://builds.apache.org/job/Apache%20Airavata/ws/modules/ws-messenger/client/pom.xml>
to /home/hudson/hudson/jobs/Apache Airavata/modules/org.apache.airavata$airavata-messenger-client/builds/2012-12-03_19-24-37/archive/org.apache.airavata/airavata-messenger-client/0.6-SNAPSHOT/airavata-messenger-client-0.6-SNAPSHOT.pom
[JENKINS] Archiving <https://builds.apache.org/job/Apache%20Airavata/ws/modules/ws-messenger/client/target/airavata-messenger-client-0.6-SNAPSHOT.jar>
to /home/hudson/hudson/jobs/Apache Airavata/modules/org.apache.airavata$airavata-messenger-client/builds/2012-12-03_19-24-37/archive/org.apache.airavata/airavata-messenger-client/0.6-SNAPSHOT/airavata-messenger-client-0.6-SNAPSHOT.jar
[JENKINS] Archiving <https://builds.apache.org/job/Apache%20Airavata/ws/modules/ws-messenger/commons/pom.xml>
to /home/hudson/hudson/jobs/Apache Airavata/modules/org.apache.airavata$airavata-messenger-commons/builds/2012-12-03_19-24-36/archive/org.apache.airavata/airavata-messenger-commons/0.6-SNAPSHOT/airavata-messenger-commons-0.6-SNAPSHOT.pom
[JENKINS] Archiving <https://builds.apache.org/job/Apache%20Airavata/ws/modules/ws-messenger/commons/target/airavata-messenger-commons-0.6-SNAPSHOT.jar>
to /home/hudson/hudson/jobs/Apache Airavata/modules/org.apache.airavata$airavata-messenger-commons/builds/2012-12-03_19-24-36/archive/org.apache.airavata/airavata-messenger-commons/0.6-SNAPSHOT/airavata-messenger-commons-0.6-SNAPSHOT.jar
[JENKINS] Archiving <https://builds.apache.org/job/Apache%20Airavata/ws/modules/workflow-model/workflow-model-core/pom.xml>
to /home/hudson/hudson/jobs/Apache Airavata/modules/org.apache.airavata$airavata-workflow-model-core/builds/2012-12-03_19-24-37/archive/org.apache.airavata/airavata-workflow-model-core/0.6-SNAPSHOT/airavata-workflow-model-core-0.6-SNAPSHOT.pom
[JENKINS] Archiving <https://builds.apache.org/job/Apache%20Airavata/ws/modules/workflow-model/workflow-model-core/target/airavata-workflow-model-core-0.6-SNAPSHOT.jar>
to /home/hudson/hudson/jobs/Apache Airavata/modules/org.apache.airavata$airavata-workflow-model-core/builds/2012-12-03_19-24-37/archive/org.apache.airavata/airavata-workflow-model-core/0.6-SNAPSHOT/airavata-workflow-model-core-0.6-SNAPSHOT.jar
[JENKINS] Archiving <https://builds.apache.org/job/Apache%20Airavata/ws/modules/test-suite/pom.xml>
to /home/hudson/hudson/jobs/Apache Airavata/modules/org.apache.airavata$test-suite/builds/2012-12-03_19-24-38/archive/org.apache.airavata/test-suite/0.6-SNAPSHOT/test-suite-0.6-SNAPSHOT.pom
[JENKINS] Archiving <https://builds.apache.org/job/Apache%20Airavata/ws/pom.xml> to
/home/hudson/hudson/jobs/Apache Airavata/modules/org.apache.airavata$airavata/builds/2012-12-03_19-24-36/archive/org.apache.airavata/airavata/0.6-SNAPSHOT/airavata-0.6-SNAPSHOT.pom
Waiting for Jenkins to finish collecting data
mavenExecutionResult exceptions not empty
message : Failed to execute goal on project airavata-gfac-core: Could not resolve dependencies
for project org.apache.airavata:airavata-gfac-core:jar:0.6-SNAPSHOT: Failed to collect dependencies
for [cog-jglobus:cog-jglobus:jar:1.8.0_1 (compile), cog-4_1_6_rc2:puretls:jar:cog-4_1_6 (compile),
cog-4_1_6_rc2:cryptix32:jar:cog-4_1_6 (compile), cog-4_1_6_rc2:cryptix-asn1:jar:cog-4_1_6
(compile), bouncycastle:bcprov-jdk15:jar:143 (compile), commons-configuration:commons-configuration:jar:1.6
(compile), org.slf4j:slf4j-api:jar:1.7.2 (compile), org.apache.airavata:airavata-gfac-schema-utils:jar:0.6-SNAPSHOT
(compile), org.apache.airavata:airavata-client-api:jar:0.6-SNAPSHOT (compile), org.apache.airavata:airavata-workflow-execution-context:jar:0.6-SNAPSHOT
(compile), org.apache.airavata:airavata-workflow-tracking:jar:0.6-SNAPSHOT (compile), net.schmizz:sshj:jar:0.5.0
(compile), com.amazonaws:aws-java-sdk:jar:1.3.20 (compile), junit:junit:jar:4.7 (test), org.slf4j:jcl-over-slf4j:jar:1.7.2
(test), org.slf4j:slf4j-log4j12:jar:1.7.2 (test), j2ssh:j2ssh-core:jar:0.2.9 (compile), j2ssh:j2ssh-common:jar:0.2.9
(compile), eu.unicore:ogsabes-client:jar:1.5.1-rc3 (compile), eu.unicore:ogsabes-types:jar:1.5.1-rc3
(compile), eu.unicore:uas-client:jar:1.5.1-rc3 (compile), de.fzj.unicore:jsdl-xmlbeans:jar:2.1.0
(compile), eu.unicore:cis-u6-infoprovider-types:jar:1.5.1-rc3 (compile), eu.unicore:uas-types:jar:1.5.1-rc3
(compile), eu.unicore.services:use-wsrfclient:jar:2.1.1 (compile), commons-io:commons-io:jar:2.0.1
(compile), eu.unicore:uftp:jar:1.2.1 (compile)]
cause : Could not resolve dependencies for project org.apache.airavata:airavata-gfac-core:jar:0.6-SNAPSHOT:
Failed to collect dependencies for [cog-jglobus:cog-jglobus:jar:1.8.0_1 (compile), cog-4_1_6_rc2:puretls:jar:cog-4_1_6
(compile), cog-4_1_6_rc2:cryptix32:jar:cog-4_1_6 (compile), cog-4_1_6_rc2:cryptix-asn1:jar:cog-4_1_6
(compile), bouncycastle:bcprov-jdk15:jar:143 (compile), commons-configuration:commons-configuration:jar:1.6
(compile), org.slf4j:slf4j-api:jar:1.7.2 (compile), org.apache.airavata:airavata-gfac-schema-utils:jar:0.6-SNAPSHOT
(compile), org.apache.airavata:airavata-client-api:jar:0.6-SNAPSHOT (compile), org.apache.airavata:airavata-workflow-execution-context:jar:0.6-SNAPSHOT
(compile), org.apache.airavata:airavata-workflow-tracking:jar:0.6-SNAPSHOT (compile), net.schmizz:sshj:jar:0.5.0
(compile), com.amazonaws:aws-java-sdk:jar:1.3.20 (compile), junit:junit:jar:4.7 (test), org.slf4j:jcl-over-slf4j:jar:1.7.2
(test), org.slf4j:slf4j-log4j12:jar:1.7.2 (test), j2ssh:j2ssh-core:jar:0.2.9 (compile), j2ssh:j2ssh-common:jar:0.2.9
(compile), eu.unicore:ogsabes-client:jar:1.5.1-rc3 (compile), eu.unicore:ogsabes-types:jar:1.5.1-rc3
(compile), eu.unicore:uas-client:jar:1.5.1-rc3 (compile), de.fzj.unicore:jsdl-xmlbeans:jar:2.1.0
(compile), eu.unicore:cis-u6-infoprovider-types:jar:1.5.1-rc3 (compile), eu.unicore:uas-types:jar:1.5.1-rc3
(compile), eu.unicore.services:use-wsrfclient:jar:2.1.1 (compile), commons-io:commons-io:jar:2.0.1
(compile), eu.unicore:uftp:jar:1.2.1 (compile)]
Stack trace : 
org.apache.maven.lifecycle.LifecycleExecutionException: Failed to execute goal on project
airavata-gfac-core: Could not resolve dependencies for project org.apache.airavata:airavata-gfac-core:jar:0.6-SNAPSHOT:
Failed to collect dependencies for [cog-jglobus:cog-jglobus:jar:1.8.0_1 (compile), cog-4_1_6_rc2:puretls:jar:cog-4_1_6
(compile), cog-4_1_6_rc2:cryptix32:jar:cog-4_1_6 (compile), cog-4_1_6_rc2:cryptix-asn1:jar:cog-4_1_6
(compile), bouncycastle:bcprov-jdk15:jar:143 (compile), commons-configuration:commons-configuration:jar:1.6
(compile), org.slf4j:slf4j-api:jar:1.7.2 (compile), org.apache.airavata:airavata-gfac-schema-utils:jar:0.6-SNAPSHOT
(compile), org.apache.airavata:airavata-client-api:jar:0.6-SNAPSHOT (compile), org.apache.airavata:airavata-workflow-execution-context:jar:0.6-SNAPSHOT
(compile), org.apache.airavata:airavata-workflow-tracking:jar:0.6-SNAPSHOT (compile), net.schmizz:sshj:jar:0.5.0
(compile), com.amazonaws:aws-java-sdk:jar:1.3.20 (compile), junit:junit:jar:4.7 (test), org.slf4j:jcl-over-slf4j:jar:1.7.2
(test), org.slf4j:slf4j-log4j12:jar:1.7.2 (test), j2ssh:j2ssh-core:jar:0.2.9 (compile), j2ssh:j2ssh-common:jar:0.2.9
(compile), eu.unicore:ogsabes-client:jar:1.5.1-rc3 (compile), eu.unicore:ogsabes-types:jar:1.5.1-rc3
(compile), eu.unicore:uas-client:jar:1.5.1-rc3 (compile), de.fzj.unicore:jsdl-xmlbeans:jar:2.1.0
(compile), eu.unicore:cis-u6-infoprovider-types:jar:1.5.1-rc3 (compile), eu.unicore:uas-types:jar:1.5.1-rc3
(compile), eu.unicore.services:use-wsrfclient:jar:2.1.1 (compile), commons-io:commons-io:jar:2.0.1
(compile), eu.unicore:uftp:jar:1.2.1 (compile)]
	at org.apache.maven.lifecycle.internal.LifecycleDependencyResolver.getDependencies(LifecycleDependencyResolver.java:196)
	at org.apache.maven.lifecycle.internal.LifecycleDependencyResolver.resolveProjectDependencies(LifecycleDependencyResolver.java:108)
	at org.apache.maven.lifecycle.internal.MojoExecutor.ensureDependenciesAreResolved(MojoExecutor.java:258)
	at org.apache.maven.lifecycle.internal.MojoExecutor.execute(MojoExecutor.java:201)
	at org.apache.maven.lifecycle.internal.MojoExecutor.execute(MojoExecutor.java:153)
	at org.apache.maven.lifecycle.internal.MojoExecutor.execute(MojoExecutor.java:145)
	at org.apache.maven.lifecycle.internal.LifecycleModuleBuilder.buildProject(LifecycleModuleBuilder.java:84)
	at org.apache.maven.lifecycle.internal.LifecycleModuleBuilder.buildProject(LifecycleModuleBuilder.java:59)
	at org.apache.maven.lifecycle.internal.LifecycleStarter.singleThreadedBuild(LifecycleStarter.java:183)
	at org.apache.maven.lifecycle.internal.LifecycleStarter.execute(LifecycleStarter.java:161)
	at org.apache.maven.DefaultMaven.doExecute(DefaultMaven.java:319)
	at org.apache.maven.DefaultMaven.execute(DefaultMaven.java:156)
	at org.jvnet.hudson.maven3.launcher.Maven3Launcher.main(Maven3Launcher.java:79)
	at sun.reflect.NativeMethodAccessorImpl.invoke0(Native Method)
	at sun.reflect.NativeMethodAccessorImpl.invoke(NativeMethodAccessorImpl.java:39)
	at sun.reflect.DelegatingMethodAccessorImpl.invoke(DelegatingMethodAccessorImpl.java:25)
	at java.lang.reflect.Method.invoke(Method.java:597)
	at org.codehaus.plexus.classworlds.launcher.Launcher.launchStandard(Launcher.java:329)
	at org.codehaus.plexus.classworlds.launcher.Launcher.launch(Launcher.java:239)
	at org.jvnet.hudson.maven3.agent.Maven3Main.launch(Maven3Main.java:158)
	at hudson.maven.Maven3Builder.call(Maven3Builder.java:98)
	at hudson.maven.Maven3Builder.call(Maven3Builder.java:64)
	at hudson.remoting.UserRequest.perform(UserRequest.java:118)
	at hudson.remoting.UserRequest.perform(UserRequest.java:48)
	at hudson.remoting.Request$2.run(Request.java:326)
	at hudson.remoting.InterceptingExecutorService$1.call(InterceptingExecutorService.java:72)
	at java.util.concurrent.FutureTask$Sync.innerRun(FutureTask.java:303)
	at java.util.concurrent.FutureTask.run(FutureTask.java:138)
	at java.util.concurrent.ThreadPoolExecutor$Worker.runTask(ThreadPoolExecutor.java:886)
	at java.util.concurrent.ThreadPoolExecutor$Worker.run(ThreadPoolExecutor.java:908)
	at java.lang.Thread.run(Thread.java:662)
Caused by: org.apache.maven.project.DependencyResolutionException: Could not resolve dependencies
for project org.apache.airavata:airavata-gfac-core:jar:0.6-SNAPSHOT: Failed to collect dependencies
for [cog-jglobus:cog-jglobus:jar:1.8.0_1 (compile), cog-4_1_6_rc2:puretls:jar:cog-4_1_6 (compile),
cog-4_1_6_rc2:cryptix32:jar:cog-4_1_6 (compile), cog-4_1_6_rc2:cryptix-asn1:jar:cog-4_1_6
(compile), bouncycastle:bcprov-jdk15:jar:143 (compile), commons-configuration:commons-configuration:jar:1.6
(compile), org.slf4j:slf4j-api:jar:1.7.2 (compile), org.apache.airavata:airavata-gfac-schema-utils:jar:0.6-SNAPSHOT
(compile), org.apache.airavata:airavata-client-api:jar:0.6-SNAPSHOT (compile), org.apache.airavata:airavata-workflow-execution-context:jar:0.6-SNAPSHOT
(compile), org.apache.airavata:airavata-workflow-tracking:jar:0.6-SNAPSHOT (compile), net.schmizz:sshj:jar:0.5.0
(compile), com.amazonaws:aws-java-sdk:jar:1.3.20 (compile), junit:junit:jar:4.7 (test), org.slf4j:jcl-over-slf4j:jar:1.7.2
(test), org.slf4j:slf4j-log4j12:jar:1.7.2 (test), j2ssh:j2ssh-core:jar:0.2.9 (compile), j2ssh:j2ssh-common:jar:0.2.9
(compile), eu.unicore:ogsabes-client:jar:1.5.1-rc3 (compile), eu.unicore:ogsabes-types:jar:1.5.1-rc3
(compile), eu.unicore:uas-client:jar:1.5.1-rc3 (compile), de.fzj.unicore:jsdl-xmlbeans:jar:2.1.0
(compile), eu.unicore:cis-u6-infoprovider-types:jar:1.5.1-rc3 (compile), eu.unicore:uas-types:jar:1.5.1-rc3
(compile), eu.unicore.services:use-wsrfclient:jar:2.1.1 (compile), commons-io:commons-io:jar:2.0.1
(compile), eu.unicore:uftp:jar:1.2.1 (compile)]
	at org.apache.maven.project.DefaultProjectDependenciesResolver.resolve(DefaultProjectDependenciesResolver.java:139)
	at org.apache.maven.lifecycle.internal.LifecycleDependencyResolver.getDependencies(LifecycleDependencyResolver.java:171)
	... 30 more
Caused by: org.sonatype.aether.collection.DependencyCollectionException: Failed to collect
dependencies for [cog-jglobus:cog-jglobus:jar:1.8.0_1 (compile), cog-4_1_6_rc2:puretls:jar:cog-4_1_6
(compile), cog-4_1_6_rc2:cryptix32:jar:cog-4_1_6 (compile), cog-4_1_6_rc2:cryptix-asn1:jar:cog-4_1_6
(compile), bouncycastle:bcprov-jdk15:jar:143 (compile), commons-configuration:commons-configuration:jar:1.6
(compile), org.slf4j:slf4j-api:jar:1.7.2 (compile), org.apache.airavata:airavata-gfac-schema-utils:jar:0.6-SNAPSHOT
(compile), org.apache.airavata:airavata-client-api:jar:0.6-SNAPSHOT (compile), org.apache.airavata:airavata-workflow-execution-context:jar:0.6-SNAPSHOT
(compile), org.apache.airavata:airavata-workflow-tracking:jar:0.6-SNAPSHOT (compile), net.schmizz:sshj:jar:0.5.0
(compile), com.amazonaws:aws-java-sdk:jar:1.3.20 (compile), junit:junit:jar:4.7 (test), org.slf4j:jcl-over-slf4j:jar:1.7.2
(test), org.slf4j:slf4j-log4j12:jar:1.7.2 (test), j2ssh:j2ssh-core:jar:0.2.9 (compile), j2ssh:j2ssh-common:jar:0.2.9
(compile), eu.unicore:ogsabes-client:jar:1.5.1-rc3 (compile), eu.unicore:ogsabes-types:jar:1.5.1-rc3
(compile), eu.unicore:uas-client:jar:1.5.1-rc3 (compile), de.fzj.unicore:jsdl-xmlbeans:jar:2.1.0
(compile), eu.unicore:cis-u6-infoprovider-types:jar:1.5.1-rc3 (compile), eu.unicore:uas-types:jar:1.5.1-rc3
(compile), eu.unicore.services:use-wsrfclient:jar:2.1.1 (compile), commons-io:commons-io:jar:2.0.1
(compile), eu.unicore:uftp:jar:1.2.1 (compile)]
	at org.sonatype.aether.impl.internal.DefaultDependencyCollector.collectDependencies(DefaultDependencyCollector.java:262)
	at org.sonatype.aether.impl.internal.DefaultRepositorySystem.collectDependencies(DefaultRepositorySystem.java:345)
	at org.apache.maven.project.DefaultProjectDependenciesResolver.resolve(DefaultProjectDependenciesResolver.java:131)
	... 31 more
Caused by: org.sonatype.aether.resolution.ArtifactDescriptorException: Failed to read artifact
descriptor for net.sf.saxon:saxon:jar:9
	at org.apache.maven.repository.internal.DefaultArtifactDescriptorReader.loadPom(DefaultArtifactDescriptorReader.java:282)
	at org.apache.maven.repository.internal.DefaultArtifactDescriptorReader.readArtifactDescriptor(DefaultArtifactDescriptorReader.java:172)
	at org.sonatype.aether.impl.internal.DefaultDependencyCollector.process(DefaultDependencyCollector.java:419)
	at org.sonatype.aether.impl.internal.DefaultDependencyCollector.process(DefaultDependencyCollector.java:533)
	at org.sonatype.aether.impl.internal.DefaultDependencyCollector.process(DefaultDependencyCollector.java:533)
	at org.sonatype.aether.impl.internal.DefaultDependencyCollector.process(DefaultDependencyCollector.java:533)
	at org.sonatype.aether.impl.internal.DefaultDependencyCollector.process(DefaultDependencyCollector.java:533)
	at org.sonatype.aether.impl.internal.DefaultDependencyCollector.collectDependencies(DefaultDependencyCollector.java:243)
	... 33 more
Caused by: org.sonatype.aether.resolution.ArtifactResolutionException: Could not transfer
artifact net.sf.saxon:saxon:pom:9 from/to java.net (http://repository.jboss.com/maven2/):
Access denied to: http://repository.jboss.com/maven2/net/sf/saxon/saxon/9/saxon-9.pom
	at org.sonatype.aether.impl.internal.DefaultArtifactResolver.resolve(DefaultArtifactResolver.java:541)
	at org.sonatype.aether.impl.internal.DefaultArtifactResolver.resolveArtifacts(DefaultArtifactResolver.java:220)
	at org.sonatype.aether.impl.internal.DefaultArtifactResolver.resolveArtifact(DefaultArtifactResolver.java:197)
	at org.apache.maven.repository.internal.DefaultArtifactDescriptorReader.loadPom(DefaultArtifactDescriptorReader.java:267)
	... 40 more
Caused by: org.sonatype.aether.transfer.ArtifactTransferException: Could not transfer artifact
net.sf.saxon:saxon:pom:9 from/to java.net (http://repository.jboss.com/maven2/): Access denied
to: http://repository.jboss.com/maven2/net/sf/saxon/saxon/9/saxon-9.pom
	at org.sonatype.aether.connector.wagon.WagonRepositoryConnector$4.wrap(WagonRepositoryConnector.java:949)
	at org.sonatype.aether.connector.wagon.WagonRepositoryConnector$4.wrap(WagonRepositoryConnector.java:940)
	at org.sonatype.aether.connector.wagon.WagonRepositoryConnector$GetTask.flush(WagonRepositoryConnector.java:695)
	at org.sonatype.aether.connector.wagon.WagonRepositoryConnector$GetTask.flush(WagonRepositoryConnector.java:689)
	at org.sonatype.aether.connector.wagon.WagonRepositoryConnector.get(WagonRepositoryConnector.java:445)
	at org.sonatype.aether.impl.internal.DefaultArtifactResolver.resolve(DefaultArtifactResolver.java:460)
	... 43 more
Caused by: org.apache.maven.wagon.authorization.AuthorizationException: Access denied to:
http://repository.jboss.com/maven2/net/sf/saxon/saxon/9/saxon-9.pom
	at org.apache.maven.wagon.providers.http.LightweightHttpWagon.fillInputData(LightweightHttpWagon.java:119)
	at org.apache.maven.wagon.StreamWagon.getInputStream(StreamWagon.java:116)
	at org.apache.maven.wagon.StreamWagon.getIfNewer(StreamWagon.java:88)
	at org.apache.maven.wagon.StreamWagon.get(StreamWagon.java:61)
	at org.sonatype.aether.connector.wagon.WagonRepositoryConnector$GetTask.run(WagonRepositoryConnector.java:608)
	at org.sonatype.aether.util.concurrency.RunnableErrorForwarder$1.run(RunnableErrorForwarder.java:64)
	... 3 more
Sending e-mails to: dev@airavata.apache.org
channel stopped

Mime
View raw message