airavata-dev mailing list archives

Site index · List index
Message view « Date » · « Thread »
Top « Date » · « Thread »
From Apache Jenkins Server <jenk...@builds.apache.org>
Subject Build failed in Jenkins: Apache Airavata #837
Date Wed, 14 Nov 2012 21:21:51 GMT
See <https://builds.apache.org/job/Apache%20Airavata/837/changes>

Changes:

[lahiru] committing amilas patch for https://issues.apache.org/jira/browse/AIRAVATA-560.

[chathuri] updating rest client methods

------------------------------------------
[...truncated 4879 lines...]
mojoStarted org.apache.maven.plugins:maven-resources-plugin:2.5(default-testResources)[INFO]
Using 'UTF-8' encoding to copy filtered resources.
[INFO] Copying 1 resource
[INFO] Copying 3 resources

[INFO] 
[INFO] --- maven-resources-plugin:2.5:testResources (default-testResources) @ airavata-client-api
---
mojoSucceeded org.apache.maven.plugins:maven-resources-plugin:2.5(default-testResources)
mojoStarted org.apache.maven.plugins:maven-compiler-plugin:2.3.2(default-testCompile)[INFO]
Compiling 1 source file to <https://builds.apache.org/job/Apache%20Airavata/ws/modules/airavata-client/target/test-classes>

[INFO] 
[INFO] --- maven-compiler-plugin:2.3.2:testCompile (default-testCompile) @ airavata-client-api
---
mojoSucceeded org.apache.maven.plugins:maven-compiler-plugin:2.3.2(default-testCompile)
mojoStarted org.apache.maven.plugins:maven-surefire-plugin:2.12(default-test)[INFO] Surefire
report directory: <https://builds.apache.org/job/Apache%20Airavata/ws/modules/airavata-client/target/surefire-reports>

-------------------------------------------------------
 T E S T S
-------------------------------------------------------

[INFO] 
[INFO] --- maven-surefire-plugin:2.12:test (default-test) @ airavata-client-api ---
Running org.apache.airavata.client.airavata.AiravataClientTest
Tests run: 2, Failures: 0, Errors: 0, Skipped: 0, Time elapsed: 0.036 sec

Results :

Tests run: 2, Failures: 0, Errors: 0, Skipped: 0

mojoSucceeded org.apache.maven.plugins:maven-surefire-plugin:2.12(default-test)
[JENKINS] Recording test results
mojoStarted org.apache.maven.plugins:maven-jar-plugin:2.3.1(default-jar)
[INFO] 
[INFO] --- maven-jar-plugin:2.3.1:jar (default-jar) @ airavata-client-api ---
[INFO] Building jar: <https://builds.apache.org/job/Apache%20Airavata/ws/modules/airavata-client/target/airavata-client-api-0.6-SNAPSHOT.jar>
mojoSucceeded org.apache.maven.plugins:maven-jar-plugin:2.3.1(default-jar)
mojoStarted org.apache.maven.plugins:maven-site-plugin:3.0(attach-descriptor)
[INFO] 
[INFO] --- maven-site-plugin:3.0:attach-descriptor (attach-descriptor) @ airavata-client-api
---
mojoSucceeded org.apache.maven.plugins:maven-site-plugin:3.0(attach-descriptor)
mojoStarted org.apache.maven.plugins:maven-install-plugin:2.3.1(default-install)[INFO] Installing
<https://builds.apache.org/job/Apache%20Airavata/ws/modules/airavata-client/target/airavata-client-api-0.6-SNAPSHOT.jar>
to /home/hudson/hudson-slave/maven-repositories/0/org/apache/airavata/airavata-client-api/0.6-SNAPSHOT/airavata-client-api-0.6-SNAPSHOT.jar
[INFO] Installing <https://builds.apache.org/job/Apache%20Airavata/ws/modules/airavata-client/pom.xml>
to /home/hudson/hudson-slave/maven-repositories/0/org/apache/airavata/airavata-client-api/0.6-SNAPSHOT/airavata-client-api-0.6-SNAPSHOT.pom

[INFO] 
[INFO] --- maven-install-plugin:2.3.1:install (default-install) @ airavata-client-api ---
mojoSucceeded org.apache.maven.plugins:maven-install-plugin:2.3.1(default-install)
projectSucceeded org.apache.airavata:airavata-client-api:0.6-SNAPSHOT
projectStarted org.apache.airavata:airavata-rest-services:0.6-SNAPSHOT
[INFO]                                                                         
[INFO] ------------------------------------------------------------------------
[INFO] Building airavata-rest-services 0.6-SNAPSHOT
[INFO] ------------------------------------------------------------------------
Downloading: http://repo1.maven.org/maven2/com/sun/jersey/contribs/jersey-multipart/1.13/jersey-multipart-1.13.pom
Downloaded: http://repo1.maven.org/maven2/com/sun/jersey/contribs/jersey-multipart/1.13/jersey-multipart-1.13.pom
(9 KB at 227.4 KB/sec)
Downloading: http://repo1.maven.org/maven2/com/sun/jersey/jersey-test-framework/jersey-test-framework-grizzly2/1.13/jersey-test-framework-grizzly2-1.13.pom
Downloaded: http://repo1.maven.org/maven2/com/sun/jersey/jersey-test-framework/jersey-test-framework-grizzly2/1.13/jersey-test-framework-grizzly2-1.13.pom
(7 KB at 25.9 KB/sec)
Downloading: http://repo1.maven.org/maven2/com/sun/jersey/jersey-test-framework/1.13/jersey-test-framework-1.13.pom
Downloaded: http://repo1.maven.org/maven2/com/sun/jersey/jersey-test-framework/1.13/jersey-test-framework-1.13.pom
(3 KB at 88.0 KB/sec)
Downloading: http://repo1.maven.org/maven2/com/sun/jersey/jersey-test-framework/jersey-test-framework-core/1.13/jersey-test-framework-core-1.13.pom
Downloaded: http://repo1.maven.org/maven2/com/sun/jersey/jersey-test-framework/jersey-test-framework-core/1.13/jersey-test-framework-core-1.13.pom
(7 KB at 92.8 KB/sec)
Downloading: http://repo1.maven.org/maven2/com/sun/jersey/jersey-grizzly2-servlet/1.13/jersey-grizzly2-servlet-1.13.pom
Downloaded: http://repo1.maven.org/maven2/com/sun/jersey/jersey-grizzly2-servlet/1.13/jersey-grizzly2-servlet-1.13.pom
(6 KB at 65.7 KB/sec)
Downloading: http://repo1.maven.org/maven2/org/glassfish/grizzly/grizzly-http-servlet/2.2.4/grizzly-http-servlet-2.2.4.pom
Downloaded: http://repo1.maven.org/maven2/org/glassfish/grizzly/grizzly-http-servlet/2.2.4/grizzly-http-servlet-2.2.4.pom
(7 KB at 42.6 KB/sec)
Downloading: http://repo1.maven.org/maven2/org/glassfish/grizzly/grizzly-project/2.2.4/grizzly-project-2.2.4.pom
Downloaded: http://repo1.maven.org/maven2/org/glassfish/grizzly/grizzly-project/2.2.4/grizzly-project-2.2.4.pom
(18 KB at 54.8 KB/sec)
Downloading: http://repo1.maven.org/maven2/org/glassfish/grizzly/grizzly-http-server/2.2.4/grizzly-http-server-2.2.4.pom
Downloaded: http://repo1.maven.org/maven2/org/glassfish/grizzly/grizzly-http-server/2.2.4/grizzly-http-server-2.2.4.pom
(5 KB at 18.5 KB/sec)
Downloading: http://repo1.maven.org/maven2/org/glassfish/grizzly/grizzly-http/2.2.4/grizzly-http-2.2.4.pom
Downloaded: http://repo1.maven.org/maven2/org/glassfish/grizzly/grizzly-http/2.2.4/grizzly-http-2.2.4.pom
(5 KB at 8.7 KB/sec)
Downloading: http://repo1.maven.org/maven2/org/glassfish/grizzly/grizzly-framework/2.2.4/grizzly-framework-2.2.4.pom
Downloaded: http://repo1.maven.org/maven2/org/glassfish/grizzly/grizzly-framework/2.2.4/grizzly-framework-2.2.4.pom
(7 KB at 57.3 KB/sec)
Downloading: http://repo1.maven.org/maven2/org/glassfish/grizzly/grizzly-rcm/2.2.4/grizzly-rcm-2.2.4.pom
Downloaded: http://repo1.maven.org/maven2/org/glassfish/grizzly/grizzly-rcm/2.2.4/grizzly-rcm-2.2.4.pom
(4 KB at 4.2 KB/sec)
Downloading: http://repo1.maven.org/maven2/com/sun/jersey/jersey-grizzly2/1.13/jersey-grizzly2-1.13.pom
Downloaded: http://repo1.maven.org/maven2/com/sun/jersey/jersey-grizzly2/1.13/jersey-grizzly2-1.13.pom
(6 KB at 62.3 KB/sec)
Downloading: http://maven.ow2.org/maven2/org/apache/airavata/airavata-security/0.6-SNAPSHOT/maven-metadata.xml
Downloading: http://repository.apache.org/snapshots/org/apache/airavata/airavata-security/0.6-SNAPSHOT/maven-metadata.xml
Downloading: http://maven.ow2.org/maven2/org/apache/airavata/airavata-security/0.6-SNAPSHOT/airavata-security-0.6-SNAPSHOT.pom
Downloading: http://repository.apache.org/snapshots/org/apache/airavata/airavata-security/0.6-SNAPSHOT/airavata-security-0.6-SNAPSHOT.pom
[WARNING] The POM for org.apache.airavata:airavata-security:jar:0.6-SNAPSHOT is missing, no
dependency information available
Downloading: http://repo1.maven.org/maven2/com/sun/jersey/contribs/jersey-multipart/1.13/jersey-multipart-1.13.jar
Downloading: http://repo1.maven.org/maven2/com/sun/jersey/jersey-test-framework/jersey-test-framework-grizzly2/1.13/jersey-test-framework-grizzly2-1.13.jar
Downloading: http://repo1.maven.org/maven2/com/sun/jersey/jersey-test-framework/jersey-test-framework-core/1.13/jersey-test-framework-core-1.13.jar
Downloading: http://repo1.maven.org/maven2/com/sun/jersey/jersey-grizzly2-servlet/1.13/jersey-grizzly2-servlet-1.13.jar
Downloading: http://repo1.maven.org/maven2/org/glassfish/grizzly/grizzly-http-servlet/2.2.4/grizzly-http-servlet-2.2.4.jar
Downloaded: http://repo1.maven.org/maven2/com/sun/jersey/contribs/jersey-multipart/1.13/jersey-multipart-1.13.jar
(52 KB at 2550.3 KB/sec)
Downloading: http://repo1.maven.org/maven2/org/glassfish/grizzly/grizzly-http-server/2.2.4/grizzly-http-server-2.2.4.jar
Downloaded: http://repo1.maven.org/maven2/com/sun/jersey/jersey-test-framework/jersey-test-framework-core/1.13/jersey-test-framework-core-1.13.jar
(29 KB at 818.6 KB/sec)
Downloading: http://repo1.maven.org/maven2/org/glassfish/grizzly/grizzly-rcm/2.2.4/grizzly-rcm-2.2.4.jar
Downloaded: http://repo1.maven.org/maven2/org/glassfish/grizzly/grizzly-http-servlet/2.2.4/grizzly-http-servlet-2.2.4.jar
(159 KB at 1703.2 KB/sec)
Downloading: http://repo1.maven.org/maven2/com/sun/jersey/jersey-grizzly2/1.13/jersey-grizzly2-1.13.jar
Downloaded: http://repo1.maven.org/maven2/com/sun/jersey/jersey-grizzly2-servlet/1.13/jersey-grizzly2-servlet-1.13.jar
(6 KB at 61.7 KB/sec)
Downloading: http://repo1.maven.org/maven2/org/glassfish/grizzly/grizzly-http/2.2.4/grizzly-http-2.2.4.jar
Downloaded: http://repo1.maven.org/maven2/com/sun/jersey/jersey-grizzly2/1.13/jersey-grizzly2-1.13.jar
(15 KB at 191.7 KB/sec)
Downloading: http://repo1.maven.org/maven2/org/glassfish/grizzly/grizzly-framework/2.2.4/grizzly-framework-2.2.4.jar
Downloaded: http://repo1.maven.org/maven2/com/sun/jersey/jersey-test-framework/jersey-test-framework-grizzly2/1.13/jersey-test-framework-grizzly2-1.13.jar
(15 KB at 55.3 KB/sec)
Downloading: http://repo1.maven.org/maven2/org/glassfish/javax.servlet/3.1/javax.servlet-3.1.jar
Downloaded: http://repo1.maven.org/maven2/org/glassfish/grizzly/grizzly-framework/2.2.4/grizzly-framework-2.2.4.jar
(720 KB at 6094.1 KB/sec)
Downloaded: http://repo1.maven.org/maven2/org/glassfish/grizzly/grizzly-rcm/2.2.4/grizzly-rcm-2.2.4.jar
(8 KB at 25.1 KB/sec)
Downloaded: http://repo1.maven.org/maven2/org/glassfish/javax.servlet/3.1/javax.servlet-3.1.jar
(82 KB at 565.4 KB/sec)
Downloaded: http://repo1.maven.org/maven2/org/glassfish/grizzly/grizzly-http/2.2.4/grizzly-http-2.2.4.jar
(253 KB at 672.7 KB/sec)
Downloaded: http://repo1.maven.org/maven2/org/glassfish/grizzly/grizzly-http-server/2.2.4/grizzly-http-server-2.2.4.jar
(206 KB at 412.8 KB/sec)
Downloading: http://maven.ow2.org/maven2/org/apache/airavata/airavata-security/0.6-SNAPSHOT/airavata-security-0.6-SNAPSHOT.jar
Downloading: http://repository.apache.org/snapshots/org/apache/airavata/airavata-security/0.6-SNAPSHOT/airavata-security-0.6-SNAPSHOT.jar
projectFailed org.apache.airavata:airavata-rest-services:0.6-SNAPSHOT
sessionEnded
[INFO] ------------------------------------------------------------------------
[INFO] Reactor Summary:
[INFO] 
[INFO] Airavata .......................................... SUCCESS [28.308s]
[INFO] Airavata Commons .................................. SUCCESS [1.565s]
[INFO] Airavata GFac Schema Utilities .................... SUCCESS [28.180s]
[INFO] Airavata Common Utilities ......................... SUCCESS [8.001s]
[INFO] Airavata Registry ................................. SUCCESS [0.927s]
[INFO] Airavata Registry API ............................. SUCCESS [3.941s]
[INFO] Airavata Workflow Execution Context ............... SUCCESS [5.931s]
[INFO] Airavata WS Messenger ............................. SUCCESS [1.028s]
[INFO] Airavata Messenger Commons ........................ SUCCESS [3.772s]
[INFO] Airavata Messenger Client ......................... SUCCESS [6.110s]
[INFO] Airavata Workflow Tracking ........................ SUCCESS [7.498s]
[INFO] Airavata JPA Registry ............................. SUCCESS [20.735s]
[INFO] Airavata GFac Core ................................ SUCCESS [9.319s]
[INFO] Airavata GFac Axis2 Interface ..................... SUCCESS [4.443s]
[INFO] Airavata Message Box .............................. SUCCESS [10.739s]
[INFO] Airavata Message Broker ........................... SUCCESS [30.072s]
[INFO] Airavata Workflow Model Parent .................... SUCCESS [0.790s]
[INFO] Airavata Workflow Model Core ...................... SUCCESS [9.137s]
[INFO] Airavata XBaya .................................... SUCCESS [1:34.364s]
[INFO] Airavata Registry Service ......................... SUCCESS [4.381s]
[INFO] Airavata Registry Test ............................ SUCCESS [22.156s]
[INFO] Airavata Client ................................... SUCCESS [8.119s]
[INFO] airavata-rest-services ............................ FAILURE [6.414s]
[INFO] Simple Math Service ............................... SKIPPED
[INFO] Complex Math Service .............................. SKIPPED
[INFO] Levenshtein Distance Service ...................... SKIPPED
[INFO] distribution ...................................... SKIPPED
[INFO] Airavata Test Suite ............................... SKIPPED
[INFO] ------------------------------------------------------------------------
[INFO] BUILD FAILURE
[INFO] ------------------------------------------------------------------------
[INFO] Total time: 5:23.658s
[INFO] Finished at: Wed Nov 14 21:18:28 UTC 2012
[INFO] Final Memory: 79M/248M
[INFO] ------------------------------------------------------------------------
Projects to build: [MavenProject: org.apache.airavata:airavata:0.6-SNAPSHOT @ <https://builds.apache.org/job/Apache%20Airavata/ws/pom.xml,>
MavenProject: org.apache.airavata:commons:0.6-SNAPSHOT @ <https://builds.apache.org/job/Apache%20Airavata/ws/modules/commons/pom.xml,>
MavenProject: org.apache.airavata:airavata-gfac-schema-utils:0.6-SNAPSHOT @ <https://builds.apache.org/job/Apache%20Airavata/ws/modules/commons/gfac-schema/pom.xml,>
MavenProject: org.apache.airavata:airavata-common-utils:0.6-SNAPSHOT @ <https://builds.apache.org/job/Apache%20Airavata/ws/modules/commons/utils/pom.xml,>
MavenProject: org.apache.airavata:registry:0.6-SNAPSHOT @ <https://builds.apache.org/job/Apache%20Airavata/ws/modules/registry/pom.xml,>
MavenProject: org.apache.airavata:airavata-registry-api:0.6-SNAPSHOT @ <https://builds.apache.org/job/Apache%20Airavata/ws/modules/registry/registry-api/pom.xml,>
MavenProject: org.apache.airavata:airavata-workflow-execution-context:0.6-SNAPSHOT @ <https://builds.apache.org/job/Apache%20Airavata/ws/modules/commons/workflow-execution-context/pom.xml,>
MavenProject: org.apache.airavata:airavata-ws-messenger:0.6-SNAPSHOT @ <https://builds.apache.org/job/Apache%20Airavata/ws/modules/ws-messenger/pom.xml,>
MavenProject: org.apache.airavata:airavata-messenger-commons:0.6-SNAPSHOT @ <https://builds.apache.org/job/Apache%20Airavata/ws/modules/ws-messenger/commons/pom.xml,>
MavenProject: org.apache.airavata:airavata-messenger-client:0.6-SNAPSHOT @ <https://builds.apache.org/job/Apache%20Airavata/ws/modules/ws-messenger/client/pom.xml,>
MavenProject: org.apache.airavata:airavata-workflow-tracking:0.6-SNAPSHOT @ <https://builds.apache.org/job/Apache%20Airavata/ws/modules/commons/workflow-tracking/pom.xml,>
MavenProject: org.apache.airavata:airavata-jpa-registry:0.6-SNAPSHOT @ <https://builds.apache.org/job/Apache%20Airavata/ws/modules/registry/airavata-jpa-registry/pom.xml,>
MavenProject: org.apache.airavata:airavata-gfac-core:0.6-SNAPSHOT @ <https://builds.apache.org/job/Apache%20Airavata/ws/modules/gfac-core/pom.xml,>
MavenProject: org.apache.airavata:airavata-gfac-axis2-interface:0.6-SNAPSHOT @ <https://builds.apache.org/job/Apache%20Airavata/ws/modules/gfac-axis2/pom.xml,>
MavenProject: org.apache.airavata:airavata-message-box:0.6-SNAPSHOT @ <https://builds.apache.org/job/Apache%20Airavata/ws/modules/ws-messenger/messagebox/pom.xml,>
MavenProject: org.apache.airavata:airavata-message-broker:0.6-SNAPSHOT @ <https://builds.apache.org/job/Apache%20Airavata/ws/modules/ws-messenger/messagebroker/pom.xml,>
MavenProject: org.apache.airavata:airavata-workflow-model-parent:0.6-SNAPSHOT @ <https://builds.apache.org/job/Apache%20Airavata/ws/modules/workflow-model/pom.xml,>
MavenProject: org.apache.airavata:airavata-workflow-model-core:0.6-SNAPSHOT @ <https://builds.apache.org/job/Apache%20Airavata/ws/modules/workflow-model/workflow-model-core/pom.xml,>
MavenProject: org.apache.airavata:airavata-xbaya-gui:0.6-SNAPSHOT @ <https://builds.apache.org/job/Apache%20Airavata/ws/modules/xbaya-gui/pom.xml,>
MavenProject: org.apache.airavata:airavata-registry-service:0.6-SNAPSHOT @ <https://builds.apache.org/job/Apache%20Airavata/ws/modules/registry/airavata-registry-service/pom.xml,>
MavenProject: org.apache.airavata:airavata-registry-test:0.6-SNAPSHOT @ <https://builds.apache.org/job/Apache%20Airavata/ws/modules/registry/airavata-registry-test/pom.xml,>
MavenProject: org.apache.airavata:airavata-client-api:0.6-SNAPSHOT @ <https://builds.apache.org/job/Apache%20Airavata/ws/modules/airavata-client/pom.xml,>
MavenProject: org.apache.airavata:airavata-rest-services:0.6-SNAPSHOT @ <https://builds.apache.org/job/Apache%20Airavata/ws/modules/airavata-rest-services/pom.xml,>
MavenProject: org.apache.airavata:airavata-simple-math-service:0.6-SNAPSHOT @ <https://builds.apache.org/job/Apache%20Airavata/ws/samples/simple-math-service/pom.xml,>
MavenProject: org.apache.airavata:airavata-complex-math-service:0.6-SNAPSHOT @ <https://builds.apache.org/job/Apache%20Airavata/ws/samples/complex-math-service/pom.xml,>
MavenProject: org.apache.airavata:airavata-levenshtein-distance-service:0.6-SNAPSHOT @ <https://builds.apache.org/job/Apache%20Airavata/ws/samples/levenshtein-distance-service/pom.xml,>
MavenProject: org.apache.airavata:distribution:0.6-SNAPSHOT @ <https://builds.apache.org/job/Apache%20Airavata/ws/modules/distribution/pom.xml,>
MavenProject: org.apache.airavata:test-suite:0.6-SNAPSHOT @ <https://builds.apache.org/job/Apache%20Airavata/ws/modules/test-suite/pom.xml]>
[JENKINS] Archiving <https://builds.apache.org/job/Apache%20Airavata/ws/modules/commons/workflow-tracking/pom.xml>
to /home/hudson/hudson/jobs/Apache Airavata/modules/org.apache.airavata$airavata-workflow-tracking/builds/2012-11-14_21-12-43/archive/org.apache.airavata/airavata-workflow-tracking/0.6-SNAPSHOT/airavata-workflow-tracking-0.6-SNAPSHOT.pom
[JENKINS] Archiving <https://builds.apache.org/job/Apache%20Airavata/ws/modules/commons/workflow-tracking/target/airavata-workflow-tracking-0.6-SNAPSHOT.jar>
to /home/hudson/hudson/jobs/Apache Airavata/modules/org.apache.airavata$airavata-workflow-tracking/builds/2012-11-14_21-12-43/archive/org.apache.airavata/airavata-workflow-tracking/0.6-SNAPSHOT/airavata-workflow-tracking-0.6-SNAPSHOT.jar
[JENKINS] Archiving <https://builds.apache.org/job/Apache%20Airavata/ws/samples/complex-math-service/pom.xml>
to /home/hudson/hudson/jobs/Apache Airavata/modules/org.apache.airavata$airavata-complex-math-service/builds/2012-11-14_21-12-45/archive/org.apache.airavata/airavata-complex-math-service/0.6-SNAPSHOT/airavata-complex-math-service-0.6-SNAPSHOT.pom
[JENKINS] Archiving <https://builds.apache.org/job/Apache%20Airavata/ws/samples/simple-math-service/pom.xml>
to /home/hudson/hudson/jobs/Apache Airavata/modules/org.apache.airavata$airavata-simple-math-service/builds/2012-11-14_21-12-45/archive/org.apache.airavata/airavata-simple-math-service/0.6-SNAPSHOT/airavata-simple-math-service-0.6-SNAPSHOT.pom
[JENKINS] Archiving <https://builds.apache.org/job/Apache%20Airavata/ws/modules/distribution/pom.xml>
to /home/hudson/hudson/jobs/Apache Airavata/modules/org.apache.airavata$distribution/builds/2012-11-14_21-12-45/archive/org.apache.airavata/distribution/0.6-SNAPSHOT/distribution-0.6-SNAPSHOT.pom
[JENKINS] Archiving <https://builds.apache.org/job/Apache%20Airavata/ws/modules/registry/registry-api/pom.xml>
to /home/hudson/hudson/jobs/Apache Airavata/modules/org.apache.airavata$airavata-registry-api/builds/2012-11-14_21-12-43/archive/org.apache.airavata/airavata-registry-api/0.6-SNAPSHOT/airavata-registry-api-0.6-SNAPSHOT.pom
[JENKINS] Archiving <https://builds.apache.org/job/Apache%20Airavata/ws/modules/registry/registry-api/target/airavata-registry-api-0.6-SNAPSHOT.jar>
to /home/hudson/hudson/jobs/Apache Airavata/modules/org.apache.airavata$airavata-registry-api/builds/2012-11-14_21-12-43/archive/org.apache.airavata/airavata-registry-api/0.6-SNAPSHOT/airavata-registry-api-0.6-SNAPSHOT.jar
[JENKINS] Archiving <https://builds.apache.org/job/Apache%20Airavata/ws/modules/xbaya-gui/pom.xml>
to /home/hudson/hudson/jobs/Apache Airavata/modules/org.apache.airavata$airavata-xbaya-gui/builds/2012-11-14_21-12-43/archive/org.apache.airavata/airavata-xbaya-gui/0.6-SNAPSHOT/airavata-xbaya-gui-0.6-SNAPSHOT.pom
[JENKINS] Archiving <https://builds.apache.org/job/Apache%20Airavata/ws/modules/xbaya-gui/target/airavata-xbaya-gui-0.6-SNAPSHOT.jar>
to /home/hudson/hudson/jobs/Apache Airavata/modules/org.apache.airavata$airavata-xbaya-gui/builds/2012-11-14_21-12-43/archive/org.apache.airavata/airavata-xbaya-gui/0.6-SNAPSHOT/airavata-xbaya-gui-0.6-SNAPSHOT.jar
[JENKINS] Archiving <https://builds.apache.org/job/Apache%20Airavata/ws/modules/ws-messenger/messagebox/pom.xml>
to /home/hudson/hudson/jobs/Apache Airavata/modules/org.apache.airavata$airavata-message-box/builds/2012-11-14_21-12-43/archive/org.apache.airavata/airavata-message-box/0.6-SNAPSHOT/airavata-message-box-0.6-SNAPSHOT.pom
[JENKINS] Archiving <https://builds.apache.org/job/Apache%20Airavata/ws/modules/ws-messenger/messagebox/target/airavata-message-box-0.6-SNAPSHOT.jar>
to /home/hudson/hudson/jobs/Apache Airavata/modules/org.apache.airavata$airavata-message-box/builds/2012-11-14_21-12-43/archive/org.apache.airavata/airavata-message-box/0.6-SNAPSHOT/airavata-message-box-0.6-SNAPSHOT.jar
[JENKINS] Archiving <https://builds.apache.org/job/Apache%20Airavata/ws/modules/gfac-core/pom.xml>
to /home/hudson/hudson/jobs/Apache Airavata/modules/org.apache.airavata$airavata-gfac-core/builds/2012-11-14_21-12-42/archive/org.apache.airavata/airavata-gfac-core/0.6-SNAPSHOT/airavata-gfac-core-0.6-SNAPSHOT.pom
[JENKINS] Archiving <https://builds.apache.org/job/Apache%20Airavata/ws/modules/gfac-core/target/airavata-gfac-core-0.6-SNAPSHOT.jar>
to /home/hudson/hudson/jobs/Apache Airavata/modules/org.apache.airavata$airavata-gfac-core/builds/2012-11-14_21-12-42/archive/org.apache.airavata/airavata-gfac-core/0.6-SNAPSHOT/airavata-gfac-core-0.6-SNAPSHOT.jar
[JENKINS] Archiving <https://builds.apache.org/job/Apache%20Airavata/ws/modules/registry/airavata-registry-test/pom.xml>
to /home/hudson/hudson/jobs/Apache Airavata/modules/org.apache.airavata$airavata-registry-test/builds/2012-11-14_21-12-44/archive/org.apache.airavata/airavata-registry-test/0.6-SNAPSHOT/airavata-registry-test-0.6-SNAPSHOT.pom
[JENKINS] Archiving <https://builds.apache.org/job/Apache%20Airavata/ws/modules/registry/airavata-registry-test/target/airavata-registry-test-0.6-SNAPSHOT.jar>
to /home/hudson/hudson/jobs/Apache Airavata/modules/org.apache.airavata$airavata-registry-test/builds/2012-11-14_21-12-44/archive/org.apache.airavata/airavata-registry-test/0.6-SNAPSHOT/airavata-registry-test-0.6-SNAPSHOT.jar
[JENKINS] Archiving <https://builds.apache.org/job/Apache%20Airavata/ws/modules/commons/workflow-execution-context/pom.xml>
to /home/hudson/hudson/jobs/Apache Airavata/modules/org.apache.airavata$airavata-workflow-execution-context/builds/2012-11-14_21-12-43/archive/org.apache.airavata/airavata-workflow-execution-context/0.6-SNAPSHOT/airavata-workflow-execution-context-0.6-SNAPSHOT.pom
[JENKINS] Archiving <https://builds.apache.org/job/Apache%20Airavata/ws/modules/commons/workflow-execution-context/target/airavata-workflow-execution-context-0.6-SNAPSHOT.jar>
to /home/hudson/hudson/jobs/Apache Airavata/modules/org.apache.airavata$airavata-workflow-execution-context/builds/2012-11-14_21-12-43/archive/org.apache.airavata/airavata-workflow-execution-context/0.6-SNAPSHOT/airavata-workflow-execution-context-0.6-SNAPSHOT.jar
[JENKINS] Archiving <https://builds.apache.org/job/Apache%20Airavata/ws/modules/gfac-axis2/pom.xml>
to /home/hudson/hudson/jobs/Apache Airavata/modules/org.apache.airavata$airavata-gfac-axis2-interface/builds/2012-11-14_21-12-42/archive/org.apache.airavata/airavata-gfac-axis2-interface/0.6-SNAPSHOT/airavata-gfac-axis2-interface-0.6-SNAPSHOT.pom
[JENKINS] Archiving <https://builds.apache.org/job/Apache%20Airavata/ws/modules/gfac-axis2/target/airavata-gfac-axis2-interface-0.6-SNAPSHOT.jar>
to /home/hudson/hudson/jobs/Apache Airavata/modules/org.apache.airavata$airavata-gfac-axis2-interface/builds/2012-11-14_21-12-42/archive/org.apache.airavata/airavata-gfac-axis2-interface/0.6-SNAPSHOT/airavata-gfac-axis2-interface-0.6-SNAPSHOT.jar
[JENKINS] Archiving <https://builds.apache.org/job/Apache%20Airavata/ws/modules/commons/pom.xml>
to /home/hudson/hudson/jobs/Apache Airavata/modules/org.apache.airavata$commons/builds/2012-11-14_21-12-43/archive/org.apache.airavata/commons/0.6-SNAPSHOT/commons-0.6-SNAPSHOT.pom
[JENKINS] Archiving <https://builds.apache.org/job/Apache%20Airavata/ws/modules/registry/pom.xml>
to /home/hudson/hudson/jobs/Apache Airavata/modules/org.apache.airavata$registry/builds/2012-11-14_21-12-43/archive/org.apache.airavata/registry/0.6-SNAPSHOT/registry-0.6-SNAPSHOT.pom
[JENKINS] Archiving <https://builds.apache.org/job/Apache%20Airavata/ws/modules/ws-messenger/pom.xml>
to /home/hudson/hudson/jobs/Apache Airavata/modules/org.apache.airavata$airavata-ws-messenger/builds/2012-11-14_21-12-42/archive/org.apache.airavata/airavata-ws-messenger/0.6-SNAPSHOT/airavata-ws-messenger-0.6-SNAPSHOT.pom
[JENKINS] Archiving <https://builds.apache.org/job/Apache%20Airavata/ws/modules/airavata-rest-services/pom.xml>
to /home/hudson/hudson/jobs/Apache Airavata/modules/org.apache.airavata$airavata-rest-services/builds/2012-11-14_21-12-45/archive/org.apache.airavata/airavata-rest-services/0.6-SNAPSHOT/airavata-rest-services-0.6-SNAPSHOT.pom
[JENKINS] Archiving <https://builds.apache.org/job/Apache%20Airavata/ws/samples/levenshtein-distance-service/pom.xml>
to /home/hudson/hudson/jobs/Apache Airavata/modules/org.apache.airavata$airavata-levenshtein-distance-service/builds/2012-11-14_21-12-45/archive/org.apache.airavata/airavata-levenshtein-distance-service/0.6-SNAPSHOT/airavata-levenshtein-distance-service-0.6-SNAPSHOT.pom
[JENKINS] Archiving <https://builds.apache.org/job/Apache%20Airavata/ws/modules/registry/airavata-jpa-registry/pom.xml>
to /home/hudson/hudson/jobs/Apache Airavata/modules/org.apache.airavata$airavata-jpa-registry/builds/2012-11-14_21-12-44/archive/org.apache.airavata/airavata-jpa-registry/0.6-SNAPSHOT/airavata-jpa-registry-0.6-SNAPSHOT.pom
[JENKINS] Archiving <https://builds.apache.org/job/Apache%20Airavata/ws/modules/registry/airavata-jpa-registry/target/airavata-jpa-registry-0.6-SNAPSHOT.jar>
to /home/hudson/hudson/jobs/Apache Airavata/modules/org.apache.airavata$airavata-jpa-registry/builds/2012-11-14_21-12-44/archive/org.apache.airavata/airavata-jpa-registry/0.6-SNAPSHOT/airavata-jpa-registry-0.6-SNAPSHOT.jar
[JENKINS] Archiving <https://builds.apache.org/job/Apache%20Airavata/ws/modules/commons/utils/pom.xml>
to /home/hudson/hudson/jobs/Apache Airavata/modules/org.apache.airavata$airavata-common-utils/builds/2012-11-14_21-12-43/archive/org.apache.airavata/airavata-common-utils/0.6-SNAPSHOT/airavata-common-utils-0.6-SNAPSHOT.pom
[JENKINS] Archiving <https://builds.apache.org/job/Apache%20Airavata/ws/modules/commons/utils/target/airavata-common-utils-0.6-SNAPSHOT.jar>
to /home/hudson/hudson/jobs/Apache Airavata/modules/org.apache.airavata$airavata-common-utils/builds/2012-11-14_21-12-43/archive/org.apache.airavata/airavata-common-utils/0.6-SNAPSHOT/airavata-common-utils-0.6-SNAPSHOT.jar
[JENKINS] Archiving <https://builds.apache.org/job/Apache%20Airavata/ws/modules/airavata-client/pom.xml>
to /home/hudson/hudson/jobs/Apache Airavata/modules/org.apache.airavata$airavata-client-api/builds/2012-11-14_21-12-45/archive/org.apache.airavata/airavata-client-api/0.6-SNAPSHOT/airavata-client-api-0.6-SNAPSHOT.pom
[JENKINS] Archiving <https://builds.apache.org/job/Apache%20Airavata/ws/modules/airavata-client/target/airavata-client-api-0.6-SNAPSHOT.jar>
to /home/hudson/hudson/jobs/Apache Airavata/modules/org.apache.airavata$airavata-client-api/builds/2012-11-14_21-12-45/archive/org.apache.airavata/airavata-client-api/0.6-SNAPSHOT/airavata-client-api-0.6-SNAPSHOT.jar
[JENKINS] Archiving <https://builds.apache.org/job/Apache%20Airavata/ws/modules/ws-messenger/messagebroker/pom.xml>
to /home/hudson/hudson/jobs/Apache Airavata/modules/org.apache.airavata$airavata-message-broker/builds/2012-11-14_21-12-43/archive/org.apache.airavata/airavata-message-broker/0.6-SNAPSHOT/airavata-message-broker-0.6-SNAPSHOT.pom
[JENKINS] Archiving <https://builds.apache.org/job/Apache%20Airavata/ws/modules/ws-messenger/messagebroker/target/airavata-message-broker-0.6-SNAPSHOT.jar>
to /home/hudson/hudson/jobs/Apache Airavata/modules/org.apache.airavata$airavata-message-broker/builds/2012-11-14_21-12-43/archive/org.apache.airavata/airavata-message-broker/0.6-SNAPSHOT/airavata-message-broker-0.6-SNAPSHOT.jar
[JENKINS] Archiving <https://builds.apache.org/job/Apache%20Airavata/ws/modules/commons/gfac-schema/pom.xml>
to /home/hudson/hudson/jobs/Apache Airavata/modules/org.apache.airavata$airavata-gfac-schema-utils/builds/2012-11-14_21-12-43/archive/org.apache.airavata/airavata-gfac-schema-utils/0.6-SNAPSHOT/airavata-gfac-schema-utils-0.6-SNAPSHOT.pom
[JENKINS] Archiving <https://builds.apache.org/job/Apache%20Airavata/ws/modules/commons/gfac-schema/target/airavata-gfac-schema-utils-0.6-SNAPSHOT.jar>
to /home/hudson/hudson/jobs/Apache Airavata/modules/org.apache.airavata$airavata-gfac-schema-utils/builds/2012-11-14_21-12-43/archive/org.apache.airavata/airavata-gfac-schema-utils/0.6-SNAPSHOT/airavata-gfac-schema-utils-0.6-SNAPSHOT.jar
[JENKINS] Archiving <https://builds.apache.org/job/Apache%20Airavata/ws/modules/workflow-model/pom.xml>
to /home/hudson/hudson/jobs/Apache Airavata/modules/org.apache.airavata$airavata-workflow-model-parent/builds/2012-11-14_21-12-43/archive/org.apache.airavata/airavata-workflow-model-parent/0.6-SNAPSHOT/airavata-workflow-model-parent-0.6-SNAPSHOT.pom
[JENKINS] Archiving <https://builds.apache.org/job/Apache%20Airavata/ws/modules/registry/airavata-registry-service/pom.xml>
to /home/hudson/hudson/jobs/Apache Airavata/modules/org.apache.airavata$airavata-registry-service/builds/2012-11-14_21-12-44/archive/org.apache.airavata/airavata-registry-service/0.6-SNAPSHOT/airavata-registry-service-0.6-SNAPSHOT.pom
[JENKINS] Archiving <https://builds.apache.org/job/Apache%20Airavata/ws/modules/registry/airavata-registry-service/target/airavata-registry-service-0.6-SNAPSHOT.jar>
to /home/hudson/hudson/jobs/Apache Airavata/modules/org.apache.airavata$airavata-registry-service/builds/2012-11-14_21-12-44/archive/org.apache.airavata/airavata-registry-service/0.6-SNAPSHOT/airavata-registry-service-0.6-SNAPSHOT.jar
[JENKINS] Archiving <https://builds.apache.org/job/Apache%20Airavata/ws/modules/ws-messenger/client/pom.xml>
to /home/hudson/hudson/jobs/Apache Airavata/modules/org.apache.airavata$airavata-messenger-client/builds/2012-11-14_21-12-42/archive/org.apache.airavata/airavata-messenger-client/0.6-SNAPSHOT/airavata-messenger-client-0.6-SNAPSHOT.pom
[JENKINS] Archiving <https://builds.apache.org/job/Apache%20Airavata/ws/modules/ws-messenger/client/target/airavata-messenger-client-0.6-SNAPSHOT.jar>
to /home/hudson/hudson/jobs/Apache Airavata/modules/org.apache.airavata$airavata-messenger-client/builds/2012-11-14_21-12-42/archive/org.apache.airavata/airavata-messenger-client/0.6-SNAPSHOT/airavata-messenger-client-0.6-SNAPSHOT.jar
[JENKINS] Archiving <https://builds.apache.org/job/Apache%20Airavata/ws/modules/ws-messenger/commons/pom.xml>
to /home/hudson/hudson/jobs/Apache Airavata/modules/org.apache.airavata$airavata-messenger-commons/builds/2012-11-14_21-12-42/archive/org.apache.airavata/airavata-messenger-commons/0.6-SNAPSHOT/airavata-messenger-commons-0.6-SNAPSHOT.pom
[JENKINS] Archiving <https://builds.apache.org/job/Apache%20Airavata/ws/modules/ws-messenger/commons/target/airavata-messenger-commons-0.6-SNAPSHOT.jar>
to /home/hudson/hudson/jobs/Apache Airavata/modules/org.apache.airavata$airavata-messenger-commons/builds/2012-11-14_21-12-42/archive/org.apache.airavata/airavata-messenger-commons/0.6-SNAPSHOT/airavata-messenger-commons-0.6-SNAPSHOT.jar
[JENKINS] Archiving <https://builds.apache.org/job/Apache%20Airavata/ws/modules/workflow-model/workflow-model-core/pom.xml>
to /home/hudson/hudson/jobs/Apache Airavata/modules/org.apache.airavata$airavata-workflow-model-core/builds/2012-11-14_21-12-43/archive/org.apache.airavata/airavata-workflow-model-core/0.6-SNAPSHOT/airavata-workflow-model-core-0.6-SNAPSHOT.pom
[JENKINS] Archiving <https://builds.apache.org/job/Apache%20Airavata/ws/modules/workflow-model/workflow-model-core/target/airavata-workflow-model-core-0.6-SNAPSHOT.jar>
to /home/hudson/hudson/jobs/Apache Airavata/modules/org.apache.airavata$airavata-workflow-model-core/builds/2012-11-14_21-12-43/archive/org.apache.airavata/airavata-workflow-model-core/0.6-SNAPSHOT/airavata-workflow-model-core-0.6-SNAPSHOT.jar
[JENKINS] Archiving <https://builds.apache.org/job/Apache%20Airavata/ws/modules/test-suite/pom.xml>
to /home/hudson/hudson/jobs/Apache Airavata/modules/org.apache.airavata$test-suite/builds/2012-11-14_21-12-45/archive/org.apache.airavata/test-suite/0.6-SNAPSHOT/test-suite-0.6-SNAPSHOT.pom
[JENKINS] Archiving <https://builds.apache.org/job/Apache%20Airavata/ws/pom.xml> to
/home/hudson/hudson/jobs/Apache Airavata/modules/org.apache.airavata$airavata/builds/2012-11-14_21-12-42/archive/org.apache.airavata/airavata/0.6-SNAPSHOT/airavata-0.6-SNAPSHOT.pom
Waiting for Jenkins to finish collecting data
mavenExecutionResult exceptions not empty
message : Failed to execute goal on project airavata-rest-services: Could not resolve dependencies
for project org.apache.airavata:airavata-rest-services:war:0.6-SNAPSHOT: Could not find artifact
org.apache.airavata:airavata-security:jar:0.6-SNAPSHOT in OW2 (http://maven.ow2.org/maven2)
cause : Could not resolve dependencies for project org.apache.airavata:airavata-rest-services:war:0.6-SNAPSHOT:
Could not find artifact org.apache.airavata:airavata-security:jar:0.6-SNAPSHOT in OW2 (http://maven.ow2.org/maven2)
Stack trace : 
org.apache.maven.lifecycle.LifecycleExecutionException: Failed to execute goal on project
airavata-rest-services: Could not resolve dependencies for project org.apache.airavata:airavata-rest-services:war:0.6-SNAPSHOT:
Could not find artifact org.apache.airavata:airavata-security:jar:0.6-SNAPSHOT in OW2 (http://maven.ow2.org/maven2)
	at org.apache.maven.lifecycle.internal.LifecycleDependencyResolver.getDependencies(LifecycleDependencyResolver.java:196)
	at org.apache.maven.lifecycle.internal.LifecycleDependencyResolver.resolveProjectDependencies(LifecycleDependencyResolver.java:108)
	at org.apache.maven.lifecycle.internal.MojoExecutor.ensureDependenciesAreResolved(MojoExecutor.java:258)
	at org.apache.maven.lifecycle.internal.MojoExecutor.execute(MojoExecutor.java:201)
	at org.apache.maven.lifecycle.internal.MojoExecutor.execute(MojoExecutor.java:153)
	at org.apache.maven.lifecycle.internal.MojoExecutor.execute(MojoExecutor.java:145)
	at org.apache.maven.lifecycle.internal.LifecycleModuleBuilder.buildProject(LifecycleModuleBuilder.java:84)
	at org.apache.maven.lifecycle.internal.LifecycleModuleBuilder.buildProject(LifecycleModuleBuilder.java:59)
	at org.apache.maven.lifecycle.internal.LifecycleStarter.singleThreadedBuild(LifecycleStarter.java:183)
	at org.apache.maven.lifecycle.internal.LifecycleStarter.execute(LifecycleStarter.java:161)
	at org.apache.maven.DefaultMaven.doExecute(DefaultMaven.java:319)
	at org.apache.maven.DefaultMaven.execute(DefaultMaven.java:156)
	at org.jvnet.hudson.maven3.launcher.Maven3Launcher.main(Maven3Launcher.java:79)
	at sun.reflect.NativeMethodAccessorImpl.invoke0(Native Method)
	at sun.reflect.NativeMethodAccessorImpl.invoke(NativeMethodAccessorImpl.java:39)
	at sun.reflect.DelegatingMethodAccessorImpl.invoke(DelegatingMethodAccessorImpl.java:25)
	at java.lang.reflect.Method.invoke(Method.java:597)
	at org.codehaus.plexus.classworlds.launcher.Launcher.launchStandard(Launcher.java:329)
	at org.codehaus.plexus.classworlds.launcher.Launcher.launch(Launcher.java:239)
	at org.jvnet.hudson.maven3.agent.Maven3Main.launch(Maven3Main.java:158)
	at hudson.maven.Maven3Builder.call(Maven3Builder.java:98)
	at hudson.maven.Maven3Builder.call(Maven3Builder.java:64)
	at hudson.remoting.UserRequest.perform(UserRequest.java:118)
	at hudson.remoting.UserRequest.perform(UserRequest.java:48)
	at hudson.remoting.Request$2.run(Request.java:326)
	at hudson.remoting.InterceptingExecutorService$1.call(InterceptingExecutorService.java:72)
	at java.util.concurrent.FutureTask$Sync.innerRun(FutureTask.java:303)
	at java.util.concurrent.FutureTask.run(FutureTask.java:138)
	at java.util.concurrent.ThreadPoolExecutor$Worker.runTask(ThreadPoolExecutor.java:886)
	at java.util.concurrent.ThreadPoolExecutor$Worker.run(ThreadPoolExecutor.java:908)
	at java.lang.Thread.run(Thread.java:662)
Caused by: org.apache.maven.project.DependencyResolutionException: Could not resolve dependencies
for project org.apache.airavata:airavata-rest-services:war:0.6-SNAPSHOT: Could not find artifact
org.apache.airavata:airavata-security:jar:0.6-SNAPSHOT in OW2 (http://maven.ow2.org/maven2)
	at org.apache.maven.project.DefaultProjectDependenciesResolver.resolve(DefaultProjectDependenciesResolver.java:170)
	at org.apache.maven.lifecycle.internal.LifecycleDependencyResolver.getDependencies(LifecycleDependencyResolver.java:171)
	... 30 more
Caused by: org.sonatype.aether.resolution.DependencyResolutionException: Could not find artifact
org.apache.airavata:airavata-security:jar:0.6-SNAPSHOT in OW2 (http://maven.ow2.org/maven2)
	at org.sonatype.aether.impl.internal.DefaultRepositorySystem.resolveDependencies(DefaultRepositorySystem.java:412)
	at org.apache.maven.project.DefaultProjectDependenciesResolver.resolve(DefaultProjectDependenciesResolver.java:164)
	... 31 more
Caused by: org.sonatype.aether.resolution.ArtifactResolutionException: Could not find artifact
org.apache.airavata:airavata-security:jar:0.6-SNAPSHOT in OW2 (http://maven.ow2.org/maven2)
	at org.sonatype.aether.impl.internal.DefaultArtifactResolver.resolve(DefaultArtifactResolver.java:541)
	at org.sonatype.aether.impl.internal.DefaultArtifactResolver.resolveArtifacts(DefaultArtifactResolver.java:220)
	at org.sonatype.aether.impl.internal.DefaultRepositorySystem.resolveDependencies(DefaultRepositorySystem.java:395)
	... 32 more
Caused by: org.sonatype.aether.transfer.ArtifactNotFoundException: Could not find artifact
org.apache.airavata:airavata-security:jar:0.6-SNAPSHOT in OW2 (http://maven.ow2.org/maven2)
	at org.sonatype.aether.connector.wagon.WagonRepositoryConnector$4.wrap(WagonRepositoryConnector.java:945)
	at org.sonatype.aether.connector.wagon.WagonRepositoryConnector$4.wrap(WagonRepositoryConnector.java:940)
	at org.sonatype.aether.connector.wagon.WagonRepositoryConnector$GetTask.flush(WagonRepositoryConnector.java:695)
	at org.sonatype.aether.connector.wagon.WagonRepositoryConnector$GetTask.flush(WagonRepositoryConnector.java:689)
	at org.sonatype.aether.connector.wagon.WagonRepositoryConnector.get(WagonRepositoryConnector.java:445)
	at org.sonatype.aether.impl.internal.DefaultArtifactResolver.resolve(DefaultArtifactResolver.java:460)
	... 34 more
Sending e-mails to: dev@airavata.apache.org glahiru@gmail.com kamalasini@gmail.com
channel stopped

Mime
View raw message